Skip to content

Instantly share code, notes, and snippets.

Embed
What would you like to do?
Skiff odroid ux4 compile error
>>> skeleton-init-common Fixing libtool files
>>> skeleton-init-common Installing to target
rsync -a --ignore-times --exclude .svn --exclude .git --exclude .hg --exclude .bzr --exclude CVS --chmod=u=rwX,go=rX --exclude .empty --exclude '*~' system/skeleton/ /media/myCloudDrive/SkiffOS/workspaces/default/target/
/usr/bin/install -d -m 0755 /media/myCloudDrive/SkiffOS/workspaces/default/target/bin
/usr/bin/install -d -m 0755 /media/myCloudDrive/SkiffOS/workspaces/default/target/sbin
/usr/bin/install -d -m 0755 /media/myCloudDrive/SkiffOS/workspaces/default/target/lib
ln -snf lib /media/myCloudDrive/SkiffOS/workspaces/default/target/lib32
ln -snf lib /media/myCloudDrive/SkiffOS/workspaces/default/target/usr/lib32
/usr/bin/install -m 0644 support/misc/target-dir-warning.txt /media/myCloudDrive/SkiffOS/workspaces/default/target/THIS_IS_NOT_YOUR_ROOT_FILESYSTEM
>>> skeleton-init-sysv Extracting
>>> skeleton-init-sysv Patching
>>> skeleton-init-sysv Configuring
>>> skeleton-init-sysv Building
>>> skeleton-init-sysv Installing to target
rsync -a --ignore-times --exclude .svn --exclude .git --exclude .hg --exclude .bzr --exclude CVS --chmod=u=rwX,go=rX --exclude .empty --exclude '*~' package/skeleton-init-sysv//skeleton/ /media/myCloudDrive/SkiffOS/workspaces/default/target/
>>> skeleton Extracting
>>> skeleton Patching
>>> skeleton Configuring
>>> skeleton Building
>>> skeleton Installing to target
>>> toolchain-external-custom Extracting
>>> toolchain-external-custom Patching
>>> toolchain-external-custom Configuring
Cannot execute cross-compiler '/arm-linux-gcc'
package/pkg-generic.mk:237: recipe for target '/media/myCloudDrive/SkiffOS/workspaces/default/build/toolchain-external-custom/.stamp_configured' failed
make[3]: *** [/media/myCloudDrive/SkiffOS/workspaces/default/build/toolchain-external-custom/.stamp_configured] Error 1
Makefile:16: recipe for target '_all' failed
make[2]: *** [_all] Error 2
make[2]: Leaving directory '/media/myCloudDrive/SkiffOS/workspaces/default'
Makefile:52: recipe for target 'compile' failed
make[1]: *** [compile] Error 2
make[1]: Leaving directory '/media/myCloudDrive/SkiffOS/build'
Makefile:2: recipe for target 'compile' failed
make: *** [compile] Error 2
>>> systemd 237 Downloading
--2018-02-15 10:54:22-- https://github.com/systemd/systemd/archive/v237/systemd-237.tar.gz
Resolving github.com (github.com)... 192.30.253.113, 192.30.253.112
Connecting to github.com (github.com)|192.30.253.113|:443... connected.
HTTP request sent, awaiting response... 302 Found
Location: https://codeload.github.com/systemd/systemd/tar.gz/v237 [following]
--2018-02-15 10:54:22-- https://codeload.github.com/systemd/systemd/tar.gz/v237
Resolving codeload.github.com (codeload.github.com)... 192.30.253.120, 192.30.253.121
Connecting to codeload.github.com (codeload.github.com)|192.30.253.120|:443... connected.
HTTP request sent, awaiting response... 200 OK
Length: 6871350 (6.6M) [application/x-gzip]
Saving to: '/home/buildroot/skiff/workspaces/default/build/.systemd-237.tar.gz.RJmMul/output'
/home/buildroot/ski 100%[===================>] 6.55M 3.19MB/s in 2.1s
2018-02-15 10:54:25 (3.19 MB/s) - '/home/buildroot/skiff/workspaces/default/build/.systemd-237.tar.gz.RJmMul/output' saved [6871350/6871350]
systemd-237.tar.gz: OK (sha256: c83dabbe1c9de6b9db1dafdb7e04140c7d0535705c68842f6c0768653ba4913c)
>>> systemd 237 Extracting
gzip -d -c /home/buildroot/skiff/buildroot/dl/systemd-237.tar.gz | tar --strip-components=1 -C /home/buildroot/skiff/workspaces/default/build/systemd-237 -xf -
>>> systemd 237 Patching
Applying 0001-fix-getty-unit.patch using patch:
patching file units/getty@.service.m4
patching file units/serial-getty@.service.m4
Applying 0002-install-don-t-use-ln-relative.patch using patch:
patching file meson.build
patching file tools/meson-make-symlink.sh
patching file units/meson-add-wants.sh
Applying 0003-fix-am-path-libgcrypt-no-found.patch using patch:
patching file m4/libgcrypt.m4
>>> systemd 237 Configuring
rm -rf /home/buildroot/skiff/workspaces/default/build/systemd-237/build
mkdir -p /home/buildroot/skiff/workspaces/default/build/systemd-237/build
PATH="/home/buildroot/skiff/workspaces/default/host/bin:/home/buildroot/skiff/workspaces/default/host/sbin:/usr/local/sbin:/usr/local/bin:/usr/sbin:/usr/bin:/sbin:/bin" meson --prefix=/usr --libdir='/usr/lib' --buildtype release --cross-file /home/buildroot/skiff/workspaces/default/host/etc/meson/cross-compilation.conf -Drootlibdir='/usr/lib' -Dblkid=true -Dman=false -Dima=false -Dlibcryptsetup=false -Defi=false -Dgnu-efi=false -Dldconfig=false -Ddefault-dnssec=no -Dtests=false -Dtelinit-path=/home/buildroot/skiff/workspaces/default/target/sbin/telinit -Dkill-path=/usr/bin/kill -Dkmod-path=/usr/bin/kmod -Dkexec-path=/usr/sbin/kexec -Dsulogin-path=/usr/sbin/sulogin -Dmount-path=/usr/bin/mount -Dumount-path=/usr/bin/umount -Dacl=false -Daudit=false -Dlibidn=false -Dseccomp=false -Dxkbcommon=false -Dbzip2=true -Dlz4=true -Dpam=true -Dxz=true -Dzlib=true -Dlibcurl=true -Dgcrypt=true -Dmicrohttpd=false -Dqrencode=false -Dselinux=true -Dhwdb=true -Dbinfmt=false -Dvconsole=false -Dquotacheck=false -Dtmpfiles=true -Dsysusers=false -Dfirstboot=false -Drandomseed=false -Dbacklight=false -Drfkill=false -Dlogind=false -Dmachined=false -Dimportd=false -Dhostnamed=true -Dmyhostname=true -Dtimedated=false -Dlocaled=false -Dcoredump=false -Dpolkit=false -Dnetworkd=false -Dresolve=false -Dtimesyncd=false -Dsmack=false -Dhibernate=false -Dfallback-hostname=skiff-cb55cc9 /home/buildroot/skiff/workspaces/default/build/systemd-237 /home/buildroot/skiff/workspaces/default/build/systemd-237/build
Warning: You are using 'ANSI_X3.4-1968' which is not a Unicode-compatible locale.
You might see errors if you use UTF-8 strings as filenames, as strings, or as file contents.
Please switch to a UTF-8 locale for your platform.
The Meson build system
Version: 0.44.0
Source dir: /home/buildroot/skiff/workspaces/default/build/systemd-237
Build dir: /home/buildroot/skiff/workspaces/default/build/systemd-237/build
Build type: cross build
Project name: systemd
Native C compiler: ccache cc (gcc 5.4.0)
Cross C compiler: /home/buildroot/skiff/workspaces/default/host/bin/arm-buildroot-linux-gnueabihf-gcc (gcc 7.3.0)
Host machine cpu family: arm
Host machine cpu: cortex-a15.cortex-a7
Target machine cpu family: arm
Target machine cpu: cortex-a15.cortex-a7
Build machine cpu family: x86_64
Build machine cpu: x86_64
Program tools/meson-check-compilation.sh found: YES (/home/buildroot/skiff/workspaces/default/build/systemd-237/tools/meson-check-compilation.sh)
Program tools/meson-build.sh found: YES (/home/buildroot/skiff/workspaces/default/build/systemd-237/tools/meson-build.sh)
Compiler for C supports argument -Wextra: YES
Compiler for C supports argument -Werror=undef: YES
Compiler for C supports argument -Wlogical-op: YES
Compiler for C supports argument -Wmissing-include-dirs: YES
Compiler for C supports argument -Wold-style-definition: YES
Compiler for C supports argument -Wpointer-arith: YES
Compiler for C supports argument -Winit-self: YES
Compiler for C supports argument -Wdeclaration-after-statement: YES
Compiler for C supports argument -Wfloat-equal: YES
Compiler for C supports argument -Wsuggest-attribute=noreturn: YES
Compiler for C supports argument -Werror=missing-prototypes: YES
Compiler for C supports argument -Werror=implicit-function-declaration: YES
Compiler for C supports argument -Werror=missing-declarations: YES
Compiler for C supports argument -Werror=return-type: YES
Compiler for C supports argument -Werror=incompatible-pointer-types: YES
Compiler for C supports argument -Werror=format=2: YES
Compiler for C supports argument -Wstrict-prototypes: YES
Compiler for C supports argument -Wredundant-decls: YES
Compiler for C supports argument -Wmissing-noreturn: YES
Compiler for C supports argument -Wimplicit-fallthrough=5: YES
Compiler for C supports argument -Wshadow: YES
Compiler for C supports argument -Wendif-labels: YES
Compiler for C supports argument -Wstrict-aliasing=2: YES
Compiler for C supports argument -Wwrite-strings: YES
Compiler for C supports argument -Werror=overflow: YES
Compiler for C supports argument -Wdate-time: YES
Compiler for C supports argument -Wnested-externs: YES
Compiler for C supports argument -ffast-math: YES
Compiler for C supports argument -fno-common: YES
Compiler for C supports argument -fdiagnostics-show-option: YES
Compiler for C supports argument -fno-strict-aliasing: YES
Compiler for C supports argument -fvisibility=hidden: YES
Compiler for C supports argument -fstack-protector: YES
Compiler for C supports argument -fstack-protector-strong: YES
Compiler for C supports argument --param=ssp-buffer-size=4: YES
Compiler for C supports argument -fPIE: YES
Compiler for C supports argument -Wunused-parameter: YES
Compiler for C supports argument -Wmissing-field-initializers: YES
Compiler for C supports argument -Wunused-result: YES
Compiler for C supports argument -Wformat-signedness: YES
Compiler for C supports argument -Werror=nonnull: YES
Checking if "-Werror=shadow with local shadowing" compiles: YES
Message: Linking with -Wl,-z,relro supported: yes
Message: Linking with -Wl,-z,now supported: yes
Message: Linking with -pie supported: yes
Message: address sanitizer supported: yes
Compiler for C supports argument -ffunction-sections: YES
Compiler for C supports argument -fdata-sections: YES
Message: Linking with -Wl,--gc-sections supported: yes
Checking for size of "pid_t": 4
Checking for size of "uid_t": 4
Checking for size of "gid_t": 4
Checking for size of "dev_t": 8
Checking for size of "ino_t": 8
Checking for size of "time_t": 4
Checking for size of "rlim_t": 8
Checking for size of "char16_t": 2
Checking for size of "char32_t": 4
Checking for size of "key_serial_t": -1
Checking for size of "struct ethtool_link_settings": 48
Checking for size of "struct fib_rule_uid_range": 8
Header <linux/if_link.h> has symbol "IFLA_INET6_ADDR_GEN_MODE": YES
Header <linux/if_link.h> has symbol "IN6_ADDR_GEN_MODE_STABLE_PRIVACY": YES
Header <linux/if_link.h> has symbol "IFLA_VRF_TABLE": YES
Header <linux/if_link.h> has symbol "IFLA_MACVLAN_FLAGS": YES
Header <linux/if_link.h> has symbol "IFLA_IPVLAN_FLAGS": NO
Header <linux/if_link.h> has symbol "IFLA_PHYS_PORT_ID": YES
Header <linux/if_link.h> has symbol "IFLA_BOND_AD_INFO": YES
Header <linux/if_link.h> has symbol "IFLA_VLAN_PROTOCOL": YES
Header <linux/if_link.h> has symbol "IFLA_VXLAN_REMCSUM_NOPARTIAL": YES
Header <linux/if_link.h> has symbol "IFLA_VXLAN_GPE": YES
Header <linux/if_link.h> has symbol "IFLA_GENEVE_LABEL": YES
Header <linux/if_tunnel.h> has symbol "IFLA_VTI_REMOTE": YES
Header <linux/if_tunnel.h> has symbol "IFLA_IPTUN_ENCAP_DPORT": YES
Header <linux/if_tunnel.h> has symbol "IFLA_GRE_ENCAP_DPORT": YES
Header <linux/if_bridge.h> has symbol "IFLA_BRIDGE_VLAN_INFO": YES
Header <linux/if_link.h> has symbol "IFLA_BRPORT_PROXYARP": YES
Header <linux/if_link.h> has symbol "IFLA_BRPORT_LEARNING_SYNC": YES
Header <linux/if_link.h> has symbol "IFLA_BR_VLAN_DEFAULT_PVID": YES
Header <linux/if_link.h> has symbol "IPVLAN_F_PRIVATE": NO
Header <linux/neighbour.h> has symbol "NDA_IFINDEX": YES
Header <linux/if_addr.h> has symbol "IFA_FLAGS": YES
Header <linux/fib_rules.h> has symbol "FRA_UID_RANGE": YES
Header <linux/loop.h> has symbol "LO_FLAGS_PARTSCAN": YES
Header <linux/can/vxcan.h> has symbol "VXCAN_INFO_PEER": YES
Checking for function "secure_getenv": YES
Checking for function "__secure_getenv": NO
Checking for function "memfd_create": NO
Checking for function "gettid": NO
Checking for function "pivot_root": NO
Checking for function "name_to_handle_at": YES
Checking for function "setns": YES
Checking for function "renameat2": NO
Checking for function "kcmp": NO
Checking for function "keyctl": NO
Checking for function "copy_file_range": NO
Checking for function "bpf": NO
Checking for function "explicit_bzero": YES
Checking for function "getrandom": YES
Program sed found: YES (/bin/sed)
Program awk found: YES (/usr/bin/awk)
Program m4 found: YES (/home/buildroot/skiff/workspaces/default/host/bin/m4)
Program stat found: YES (/usr/bin/stat)
Program git found: YES (/usr/bin/git)
Program env found: YES (/usr/bin/env)
Program test/test-efi-create-disk.sh found: YES (/home/buildroot/skiff/workspaces/default/build/systemd-237/test/test-efi-create-disk.sh)
Program quotaon found: NO
Program /usr/sbin/quotaon found: NO
Program /sbin/quotaon found: NO
Program nonexistingprogram found: NO
Program quotacheck found: NO
Program /usr/sbin/quotacheck found: NO
Program /sbin/quotacheck found: NO
Program nonexistingprogram found: NO
Message: Using /usr/bin/kill for kill
Message: Using /usr/bin/kmod for kmod
Message: Using /usr/sbin/kexec for kexec
Message: Using /usr/sbin/sulogin for sulogin
Message: Using /usr/bin/mount for mount
Message: Using /usr/bin/umount for umount
Program loadkeys found: NO
Program /usr/sbin/loadkeys found: NO
Program /sbin/loadkeys found: NO
Program nonexistingprogram found: NO
Program setfont found: NO
Program /usr/sbin/setfont found: NO
Program /sbin/setfont found: NO
Program nonexistingprogram found: NO
Program gperf found: YES (/home/buildroot/skiff/workspaces/default/host/bin/gperf)
Message: gperf len type is size_t
Has header "sys/capability.h": YES
Has header "crypt.h": YES
Has header "linux/btrfs.h": YES
Has header "linux/memfd.h": YES
Has header "linux/vm_sockets.h": YES
Has header "sys/auxv.h": YES
Has header "valgrind/memcheck.h": NO
Has header "valgrind/valgrind.h": NO
Message: maximum system UID is 999
Message: maximum system GID is 999
Message: WARNING:
The local group with the GID 65534 does not match the configured group name "nobody" of the nobody group (its name is nogroup).
Your build will result in an group table setup that is incompatible with the local system.
Dependency threads found: YES
Library rt found: YES
Library m found: YES
Library dl found: YES
Library crypt found: YES
Cross dependency libcap found: YES 2.25
Cross dependency mount found: YES 2.31.1
Cross dependency libselinux found: YES 2.7
Dependency libapparmor found: NO
Cross dependency blkid found: YES 2.31.1
Cross dependency libkmod found: YES 24
Library pam found: YES
Library pam_misc found: YES
Cross dependency libcurl found: YES 7.58.0
Dependency libidn2 found: NO
Dependency libiptc found: NO
Library gcrypt found: YES
Library gpg-error found: YES
Dependency gnutls found: NO
Dependency libdw found: NO
Cross dependency zlib found: YES 1.2.11
Library bz2 found: YES
Cross dependency liblzma found: YES 5.2.3
Cross dependency liblz4 found: YES 1.7.5
Dependency libpcre2-8 found: NO
Dependency glib-2.0 found: NO
Dependency gobject-2.0 found: NO
Dependency gio-2.0 found: NO
Dependency dbus-1 found: NO
Configuring config.h using configuration
Program sh found: YES (/bin/sh)
Program c++ found: YES (/usr/bin/c++)
Program generate-gperfs.py found: YES (/home/buildroot/skiff/workspaces/default/build/systemd-237/src/basic/generate-gperfs.py)
Program generate-af-list.sh found: YES (/home/buildroot/skiff/workspaces/default/build/systemd-237/src/basic/generate-af-list.sh)
Program generate-arphrd-list.sh found: YES (/home/buildroot/skiff/workspaces/default/build/systemd-237/src/basic/generate-arphrd-list.sh)
Program generate-cap-list.sh found: YES (/home/buildroot/skiff/workspaces/default/build/systemd-237/src/basic/generate-cap-list.sh)
Program generate-errno-list.sh found: YES (/home/buildroot/skiff/workspaces/default/build/systemd-237/src/basic/generate-errno-list.sh)
Program generate-socket-protocol-list.sh found: YES (/home/buildroot/skiff/workspaces/default/build/systemd-237/src/basic/generate-socket-protocol-list.sh)
Configuring libsystemd.pc using configuration
Program generate-audit_type-list.sh found: YES (/home/buildroot/skiff/workspaces/default/build/systemd-237/src/journal/generate-audit_type-list.sh)
Program sh found: YES (/bin/sh)
Configuring libudev.pc using configuration
Configuring macros.systemd using configuration
Configuring triggers.systemd using configuration
Configuring systemd.pc using configuration
Configuring org.freedesktop.systemd1.policy.in using configuration
Program sh found: YES (/bin/sh)
Program generate-keyboard-keys-list.sh found: YES (/home/buildroot/skiff/workspaces/default/build/systemd-237/src/udev/generate-keyboard-keys-list.sh)
Program generate-keyboard-keys-gperf.sh found: YES (/home/buildroot/skiff/workspaces/default/build/systemd-237/src/udev/generate-keyboard-keys-gperf.sh)
Configuring udev.pc using configuration
Program sh found: YES (/bin/sh)
Configuring journal-upload.conf using configuration
Program sh found: YES (/bin/sh)
Program generate-dns_type-gperf.py found: YES (/home/buildroot/skiff/workspaces/default/build/systemd-237/src/resolve/generate-dns_type-gperf.py)
Program generate-sym-test.py found: YES (/home/buildroot/skiff/workspaces/default/build/systemd-237/src/test/generate-sym-test.py)
Program test-systemd-tmpfiles.py found: YES (/home/buildroot/skiff/workspaces/default/build/systemd-237/src/test/test-systemd-tmpfiles.py)
Configuring 50-udev-default.rules using configuration
Configuring 64-btrfs.rules using configuration
Configuring 99-systemd.rules using configuration
Program rule-syntax-check.py found: YES (/home/buildroot/skiff/workspaces/default/build/systemd-237/test/rule-syntax-check.py)
Program sysv-generator-test.py found: YES (/home/buildroot/skiff/workspaces/default/build/systemd-237/test/sysv-generator-test.py)
Program sys-script.py found: YES (/home/buildroot/skiff/workspaces/default/build/systemd-237/test/sys-script.py)
Program udev-test.pl found: YES (/home/buildroot/skiff/workspaces/default/build/systemd-237/test/udev-test.pl)
Program hwdb-test.sh found: YES (/home/buildroot/skiff/workspaces/default/build/systemd-237/test/hwdb-test.sh)
Program sh found: YES (/bin/sh)
Program /home/buildroot/skiff/workspaces/default/build/systemd-237/tools/meson-make-symlink.sh found: YES (/home/buildroot/skiff/workspaces/default/build/systemd-237/tools/meson-make-symlink.sh)
Message: Not compiling test-coredump-vacuum because tests is set to false
Message: Not compiling test-qcow2 because tests is set to false
Message: Not compiling test-keymap-util because tests is set to false
Message: Not compiling test-machine-tables because tests is set to false
Message: Not compiling test-patch-uid because tests is set to false
Message: Not compiling test-resolve-tables because tests is set to false
Message: Not compiling test-dns-packet because tests is set to false
Message: Not compiling test-resolved-packet because tests is set to false
Message: Not compiling test-dnssec because tests is set to false
Message: Not compiling test-dnssec-complex because tests is set to false
Message: Not compiling test-timesync because tests is set to false
Message: Not compiling test-device-nodes because tests is set to false
Message: Not compiling test-engine because tests is set to false
Message: Not compiling test-job-type because tests is set to false
Message: Not compiling test-ns because tests is set to false
Message: Not compiling test-loopback because tests is set to false
Message: Not compiling test-hostname because tests is set to false
Message: Not compiling test-dns-domain because tests is set to false
Message: Not compiling test-boot-timestamps because tests is set to false
Message: Not compiling test-unit-name because tests is set to false
Message: Not compiling test-unit-file because tests is set to false
Message: Not compiling test-utf8 because tests is set to false
Message: Not compiling test-capability because tests is set to false
Message: Not compiling test-async because tests is set to false
Message: Not compiling test-locale-util because tests is set to false
Message: Not compiling test-copy because tests is set to false
Message: Not compiling test-sigbus because tests is set to false
Message: Not compiling test-condition because tests is set to false
Message: Not compiling test-fdset because tests is set to false
Message: Not compiling test-fstab-util because tests is set to false
Message: Not compiling test-random-util because tests is set to false
Message: Not compiling test-ratelimit because tests is set to false
Message: Not compiling test-util because tests is set to false
Message: Not compiling test-mount-util because tests is set to false
Message: Not compiling test-exec-util because tests is set to false
Message: Not compiling test-hexdecoct because tests is set to false
Message: Not compiling test-alloc-util because tests is set to false
Message: Not compiling test-xattr-util because tests is set to false
Message: Not compiling test-io-util because tests is set to false
Message: Not compiling test-glob-util because tests is set to false
Message: Not compiling test-fs-util because tests is set to false
Message: Not compiling test-proc-cmdline because tests is set to false
Message: Not compiling test-fd-util because tests is set to false
Message: Not compiling test-web-util because tests is set to false
Message: Not compiling test-cpu-set-util because tests is set to false
Message: Not compiling test-stat-util because tests is set to false
Message: Not compiling test-escape because tests is set to false
Message: Not compiling test-specifier because tests is set to false
Message: Not compiling test-string-util because tests is set to false
Message: Not compiling test-extract-word because tests is set to false
Message: Not compiling test-parse-util because tests is set to false
Message: Not compiling test-user-util because tests is set to false
Message: Not compiling test-hostname-util because tests is set to false
Message: Not compiling test-process-util because tests is set to false
Message: Not compiling test-terminal-util because tests is set to false
Message: Not compiling test-path-lookup because tests is set to false
Message: Not compiling test-uid-range because tests is set to false
Message: Not compiling test-cap-list because tests is set to false
Message: Not compiling test-socket-util because tests is set to false
Message: Not compiling test-in-addr-util because tests is set to false
Message: Not compiling test-barrier because tests is set to false
Message: Not compiling test-tmpfiles because tests is set to false
Message: Not compiling test-namespace because tests is set to false
Message: Not compiling test-verbs because tests is set to false
Message: Not compiling test-install-root because tests is set to false
Message: Not compiling test-acl-util because tests is set to false
Message: Not compiling test-seccomp because tests is set to false
Message: Not compiling test-rlimit-util because tests is set to false
Message: Not compiling test-ask-password-api because tests is set to false
Message: Not compiling test-dissect-image because tests is set to false
Message: Not compiling test-signal-util because tests is set to false
Message: Not compiling test-selinux because tests is set to false
Message: Not compiling test-sizeof because tests is set to false
Message: Not compiling test-bpf because tests is set to false
Message: Not compiling test-watch-pid because tests is set to false
Message: Not compiling test-hashmap because tests is set to false
Message: Not compiling test-set because tests is set to false
Message: Not compiling test-bitmap because tests is set to false
Message: Not compiling test-xml because tests is set to false
Message: Not compiling test-list because tests is set to false
Message: Not compiling test-procfs-util because tests is set to false
Message: Not compiling test-unaligned because tests is set to false
Message: Not compiling test-tables because tests is set to false
Message: Not compiling test-prioq because tests is set to false
Message: Not compiling test-fileio because tests is set to false
Message: Not compiling test-time-util because tests is set to false
Message: Not compiling test-clock because tests is set to false
Message: Not compiling test-architecture because tests is set to false
Message: Not compiling test-log because tests is set to false
Message: Not compiling test-ipcrm because tests is set to false
Message: Not compiling test-btrfs because tests is set to false
Message: Not compiling test-firewall-util because tests is set to false
Message: Not compiling test-netlink-manual because tests is set to false
Message: Not compiling test-ellipsize because tests is set to false
Message: Not compiling test-date because tests is set to false
Message: Not compiling test-sleep because tests is set to false
Message: Not compiling test-replace-var because tests is set to false
Message: Not compiling test-calendarspec because tests is set to false
Message: Not compiling test-strip-tab-ansi because tests is set to false
Message: Not compiling test-daemon because tests is set to false
Message: Not compiling test-cgroup because tests is set to false
Message: Not compiling test-cgroup-mask because tests is set to false
Message: Not compiling test-cgroup-util because tests is set to false
Message: Not compiling test-env-util because tests is set to false
Message: Not compiling test-strbuf because tests is set to false
Message: Not compiling test-strv because tests is set to false
Message: Not compiling test-path-util because tests is set to false
Message: Not compiling test-path because tests is set to false
Message: Not compiling test-execute because tests is set to false
Message: Not compiling test-siphash24 because tests is set to false
Message: Not compiling test-strxcpyx because tests is set to false
Message: Not compiling test-install because tests is set to false
Message: Not compiling test-watchdog because tests is set to false
Message: Not compiling test-sched-prio because tests is set to false
Message: Not compiling test-conf-files because tests is set to false
Message: Not compiling test-conf-parser because tests is set to false
Message: Not compiling test-af-list because tests is set to false
Message: Not compiling test-arphrd-list because tests is set to false
Message: Not compiling test-journal-importer because tests is set to false
Message: Not compiling test-libudev because tests is set to false
Message: Not compiling test-udev because tests is set to false
Message: Not compiling test-id128 because tests is set to false
Message: Not compiling test-hash because tests is set to false
Message: Not compiling test-nss because tests is set to false
Message: Not compiling test-journal because tests is set to false
Message: Not compiling test-journal-send because tests is set to false
Message: Not compiling test-journal-syslog because tests is set to false
Message: Not compiling test-journal-match because tests is set to false
Message: Not compiling test-journal-enum because tests is set to false
Message: Not compiling test-journal-stream because tests is set to false
Message: Not compiling test-journal-flush because tests is set to false
Message: Not compiling test-journal-init because tests is set to false
Message: Not compiling test-journal-verify because tests is set to false
Message: Not compiling test-journal-interleaving because tests is set to false
Message: Not compiling test-mmap-cache because tests is set to false
Message: Not compiling test-catalog because tests is set to false
Message: Not compiling test-compress because tests is set to false
Message: Not compiling test-compress-benchmark because tests is set to false
Message: Not compiling test-audit-type because tests is set to false
Message: Not compiling test-bus-marshal because tests is set to false
Message: Not compiling test-bus-signature because tests is set to false
Message: Not compiling test-bus-watch-bind because tests is set to false
Message: Not compiling test-bus-chat because tests is set to false
Message: Not compiling test-bus-cleanup because tests is set to false
Message: Not compiling test-bus-error because tests is set to false
Message: Not compiling test-bus-track because tests is set to false
Message: Not compiling test-bus-server because tests is set to false
Message: Not compiling test-bus-objects because tests is set to false
Message: Not compiling test-bus-vtable because tests is set to false
Message: Not compiling test-bus-gvariant because tests is set to false
Message: Not compiling test-bus-creds because tests is set to false
Message: Not compiling test-bus-match because tests is set to false
Message: Not compiling test-bus-benchmark because tests is set to false
Message: Not compiling test-bus-introspect because tests is set to false
Message: Not compiling test-event because tests is set to false
Message: Not compiling test-netlink because tests is set to false
Message: Not compiling test-local-addresses because tests is set to false
Message: Not compiling test-resolve because tests is set to false
Message: Not compiling test-login because tests is set to false
Message: Not compiling test-bus-vtable-cc because tests is set to false
Message: Not compiling test-dhcp-option because tests is set to false
Message: Not compiling test-sd-dhcp-lease because tests is set to false
Message: Not compiling test-dhcp-client because tests is set to false
Message: Not compiling test-dhcp-server because tests is set to false
Message: Not compiling test-ipv4ll because tests is set to false
Message: Not compiling test-ipv4ll-manual because tests is set to false
Message: Not compiling test-acd because tests is set to false
Message: Not compiling test-ndisc-rs because tests is set to false
Message: Not compiling test-ndisc-ra because tests is set to false
Message: Not compiling test-dhcp6-client because tests is set to false
Message: Not compiling test-lldp because tests is set to false
Message: Not compiling test-login-shared because tests is set to false
Message: Not compiling test-inhibit because tests is set to false
Message: Not compiling test-login-tables because tests is set to false
Program tools/make-directive-index.py found: YES (/home/buildroot/skiff/workspaces/default/build/systemd-237/tools/make-directive-index.py)
Program tools/make-man-index.py found: YES (/home/buildroot/skiff/workspaces/default/build/systemd-237/tools/make-man-index.py)
Program tools/xml_helper.py found: YES (/home/buildroot/skiff/workspaces/default/build/systemd-237/tools/xml_helper.py)
Program tools/meson-hwdb-update.sh found: YES (/home/buildroot/skiff/workspaces/default/build/systemd-237/tools/meson-hwdb-update.sh)
Configuring console-getty.service.m4 using configuration
Configuring container-getty@.service.m4 using configuration
Configuring debug-shell.service.tmp using configuration
Configuring emergency.service.tmp using configuration
Configuring halt-local.service.tmp using configuration
Configuring initrd-cleanup.service.tmp using configuration
Configuring initrd-parse-etc.service.tmp using configuration
Configuring initrd-switch-root.service.tmp using configuration
Configuring initrd-udevadm-cleanup-db.service.tmp using configuration
Configuring kmod-static-nodes.service.tmp using configuration
Program meson-add-wants.sh found: YES (/home/buildroot/skiff/workspaces/default/build/systemd-237/units/meson-add-wants.sh)
Configuring quotaon.service.tmp using configuration
Configuring rc-local.service.tmp using configuration
Configuring rescue.service.tmp using configuration
Configuring system-update-cleanup.service.tmp using configuration
Configuring systemd-ask-password-console.service.tmp using configuration
Configuring systemd-ask-password-wall.service.tmp using configuration
Configuring systemd-backlight@.service.tmp using configuration
Configuring systemd-binfmt.service.tmp using configuration
Configuring systemd-coredump@.service.tmp using configuration
Configuring systemd-exit.service.tmp using configuration
Configuring systemd-firstboot.service.tmp using configuration
Configuring systemd-fsck-root.service.tmp using configuration
Configuring systemd-fsck@.service.tmp using configuration
Configuring systemd-halt.service.tmp using configuration
Configuring systemd-hibernate-resume@.service.tmp using configuration
Configuring systemd-hibernate.service.tmp using configuration
Configuring systemd-hybrid-sleep.service.tmp using configuration
Configuring systemd-hostnamed.service.tmp using configuration
Configuring systemd-hwdb-update.service.tmp using configuration
Configuring systemd-importd.service.tmp using configuration
Configuring systemd-initctl.service.tmp using configuration
Configuring systemd-journal-catalog-update.service.tmp using configuration
Configuring systemd-journal-flush.service.tmp using configuration
Configuring systemd-journal-gatewayd.service.tmp using configuration
Configuring systemd-journal-remote.service.tmp using configuration
Configuring systemd-journal-upload.service.tmp using configuration
Configuring systemd-journald.service.tmp using configuration
Configuring systemd-kexec.service.tmp using configuration
Configuring systemd-localed.service.tmp using configuration
Configuring systemd-logind.service.tmp using configuration
Configuring systemd-machine-id-commit.service.tmp using configuration
Configuring systemd-machined.service.tmp using configuration
Configuring systemd-modules-load.service.tmp using configuration
Configuring systemd-networkd.service.tmp using configuration
Configuring systemd-networkd-wait-online.service.tmp using configuration
Configuring systemd-nspawn@.service.tmp using configuration
Configuring systemd-poweroff.service.tmp using configuration
Configuring systemd-quotacheck.service.tmp using configuration
Configuring systemd-random-seed.service.tmp using configuration
Configuring systemd-reboot.service.tmp using configuration
Configuring systemd-remount-fs.service.tmp using configuration
Configuring systemd-resolved.service.tmp using configuration
Configuring systemd-rfkill.service.tmp using configuration
Configuring systemd-suspend.service.tmp using configuration
Configuring systemd-sysctl.service.tmp using configuration
Configuring systemd-sysusers.service.tmp using configuration
Configuring systemd-timedated.service.tmp using configuration
Configuring systemd-timesyncd.service.tmp using configuration
Configuring systemd-tmpfiles-clean.service.tmp using configuration
Configuring systemd-tmpfiles-setup-dev.service.tmp using configuration
Configuring systemd-tmpfiles-setup.service.tmp using configuration
Configuring systemd-udev-settle.service.tmp using configuration
Configuring systemd-udev-trigger.service.tmp using configuration
Configuring systemd-udevd.service.tmp using configuration
Configuring systemd-update-done.service.tmp using configuration
Configuring systemd-update-utmp-runlevel.service.tmp using configuration
Configuring systemd-update-utmp.service.tmp using configuration
Configuring systemd-user-sessions.service.tmp using configuration
Configuring systemd-vconsole-setup.service.tmp using configuration
Configuring systemd-volatile-root.service.tmp using configuration
Configuring user@.service.tmp using configuration
Program /home/buildroot/skiff/workspaces/default/build/systemd-237/tools/meson-make-symlink.sh found: YES (/home/buildroot/skiff/workspaces/default/build/systemd-237/tools/meson-make-symlink.sh)
Program sh found: YES (/bin/sh)
Configuring systemd-exit.service using configuration
Configuring systemd-tmpfiles-clean.service using configuration
Configuring systemd-tmpfiles-setup.service using configuration
Program sh found: YES (/bin/sh)
Configuring basic.conf using configuration
Program sh found: YES (/bin/sh)
Program sh found: YES (/bin/sh)
Program parse_hwdb.py found: YES (/home/buildroot/skiff/workspaces/default/build/systemd-237/hwdb/parse_hwdb.py)
Program xsltproc found: NO
Program nonexistingprogram found: NO
Configuring custom-entities.ent using configuration
Message: python-lxml not available, not making man page indices
Dependency bash-completion found: NO
Message: bash completions: /usr/share/bash-completion/completions
Configuring systemctl using configuration
Message: zsh completions: /usr/share/zsh/site-functions
Configuring _systemctl using configuration
Configuring README using configuration
Configuring README using configuration
Program tools/meson-check-help.sh found: YES (/home/buildroot/skiff/workspaces/default/build/systemd-237/tools/meson-check-help.sh)
Message: Not compiling fuzz-dns-packet:address because tests is set to false
Program tools/meson-git-contrib.sh found: YES (/home/buildroot/skiff/workspaces/default/build/systemd-237/tools/meson-git-contrib.sh)
Program tools/meson-check-api-docs.sh found: YES (/home/buildroot/skiff/workspaces/default/build/systemd-237/tools/meson-check-api-docs.sh)
Message: systemd 237
prefix directory: /usr
rootprefix directory: /usr
sysconf directory: /etc
include directory: /usr/include
lib directory: /usr/lib
rootlib directory: /usr/lib
SysV init scripts: /etc/init.d
SysV rc?.d directories: /etc/rc.d
PAM modules directory: /usr/lib/security
PAM configuration directory: /etc/pam.d
RPM macros directory: /usr/lib/rpm/macros.d
modprobe.d directory: /usr/lib/modprobe.d
D-Bus policy directory: /usr/share/dbus-1/system.d
D-Bus session directory: /usr/share/dbus-1/services
D-Bus system directory: /usr/share/dbus-1/system-services
bash completions directory: /usr/share/bash-completion/completions
zsh completions directory: /usr/share/zsh/site-functions
extra start script: /etc/rc.local
extra stop script: /usr/sbin/halt.local
debug shell: /bin/sh @ /dev/tty9
TTY GID: 5
users GID: -
maximum system UID: 999
maximum system GID: 999
minimum dynamic UID: 61184
maximum dynamic UID: 65519
minimum container UID base: 524288
maximum container UID base: 1878982656
/dev/kvm access mode: 0666
render group access mode: 0666
certificate root directory: /etc/ssl
support URL: https://lists.freedesktop.org/mailman/listinfo/systemd-devel
nobody user name: nobody
nobody group name: nobody
fallback hostname: skiff-cb55cc9
symbolic gateway hostnames: _gateway
default DNSSEC mode: no
default cgroup hierarchy: hybrid
default KillUserProcesses setting: true
default DNS servers: 8.8.8.8
8.8.4.4
2001:4860:4860::8888
2001:4860:4860::8844
default NTP servers: time1.google.com
time2.google.com
time3.google.com
time4.google.com
time epoch: 1517155097 (2018-01-28T15:58:17+00:00)
enabled features: PAM, SELinux, zlib, xz, lz4, bzip2, gcrypt, libcurl, idn, nss-systemd, tmpfiles, environment.d, hostnamed, kmod, blkid, nss-myhostname, hwdb, tpm, SysV compat, utmp, adm group, wheel group, gshadow
disabled features: libcryptsetup, AUDIT, IMA, AppArmor, SECCOMP, SMACK, ACL, qrencode, microhttpd, gnutls, libidn2, libidn, libiptc, elfutils, binfmt, vconsole, quotacheck, sysusers, firstboot, randomseed, backlight, rfkill, logind, machined, importd, timedated, timesyncd, localed, networkd, resolve, coredump, polkit, legacy pkla, efi, gnu-efi, xkbcommon, pcre2, dbus, glib, man pages, html pages, man page indices, split /usr, ldconfig, hibernate, debug hashmap, debug mmap cache
Build targets in project: 237
Found ninja-1.8.2 at /home/buildroot/skiff/workspaces/default/host/bin/ninja
>>> systemd 237 Building
PATH="/home/buildroot/skiff/workspaces/default/host/bin:/home/buildroot/skiff/workspaces/default/host/sbin:/usr/local/sbin:/usr/local/bin:/usr/sbin:/usr/bin:/sbin:/bin" ninja -j5 -C /home/buildroot/skiff/workspaces/default/build/systemd-237/build
ninja: Entering directory `/home/buildroot/skiff/workspaces/default/build/systemd-237/build'
[1/652] Generating systemd.be@latin.catalog with a meson_exe.py custom command.
FAILED: catalog/systemd.be@latin.catalog
/home/buildroot/skiff/workspaces/default/host/bin/python3 /home/buildroot/skiff/workspaces/default/host/bin/meson --internal exe /home/buildroot/skiff/workspaces/default/build/systemd-237/build/meson-private/meson_exe_sed_ca74bc0f64f3499a709d0a5e79683577824a66c6.dat
Warning: You are using 'ANSI_X3.4-1968' which is not a Unicode-compatible locale.
You might see errors if you use UTF-8 strings as filenames, as strings, or as file contents.
Please switch to a UTF-8 locale for your platform.
Traceback (most recent call last):
File "/home/buildroot/skiff/workspaces/default/host/bin/meson", line 37, in <module>
sys.exit(main())
File "/home/buildroot/skiff/workspaces/default/host/bin/meson", line 34, in main
return mesonmain.run(sys.argv[1:], launcher)
File "/home/buildroot/skiff/workspaces/default/host/lib/python3.6/site-packages/mesonbuild/mesonmain.py", line 322, in run
sys.exit(run_script_command(args[1:]))
File "/home/buildroot/skiff/workspaces/default/host/lib/python3.6/site-packages/mesonbuild/mesonmain.py", line 278, in run_script_command
return cmdfunc(cmdargs)
File "/home/buildroot/skiff/workspaces/default/host/lib/python3.6/site-packages/mesonbuild/scripts/meson_exe.py", line 76, in run
return run_exe(exe)
File "/home/buildroot/skiff/workspaces/default/host/lib/python3.6/site-packages/mesonbuild/scripts/meson_exe.py", line 59, in run_exe
p, stdout, stderr = Popen_safe(cmd + exe.cmd_args, env=child_env, cwd=exe.workdir)
File "/home/buildroot/skiff/workspaces/default/host/lib/python3.6/site-packages/mesonbuild/mesonlib.py", line 642, in Popen_safe
o, e = p.communicate(write)
File "/home/buildroot/skiff/workspaces/default/host/lib/python3.6/subprocess.py", line 843, in communicate
stdout, stderr = self._communicate(input, endtime, timeout)
File "/home/buildroot/skiff/workspaces/default/host/lib/python3.6/subprocess.py", line 1554, in _communicate
self.stdout.errors)
File "/home/buildroot/skiff/workspaces/default/host/lib/python3.6/subprocess.py", line 740, in _translate_newlines
data = data.decode(encoding, errors)
UnicodeDecodeError: 'ascii' codec can't decode byte 0xc5 in position 144: ordinal not in range(128)
[2/652] Generating systemd.be.catalog with a meson_exe.py custom command.
FAILED: catalog/systemd.be.catalog
/home/buildroot/skiff/workspaces/default/host/bin/python3 /home/buildroot/skiff/workspaces/default/host/bin/meson --internal exe /home/buildroot/skiff/workspaces/default/build/systemd-237/build/meson-private/meson_exe_sed_ffe63b9f9efeae083a8766e8cbe9ed2a6c0c1b2e.dat
Warning: You are using 'ANSI_X3.4-1968' which is not a Unicode-compatible locale.
You might see errors if you use UTF-8 strings as filenames, as strings, or as file contents.
Please switch to a UTF-8 locale for your platform.
Traceback (most recent call last):
File "/home/buildroot/skiff/workspaces/default/host/bin/meson", line 37, in <module>
sys.exit(main())
File "/home/buildroot/skiff/workspaces/default/host/bin/meson", line 34, in main
return mesonmain.run(sys.argv[1:], launcher)
File "/home/buildroot/skiff/workspaces/default/host/lib/python3.6/site-packages/mesonbuild/mesonmain.py", line 322, in run
sys.exit(run_script_command(args[1:]))
File "/home/buildroot/skiff/workspaces/default/host/lib/python3.6/site-packages/mesonbuild/mesonmain.py", line 278, in run_script_command
return cmdfunc(cmdargs)
File "/home/buildroot/skiff/workspaces/default/host/lib/python3.6/site-packages/mesonbuild/scripts/meson_exe.py", line 76, in run
return run_exe(exe)
File "/home/buildroot/skiff/workspaces/default/host/lib/python3.6/site-packages/mesonbuild/scripts/meson_exe.py", line 59, in run_exe
p, stdout, stderr = Popen_safe(cmd + exe.cmd_args, env=child_env, cwd=exe.workdir)
File "/home/buildroot/skiff/workspaces/default/host/lib/python3.6/site-packages/mesonbuild/mesonlib.py", line 642, in Popen_safe
o, e = p.communicate(write)
File "/home/buildroot/skiff/workspaces/default/host/lib/python3.6/subprocess.py", line 843, in communicate
stdout, stderr = self._communicate(input, endtime, timeout)
File "/home/buildroot/skiff/workspaces/default/host/lib/python3.6/subprocess.py", line 1554, in _communicate
self.stdout.errors)
File "/home/buildroot/skiff/workspaces/default/host/lib/python3.6/subprocess.py", line 740, in _translate_newlines
data = data.decode(encoding, errors)
UnicodeDecodeError: 'ascii' codec can't decode byte 0xc5 in position 144: ordinal not in range(128)
[3/652] Generating systemd.de.catalog with a meson_exe.py custom command.
FAILED: catalog/systemd.de.catalog
/home/buildroot/skiff/workspaces/default/host/bin/python3 /home/buildroot/skiff/workspaces/default/host/bin/meson --internal exe /home/buildroot/skiff/workspaces/default/build/systemd-237/build/meson-private/meson_exe_sed_dd37fa760e7b8b68d9497735833b11330f32afd1.dat
Warning: You are using 'ANSI_X3.4-1968' which is not a Unicode-compatible locale.
You might see errors if you use UTF-8 strings as filenames, as strings, or as file contents.
Please switch to a UTF-8 locale for your platform.
Traceback (most recent call last):
File "/home/buildroot/skiff/workspaces/default/host/bin/meson", line 37, in <module>
sys.exit(main())
File "/home/buildroot/skiff/workspaces/default/host/bin/meson", line 34, in main
return mesonmain.run(sys.argv[1:], launcher)
File "/home/buildroot/skiff/workspaces/default/host/lib/python3.6/site-packages/mesonbuild/mesonmain.py", line 322, in run
sys.exit(run_script_command(args[1:]))
File "/home/buildroot/skiff/workspaces/default/host/lib/python3.6/site-packages/mesonbuild/mesonmain.py", line 278, in run_script_command
return cmdfunc(cmdargs)
File "/home/buildroot/skiff/workspaces/default/host/lib/python3.6/site-packages/mesonbuild/scripts/meson_exe.py", line 76, in run
return run_exe(exe)
File "/home/buildroot/skiff/workspaces/default/host/lib/python3.6/site-packages/mesonbuild/scripts/meson_exe.py", line 59, in run_exe
p, stdout, stderr = Popen_safe(cmd + exe.cmd_args, env=child_env, cwd=exe.workdir)
File "/home/buildroot/skiff/workspaces/default/host/lib/python3.6/site-packages/mesonbuild/mesonlib.py", line 642, in Popen_safe
o, e = p.communicate(write)
File "/home/buildroot/skiff/workspaces/default/host/lib/python3.6/subprocess.py", line 843, in communicate
stdout, stderr = self._communicate(input, endtime, timeout)
File "/home/buildroot/skiff/workspaces/default/host/lib/python3.6/subprocess.py", line 1554, in _communicate
self.stdout.errors)
File "/home/buildroot/skiff/workspaces/default/host/lib/python3.6/subprocess.py", line 740, in _translate_newlines
data = data.decode(encoding, errors)
UnicodeDecodeError: 'ascii' codec can't decode byte 0xc3 in position 825: ordinal not in range(128)
[4/652] Generating systemd.fr.catalog with a meson_exe.py custom command.
FAILED: catalog/systemd.fr.catalog
/home/buildroot/skiff/workspaces/default/host/bin/python3 /home/buildroot/skiff/workspaces/default/host/bin/meson --internal exe /home/buildroot/skiff/workspaces/default/build/systemd-237/build/meson-private/meson_exe_sed_cd368d5854bbf05015e97526708d8aa93f40056d.dat
Warning: You are using 'ANSI_X3.4-1968' which is not a Unicode-compatible locale.
You might see errors if you use UTF-8 strings as filenames, as strings, or as file contents.
Please switch to a UTF-8 locale for your platform.
Traceback (most recent call last):
File "/home/buildroot/skiff/workspaces/default/host/bin/meson", line 37, in <module>
sys.exit(main())
File "/home/buildroot/skiff/workspaces/default/host/bin/meson", line 34, in main
return mesonmain.run(sys.argv[1:], launcher)
File "/home/buildroot/skiff/workspaces/default/host/lib/python3.6/site-packages/mesonbuild/mesonmain.py", line 322, in run
sys.exit(run_script_command(args[1:]))
File "/home/buildroot/skiff/workspaces/default/host/lib/python3.6/site-packages/mesonbuild/mesonmain.py", line 278, in run_script_command
return cmdfunc(cmdargs)
File "/home/buildroot/skiff/workspaces/default/host/lib/python3.6/site-packages/mesonbuild/scripts/meson_exe.py", line 76, in run
return run_exe(exe)
File "/home/buildroot/skiff/workspaces/default/host/lib/python3.6/site-packages/mesonbuild/scripts/meson_exe.py", line 59, in run_exe
p, stdout, stderr = Popen_safe(cmd + exe.cmd_args, env=child_env, cwd=exe.workdir)
File "/home/buildroot/skiff/workspaces/default/host/lib/python3.6/site-packages/mesonbuild/mesonlib.py", line 642, in Popen_safe
o, e = p.communicate(write)
File "/home/buildroot/skiff/workspaces/default/host/lib/python3.6/subprocess.py", line 843, in communicate
stdout, stderr = self._communicate(input, endtime, timeout)
File "/home/buildroot/skiff/workspaces/default/host/lib/python3.6/subprocess.py", line 1554, in _communicate
self.stdout.errors)
File "/home/buildroot/skiff/workspaces/default/host/lib/python3.6/subprocess.py", line 740, in _translate_newlines
data = data.decode(encoding, errors)
UnicodeDecodeError: 'ascii' codec can't decode byte 0xc3 in position 149: ordinal not in range(128)
[5/652] Generating systemd.bg.catalog with a meson_exe.py custom command.
FAILED: catalog/systemd.bg.catalog
/home/buildroot/skiff/workspaces/default/host/bin/python3 /home/buildroot/skiff/workspaces/default/host/bin/meson --internal exe /home/buildroot/skiff/workspaces/default/build/systemd-237/build/meson-private/meson_exe_sed_5d9c7356415ec3bcbf42f43e00bfa26888fc90a6.dat
Warning: You are using 'ANSI_X3.4-1968' which is not a Unicode-compatible locale.
You might see errors if you use UTF-8 strings as filenames, as strings, or as file contents.
Please switch to a UTF-8 locale for your platform.
Traceback (most recent call last):
File "/home/buildroot/skiff/workspaces/default/host/bin/meson", line 37, in <module>
sys.exit(main())
File "/home/buildroot/skiff/workspaces/default/host/bin/meson", line 34, in main
return mesonmain.run(sys.argv[1:], launcher)
File "/home/buildroot/skiff/workspaces/default/host/lib/python3.6/site-packages/mesonbuild/mesonmain.py", line 322, in run
sys.exit(run_script_command(args[1:]))
File "/home/buildroot/skiff/workspaces/default/host/lib/python3.6/site-packages/mesonbuild/mesonmain.py", line 278, in run_script_command
return cmdfunc(cmdargs)
File "/home/buildroot/skiff/workspaces/default/host/lib/python3.6/site-packages/mesonbuild/scripts/meson_exe.py", line 76, in run
return run_exe(exe)
File "/home/buildroot/skiff/workspaces/default/host/lib/python3.6/site-packages/mesonbuild/scripts/meson_exe.py", line 59, in run_exe
p, stdout, stderr = Popen_safe(cmd + exe.cmd_args, env=child_env, cwd=exe.workdir)
File "/home/buildroot/skiff/workspaces/default/host/lib/python3.6/site-packages/mesonbuild/mesonlib.py", line 642, in Popen_safe
o, e = p.communicate(write)
File "/home/buildroot/skiff/workspaces/default/host/lib/python3.6/subprocess.py", line 843, in communicate
stdout, stderr = self._communicate(input, endtime, timeout)
File "/home/buildroot/skiff/workspaces/default/host/lib/python3.6/subprocess.py", line 1554, in _communicate
self.stdout.errors)
File "/home/buildroot/skiff/workspaces/default/host/lib/python3.6/subprocess.py", line 740, in _translate_newlines
data = data.decode(encoding, errors)
UnicodeDecodeError: 'ascii' codec can't decode byte 0xd0 in position 1079: ordinal not in range(128)
ninja: build stopped: subcommand failed.
package/pkg-generic.mk:247: recipe for target '/home/buildroot/skiff/workspaces/default/build/systemd-237/.stamp_built' failed
make[3]: *** [/home/buildroot/skiff/workspaces/default/build/systemd-237/.stamp_built] Error 1
Makefile:16: recipe for target '_all' failed
make[2]: *** [_all] Error 2
make[2]: Leaving directory '/home/buildroot/skiff/workspaces/default'
Makefile:52: recipe for target 'compile' failed
make[1]: *** [compile] Error 2
make[1]: Leaving directory '/home/buildroot/skiff/build'
Makefile:2: recipe for target 'compile' failed
make: *** [compile] Error 2
$ locale
LANG=
LANGUAGE=
LC_CTYPE="POSIX"
LC_NUMERIC="POSIX"
LC_TIME="POSIX"
LC_COLLATE="POSIX"
LC_MONETARY="POSIX"
LC_MESSAGES="POSIX"
LC_PAPER="POSIX"
LC_NAME="POSIX"
LC_ADDRESS="POSIX"
LC_TELEPHONE="POSIX"
LC_MEASUREMENT="POSIX"
LC_IDENTIFICATION="POSIX"
LC_ALL=
make[8]: Rien à faire pour « install-data-am ».
>>> host-dbus-glib 0.108 Downloading
--2018-02-02 03:02:18-- http://dbus.freedesktop.org/releases/dbus-glib/dbus-glib-0.108.tar.gz
Résolution de dbus.freedesktop.org (dbus.freedesktop.org)… 2610:10:20:722:a800:ff:feda:470f, 131.252.210.176
Connexion à dbus.freedesktop.org (dbus.freedesktop.org)|2610:10:20:722:a800:ff:feda:470f|:80… connecté.
requête HTTP transmise, en attente de la réponse… 301 Moved Permanently
Emplacement : https://dbus.freedesktop.org/releases/dbus-glib/dbus-glib-0.108.tar.gz [suivant]
--2018-02-02 03:02:20-- https://dbus.freedesktop.org/releases/dbus-glib/dbus-glib-0.108.tar.gz
Connexion à dbus.freedesktop.org (dbus.freedesktop.org)|2610:10:20:722:a800:ff:feda:470f|:443… connecté.
requête HTTP transmise, en attente de la réponse… 200 OK
Taille : 812488 (793K) [application/x-gzip]
Enregistre : «/home/adrien/Téléchargements/SkiffOS/workspaces/default/build/.dbus-glib-0.108.tar.gz.leDhn5/output»
100%[======================================>] 812 488 619KB/s ds 1,3s
2018-02-02 03:02:22 (619 KB/s) - «/home/adrien/Téléchargements/SkiffOS/workspaces/default/build/.dbus-glib-0.108.tar.gz.leDhn5/output» enregistré [812488/812488]
dbus-glib-0.108.tar.gz: OK (sha256: 9f340c7e2352e9cdf113893ca77ca9075d9f8d5e81476bf2bf361099383c602c)
>>> host-dbus-glib 0.108 Extracting
gzip -d -c /home/adrien/Téléchargements/SkiffOS/buildroot/dl/dbus-glib-0.108.tar.gz | tar --strip-components=1 -C /home/adrien/Téléchargements/SkiffOS/workspaces/default/build/host-dbus-glib-0.108 -xf -
>>> host-dbus-glib 0.108 Patching
>>> host-dbus-glib 0.108 Updating config.sub and config.guess
for file in config.guess config.sub; do for i in $(find /home/adrien/Téléchargements/SkiffOS/workspaces/default/build/host-dbus-glib-0.108 -name $file); do cp support/gnuconfig/$file $i; done; done
>>> host-dbus-glib 0.108 Patching libtool
patching file /home/adrien/Téléchargements/SkiffOS/workspaces/default/build/host-dbus-glib-0.108/ltmain.sh
Hunk #1 succeeded at 2694 (offset 7 lines).
Hunk #2 succeeded at 4284 (offset 7 lines).
Hunk #3 succeeded at 6579 (offset 25 lines).
Hunk #4 succeeded at 6589 (offset 25 lines).
Hunk #5 succeeded at 6882 (offset 25 lines).
Hunk #6 succeeded at 7174 (offset 25 lines).
Hunk #7 succeeded at 8146 (offset 34 lines).
Hunk #8 succeeded at 10778 (offset 68 lines).
>>> host-dbus-glib 0.108 Configuring
(cd /home/adrien/Téléchargements/SkiffOS/workspaces/default/build/host-dbus-glib-0.108/ && rm -rf config.cache; PATH="/home/adrien/Téléchargements/SkiffOS/workspaces/default/host/bin:/home/adrien/Téléchargements/SkiffOS/workspaces/default/host/sbin:/home/adrien/.nvm/versions/node/v4.6.2/bin:/home/adrien/.local/bin:/usr/local/sbin:/usr/local/bin:/usr/sbin:/usr/bin:/sbin:/bin:/usr/games:/usr/local/games" PKG_CONFIG="/home/adrien/Téléchargements/SkiffOS/workspaces/default/host/bin/pkg-config" PKG_CONFIG_SYSROOT_DIR="/" PKG_CONFIG_ALLOW_SYSTEM_CFLAGS=1 PKG_CONFIG_ALLOW_SYSTEM_LIBS=1 PKG_CONFIG_LIBDIR="/home/adrien/Téléchargements/SkiffOS/workspaces/default/host/lib/pkgconfig:/home/adrien/Téléchargements/SkiffOS/workspaces/default/host/share/pkgconfig" AR="/usr/bin/ar" AS="/usr/bin/as" LD="/usr/bin/ld" NM="/usr/bin/nm" CC="/home/adrien/Téléchargements/SkiffOS/workspaces/default/host/bin/ccache /usr/bin/gcc" GCC="/home/adrien/Téléchargements/SkiffOS/workspaces/default/host/bin/ccache /usr/bin/gcc" CXX="/home/adrien/Téléchargements/SkiffOS/workspaces/default/host/bin/ccache /usr/bin/g++" CPP="/usr/bin/cpp" OBJCOPY="/usr/bin/objcopy" RANLIB="/usr/bin/ranlib" CPPFLAGS="-I/home/adrien/Téléchargements/SkiffOS/workspaces/default/host/include" CFLAGS="-O2 -I/home/adrien/Téléchargements/SkiffOS/workspaces/default/host/include" CXXFLAGS="-O2 -I/home/adrien/Téléchargements/SkiffOS/workspaces/default/host/include" LDFLAGS="-L/home/adrien/Téléchargements/SkiffOS/workspaces/default/host/lib -Wl,-rpath,/home/adrien/Téléchargements/SkiffOS/workspaces/default/host/lib" INTLTOOL_PERL=/usr/bin/perl CFLAGS="-O2 -I/home/adrien/Téléchargements/SkiffOS/workspaces/default/host/include" LDFLAGS="-L/home/adrien/Téléchargements/SkiffOS/workspaces/default/host/lib -Wl,-rpath,/home/adrien/Téléchargements/SkiffOS/workspaces/default/host/lib" CONFIG_SITE=/dev/null ./configure --prefix="/home/adrien/Téléchargements/SkiffOS/workspaces/default/host" --sysconfdir="/home/adrien/Téléchargements/SkiffOS/workspaces/default/host/etc" --localstatedir="/home/adrien/Téléchargements/SkiffOS/workspaces/default/host/var" --enable-shared --disable-static --disable-gtk-doc --disable-gtk-doc-html --disable-doc --disable-docs --disable-documentation --disable-debug --with-xmlto=no --with-fop=no --disable-dependency-tracking --disable-tests --disable-xml-docs --disable-bash-completion --disable-doxygen-docs --enable-asserts=yes )
configure: WARNING: unrecognized options: --disable-doc, --disable-docs, --disable-documentation, --disable-debug, --with-xmlto, --with-fop, --disable-xml-docs, --disable-doxygen-docs
checking build system type... x86_64-pc-linux-gnu
checking host system type... x86_64-pc-linux-gnu
checking for a BSD-compatible install... /usr/bin/install -c
checking whether build environment is sane... yes
checking for a thread-safe mkdir -p... /bin/mkdir -p
checking for gawk... gawk
checking whether make sets $(MAKE)... yes
checking whether make supports nested variables... yes
checking whether to enable maintainer-specific portions of Makefiles... no
checking whether make supports nested variables... (cached) yes
checking for gcc... /home/adrien/Téléchargements/SkiffOS/workspaces/default/host/bin/ccache /usr/bin/gcc
checking whether the C compiler works... yes
checking for C compiler default output file name... a.out
checking for suffix of executables...
checking whether we are cross compiling... no
checking for suffix of object files... o
checking whether we are using the GNU C compiler... yes
checking whether /home/adrien/Téléchargements/SkiffOS/workspaces/default/host/bin/ccache /usr/bin/gcc accepts -g... yes
checking for /home/adrien/Téléchargements/SkiffOS/workspaces/default/host/bin/ccache /usr/bin/gcc option to accept ISO C89... none needed
checking whether /home/adrien/Téléchargements/SkiffOS/workspaces/default/host/bin/ccache /usr/bin/gcc understands -c and -o together... yes
checking for style of include used by make... GNU
checking dependency style of /home/adrien/Téléchargements/SkiffOS/workspaces/default/host/bin/ccache /usr/bin/gcc... none
checking for library containing strerror... none required
checking how to run the C preprocessor... /usr/bin/cpp
checking for grep that handles long lines and -e... /bin/grep
checking for egrep... /bin/grep -E
checking for ANSI C header files... yes
checking whether gcc understands -Wfloat-equal... yes
checking how to print strings... printf
checking for a sed that does not truncate output... /bin/sed
checking for fgrep... /bin/grep -F
checking for ld used by /home/adrien/Téléchargements/SkiffOS/workspaces/default/host/bin/ccache /usr/bin/gcc... /usr/bin/ld
checking if the linker (/usr/bin/ld) is GNU ld... yes
checking for BSD- or MS-compatible name lister (nm)... /usr/bin/nm
checking the name lister (/usr/bin/nm) interface... BSD nm
checking whether ln -s works... yes
checking the maximum length of command line arguments... 3458764513820540925
checking how to convert x86_64-pc-linux-gnu file names to x86_64-pc-linux-gnu format... func_convert_file_noop
checking how to convert x86_64-pc-linux-gnu file names to toolchain format... func_convert_file_noop
checking for /usr/bin/ld option to reload object files... -r
checking for objdump... objdump
checking how to recognize dependent libraries... pass_all
checking for dlltool... no
checking how to associate runtime and link libraries... printf %s\n
checking for archiver @FILE support... @
checking for strip... strip
checking for ranlib... /usr/bin/ranlib
checking command to parse /usr/bin/nm output from /home/adrien/Téléchargements/SkiffOS/workspaces/default/host/bin/ccache /usr/bin/gcc object... ok
checking for sysroot... no
checking for a working dd... /bin/dd
checking how to truncate binary pipes... /bin/dd bs=4096 count=1
checking for mt... mt
checking if mt is a manifest tool... no
checking for sys/types.h... yes
checking for sys/stat.h... yes
checking for stdlib.h... yes
checking for string.h... yes
checking for memory.h... yes
checking for strings.h... yes
checking for inttypes.h... yes
checking for stdint.h... yes
checking for unistd.h... yes
checking for dlfcn.h... yes
checking for objdir... .libs
checking if /home/adrien/Téléchargements/SkiffOS/workspaces/default/host/bin/ccache /usr/bin/gcc supports -fno-rtti -fno-exceptions... no
checking for /home/adrien/Téléchargements/SkiffOS/workspaces/default/host/bin/ccache /usr/bin/gcc option to produce PIC... -fPIC -DPIC
checking if /home/adrien/Téléchargements/SkiffOS/workspaces/default/host/bin/ccache /usr/bin/gcc PIC flag -fPIC -DPIC works... yes
checking if /home/adrien/Téléchargements/SkiffOS/workspaces/default/host/bin/ccache /usr/bin/gcc static flag -static works... yes
checking if /home/adrien/Téléchargements/SkiffOS/workspaces/default/host/bin/ccache /usr/bin/gcc supports -c -o file.o... yes
checking if /home/adrien/Téléchargements/SkiffOS/workspaces/default/host/bin/ccache /usr/bin/gcc supports -c -o file.o... (cached) yes
checking whether the /home/adrien/Téléchargements/SkiffOS/workspaces/default/host/bin/ccache /usr/bin/gcc linker (/usr/bin/ld -m elf_x86_64) supports shared libraries... yes
checking whether -lc should be explicitly linked in... no
checking dynamic linker characteristics... GNU/Linux ld.so
checking how to hardcode library paths into programs... immediate
checking whether stripping libraries is possible... yes
checking if libtool supports shared libraries... yes
checking whether to build shared libraries... yes
checking whether to build static libraries... no
checking for library containing socket... none required
checking whether socklen_t is defined... yes
checking for XML_ParserCreate_MM in -lexpat... yes
checking expat.h usability... yes
checking expat.h presence... yes
checking for expat.h... yes
checking pkg-config is at least version 0.9.0... yes
checking for DBUS... yes
checking for DBUS_GLIB... yes
checking for gtk-doc... no
configure: WARNING:
You will not be able to create source packages with 'make dist'
because gtk-doc >= 1.14 is not found.
checking for gtkdoc-check... no
checking for gtkdoc-check... no
checking for gtkdoc-rebase... no
checking for gtkdoc-mkpdf... no
checking whether to build gtk-doc documentation... no
checking for GTKDOC_DEPS... yes
checking that generated files are newer than configure... done
configure: creating ./config.status
config.status: creating Makefile
config.status: creating m4/Makefile
config.status: creating doc/Makefile
config.status: creating doc/reference/Makefile
config.status: creating doc/reference/version.xml
config.status: creating dbus/Makefile
config.status: creating dbus/examples/Makefile
config.status: creating dbus/examples/statemachine/Makefile
config.status: creating test/Makefile
config.status: creating test/core/Makefile
config.status: creating test/interfaces/Makefile
config.status: creating test/data/valid-service-files/debug-glib.service
config.status: creating test/data/valid-service-files/debug-echo.service
config.status: creating test/data/valid-service-files/interfaces-test.service
config.status: creating test/lib/Makefile
config.status: creating tools/Makefile
config.status: creating dbus-glib-1.pc
config.status: creating dbus-glib-1-uninstalled.pc
config.status: creating config.h
config.status: executing depfiles commands
config.status: executing libtool commands
configure: WARNING: unrecognized options: --disable-doc, --disable-docs, --disable-documentation, --disable-debug, --with-xmlto, --with-fop, --disable-xml-docs, --disable-doxygen-docs
D-BUS GLIB BINDINGS 0.108
==============
prefix: /home/adrien/Téléchargements/SkiffOS/workspaces/default/host
exec_prefix: ${prefix}
source code location: .
compiler: /home/adrien/Téléchargements/SkiffOS/workspaces/default/host/bin/ccache /usr/bin/gcc
cflags: -O2 -I/home/adrien/Téléchargements/SkiffOS/workspaces/default/host/include -Wall -Wchar-subscripts -Wmissing-declarations -Wmissing-prototypes -Wnested-externs -Wpointer-arith -Wcast-align -Wfloat-equal -Wsign-compare -fno-strict-aliasing
cppflags: -I/home/adrien/Téléchargements/SkiffOS/workspaces/default/host/include
Maintainer mode: no
gcc coverage profiling: no
Building unit tests: no
Building assertions: yes
Building checks: yes
Building Gtk-doc docs: no
Bash Completion: no
Using XML parser:
NOTE: building with assertions increases library size and decreases performance.
>>> host-dbus-glib 0.108 Building
PATH="/home/adrien/Téléchargements/SkiffOS/workspaces/default/host/bin:/home/adrien/Téléchargements/SkiffOS/workspaces/default/host/sbin:/home/adrien/.nvm/versions/node/v4.6.2/bin:/home/adrien/.local/bin:/usr/local/sbin:/usr/local/bin:/usr/sbin:/usr/bin:/sbin:/bin:/usr/games:/usr/local/games" PKG_CONFIG="/home/adrien/Téléchargements/SkiffOS/workspaces/default/host/bin/pkg-config" PKG_CONFIG_SYSROOT_DIR="/" PKG_CONFIG_ALLOW_SYSTEM_CFLAGS=1 PKG_CONFIG_ALLOW_SYSTEM_LIBS=1 PKG_CONFIG_LIBDIR="/home/adrien/Téléchargements/SkiffOS/workspaces/default/host/lib/pkgconfig:/home/adrien/Téléchargements/SkiffOS/workspaces/default/host/share/pkgconfig" /usr/bin/make -j5 -C /home/adrien/Téléchargements/SkiffOS/workspaces/default/build/host-dbus-glib-0.108/
/usr/bin/make all-recursive
Making all in dbus
Making all in .
CC dbus-glib.lo
CC dbus-gmain.lo
CC dbus-gmarshal.lo
CC dbus-gobject.lo
CC dbus-gproxy.lo
CC dbus-gtest.lo
CC dbus-gvalue.lo
CC dbus-gvalue-parse-variant.lo
CC dbus-gthread.lo
dbus-gvalue-parse-variant.c: In function ‘dbus_g_value_tuple_parse_variant’:
dbus-gvalue-parse-variant.c:265:3: warning: ‘g_value_array_new’ is deprecated (declared at /home/adrien/Téléchargements/SkiffOS/workspaces/default/host/include/glib-2.0/gobject/gvaluearray.h:67): Use 'GArray' instead [-Wdeprecated-declarations]
GValueArray *va = g_value_array_new (n);
^
dbus-gvalue-parse-variant.c:281:7: warning: ‘g_value_array_append’ is deprecated (declared at /home/adrien/Téléchargements/SkiffOS/workspaces/default/host/include/glib-2.0/gobject/gvaluearray.h:80): Use 'GArray' instead [-Wdeprecated-declarations]
g_value_array_append (va, NULL);
^
dbus-gvalue-parse-variant.c:293:5: warning: ‘g_value_array_free’ is deprecated (declared at /home/adrien/Téléchargements/SkiffOS/workspaces/default/host/include/glib-2.0/gobject/gvaluearray.h:70): Use 'GArray' instead [-Wdeprecated-declarations]
g_value_array_free (va);
^
CC dbus-gtype-specialized.lo
CC dbus-gutils.lo
dbus-gobject.c: In function ‘gerror_domaincode_to_dbus_error_name’:
dbus-gobject.c:1478:7: warning: ‘g_static_rw_lock_reader_lock’ is deprecated (declared at /home/adrien/Téléchargements/SkiffOS/workspaces/default/host/include/glib-2.0/glib/deprecated/gthread.h:216): Use 'g_rw_lock_reader_lock' instead [-Wdeprecated-declarations]
g_static_rw_lock_reader_lock (&globals_lock);
^
dbus-gobject.c:1485:7: warning: ‘g_static_rw_lock_reader_unlock’ is deprecated (declared at /home/adrien/Téléchargements/SkiffOS/workspaces/default/host/include/glib-2.0/glib/deprecated/gthread.h:222): Use 'g_rw_lock_reader_unlock' instead [-Wdeprecated-declarations]
g_static_rw_lock_reader_unlock (&globals_lock);
^
dbus-gobject.c: In function ‘invoke_object_method’:
dbus-gobject.c:1759:3: warning: ‘g_value_array_prepend’ is deprecated (declared at /home/adrien/Téléchargements/SkiffOS/workspaces/default/host/include/glib-2.0/gobject/gvaluearray.h:76): Use 'GArray' instead [-Wdeprecated-declarations]
g_value_array_prepend (value_array, NULL);
^
dbus-gobject.c:1760:3: warning: ‘g_value_array_get_nth’ is deprecated (declared at /home/adrien/Téléchargements/SkiffOS/workspaces/default/host/include/glib-2.0/gobject/gvaluearray.h:63): Use 'GArray' instead [-Wdeprecated-declarations]
g_value_init (g_value_array_get_nth (value_array, 0), G_TYPE_OBJECT);
^
dbus-gobject.c:1761:3: warning: ‘g_value_array_get_nth’ is deprecated (declared at /home/adrien/Téléchargements/SkiffOS/workspaces/default/host/include/glib-2.0/gobject/gvaluearray.h:63): Use 'GArray' instead [-Wdeprecated-declarations]
g_value_set_object (g_value_array_get_nth (value_array, 0), object);
^
dbus-gobject.c:1775:7: warning: ‘g_value_array_append’ is deprecated (declared at /home/adrien/Téléchargements/SkiffOS/workspaces/default/host/include/glib-2.0/gobject/gvaluearray.h:80): Use 'GArray' instead [-Wdeprecated-declarations]
g_value_array_append (value_array, &context_value);
^
dbus-gobject.c:1851:7: warning: ‘g_value_array_new’ is deprecated (declared at /home/adrien/Téléchargements/SkiffOS/workspaces/default/host/include/glib-2.0/gobject/gvaluearray.h:67): Use 'GArray' instead [-Wdeprecated-declarations]
out_param_gvalues = g_value_array_new (out_param_count);
^
dbus-gobject.c:1888:8: warning: ‘g_value_array_append’ is deprecated (declared at /home/adrien/Téléchargements/SkiffOS/workspaces/default/host/include/glib-2.0/gobject/gvaluearray.h:80): Use 'GArray' instead [-Wdeprecated-declarations]
g_value_array_append (out_param_gvalues, NULL);
^
dbus-gobject.c:1892:4: warning: ‘g_value_array_append’ is deprecated (declared at /home/adrien/Téléchargements/SkiffOS/workspaces/default/host/include/glib-2.0/gobject/gvaluearray.h:80): Use 'GArray' instead [-Wdeprecated-declarations]
g_value_array_append (value_array, &value);
^
dbus-gobject.c:1900:7: warning: ‘g_value_array_append’ is deprecated (declared at /home/adrien/Téléchargements/SkiffOS/workspaces/default/host/include/glib-2.0/gobject/gvaluearray.h:80): Use 'GArray' instead [-Wdeprecated-declarations]
g_value_array_append (value_array, NULL);
^
dbus-gobject.c:1901:7: warning: ‘g_value_array_get_nth’ is deprecated (declared at /home/adrien/Téléchargements/SkiffOS/workspaces/default/host/include/glib-2.0/gobject/gvaluearray.h:63): Use 'GArray' instead [-Wdeprecated-declarations]
g_value_init (g_value_array_get_nth (value_array, value_array->n_values - 1), G_TYPE_POINTER);
^
dbus-gobject.c:1902:7: warning: ‘g_value_array_get_nth’ is deprecated (declared at /home/adrien/Téléchargements/SkiffOS/workspaces/default/host/include/glib-2.0/gobject/gvaluearray.h:63): Use 'GArray' instead [-Wdeprecated-declarations]
g_value_set_pointer (g_value_array_get_nth (value_array, value_array->n_values - 1), &gerror);
^
dbus-gobject.c:2043:7: warning: ‘g_value_array_free’ is deprecated (declared at /home/adrien/Téléchargements/SkiffOS/workspaces/default/host/include/glib-2.0/gobject/gvaluearray.h:70): Use 'GArray' instead [-Wdeprecated-declarations]
g_value_array_free (out_param_gvalues);
^
dbus-gobject.c:2049:3: warning: ‘g_value_array_free’ is deprecated (declared at /home/adrien/Téléchargements/SkiffOS/workspaces/default/host/include/glib-2.0/gobject/gvaluearray.h:70): Use 'GArray' instead [-Wdeprecated-declarations]
g_value_array_free (value_array);
^
dbus-gobject.c: In function ‘dbus_g_error_domain_register’:
dbus-gobject.c:2707:3: warning: ‘g_static_rw_lock_writer_lock’ is deprecated (declared at /home/adrien/Téléchargements/SkiffOS/workspaces/default/host/include/glib-2.0/glib/deprecated/gthread.h:225): Use 'g_rw_lock_writer_lock' instead [-Wdeprecated-declarations]
g_static_rw_lock_writer_lock (&globals_lock);
^
dbus-gobject.c:2731:3: warning: ‘g_static_rw_lock_writer_unlock’ is deprecated (declared at /home/adrien/Téléchargements/SkiffOS/workspaces/default/host/include/glib-2.0/glib/deprecated/gthread.h:231): Use 'g_rw_lock_writer_unlock' instead [-Wdeprecated-declarations]
g_static_rw_lock_writer_unlock (&globals_lock);
^
CC dbus-gsignature.lo
dbus-gproxy.c: In function ‘dbus_g_proxy_manager_get’:
dbus-gproxy.c:188:3: warning: ‘g_static_mutex_get_mutex_impl’ is deprecated (declared at /home/adrien/Téléchargements/SkiffOS/workspaces/default/host/include/glib-2.0/glib/deprecated/gthread.h:154): Use 'GMutex' instead [-Wdeprecated-declarations]
g_static_mutex_lock (&connection_g_proxy_lock);
^
dbus-gproxy.c:195:7: warning: ‘g_static_mutex_get_mutex_impl’ is deprecated (declared at /home/adrien/Téléchargements/SkiffOS/workspaces/default/host/include/glib-2.0/glib/deprecated/gthread.h:154): Use 'GMutex' instead [-Wdeprecated-declarations]
g_static_mutex_unlock (&connection_g_proxy_lock);
^
dbus-gproxy.c:204:3: warning: ‘g_static_mutex_init’ is deprecated (declared at /home/adrien/Téléchargements/SkiffOS/workspaces/default/host/include/glib-2.0/glib/deprecated/gthread.h:150): Use 'g_mutex_init' instead [-Wdeprecated-declarations]
g_static_mutex_init (&manager->lock);
^
dbus-gproxy.c:218:3: warning: ‘g_static_mutex_get_mutex_impl’ is deprecated (declared at /home/adrien/Téléchargements/SkiffOS/workspaces/default/host/include/glib-2.0/glib/deprecated/gthread.h:154): Use 'GMutex' instead [-Wdeprecated-declarations]
g_static_mutex_unlock (&connection_g_proxy_lock);
^
dbus-gproxy.c: In function ‘dbus_g_proxy_manager_ref’:
dbus-gproxy.c:229:3: warning: ‘g_static_mutex_get_mutex_impl’ is deprecated (declared at /home/adrien/Téléchargements/SkiffOS/workspaces/default/host/include/glib-2.0/glib/deprecated/gthread.h:154): Use 'GMutex' instead [-Wdeprecated-declarations]
LOCK_MANAGER (manager);
^
dbus-gproxy.c:233:3: warning: ‘g_static_mutex_get_mutex_impl’ is deprecated (declared at /home/adrien/Téléchargements/SkiffOS/workspaces/default/host/include/glib-2.0/glib/deprecated/gthread.h:154): Use 'GMutex' instead [-Wdeprecated-declarations]
UNLOCK_MANAGER (manager);
^
dbus-gproxy.c: In function ‘dbus_g_proxy_manager_unref’:
dbus-gproxy.c:244:3: warning: ‘g_static_mutex_get_mutex_impl’ is deprecated (declared at /home/adrien/Téléchargements/SkiffOS/workspaces/default/host/include/glib-2.0/glib/deprecated/gthread.h:154): Use 'GMutex' instead [-Wdeprecated-declarations]
LOCK_MANAGER (manager);
^
dbus-gproxy.c:248:7: warning: ‘g_static_mutex_get_mutex_impl’ is deprecated (declared at /home/adrien/Téléchargements/SkiffOS/workspaces/default/host/include/glib-2.0/glib/deprecated/gthread.h:154): Use 'GMutex' instead [-Wdeprecated-declarations]
UNLOCK_MANAGER (manager);
^
dbus-gproxy.c:288:7: warning: ‘g_static_mutex_free’ is deprecated (declared at /home/adrien/Téléchargements/SkiffOS/workspaces/default/host/include/glib-2.0/glib/deprecated/gthread.h:152): Use 'g_mutex_clear' instead [-Wdeprecated-declarations]
g_static_mutex_free (&manager->lock);
^
dbus-gproxy.c:290:7: warning: ‘g_static_mutex_get_mutex_impl’ is deprecated (declared at /home/adrien/Téléchargements/SkiffOS/workspaces/default/host/include/glib-2.0/glib/deprecated/gthread.h:154): Use 'GMutex' instead [-Wdeprecated-declarations]
g_static_mutex_lock (&connection_g_proxy_lock);
^
dbus-gproxy.c:299:7: warning: ‘g_static_mutex_get_mutex_impl’ is deprecated (declared at /home/adrien/Téléchargements/SkiffOS/workspaces/default/host/include/glib-2.0/glib/deprecated/gthread.h:154): Use 'GMutex' instead [-Wdeprecated-declarations]
g_static_mutex_unlock (&connection_g_proxy_lock);
^
dbus-gproxy.c:308:7: warning: ‘g_static_mutex_get_mutex_impl’ is deprecated (declared at /home/adrien/Téléchargements/SkiffOS/workspaces/default/host/include/glib-2.0/glib/deprecated/gthread.h:154): Use 'GMutex' instead [-Wdeprecated-declarations]
UNLOCK_MANAGER (manager);
^
dbus-gproxy.c: In function ‘dbus_g_proxy_manager_replace_name_owner’:
dbus-gproxy.c:787:4: warning: ‘g_static_mutex_get_mutex_impl’ is deprecated (declared at /home/adrien/Téléchargements/SkiffOS/workspaces/default/host/include/glib-2.0/glib/deprecated/gthread.h:154): Use 'GMutex' instead [-Wdeprecated-declarations]
UNLOCK_MANAGER (manager);
^
dbus-gproxy.c:801:4: warning: ‘g_static_mutex_get_mutex_impl’ is deprecated (declared at /home/adrien/Téléchargements/SkiffOS/workspaces/default/host/include/glib-2.0/glib/deprecated/gthread.h:154): Use 'GMutex' instead [-Wdeprecated-declarations]
LOCK_MANAGER (manager);
^
dbus-gproxy.c: In function ‘got_name_owner_cb’:
dbus-gproxy.c:829:3: warning: ‘g_static_mutex_get_mutex_impl’ is deprecated (declared at /home/adrien/Téléchargements/SkiffOS/workspaces/default/host/include/glib-2.0/glib/deprecated/gthread.h:154): Use 'GMutex' instead [-Wdeprecated-declarations]
LOCK_MANAGER (priv->manager);
^
dbus-gproxy.c:857:3: warning: ‘g_static_mutex_get_mutex_impl’ is deprecated (declared at /home/adrien/Téléchargements/SkiffOS/workspaces/default/host/include/glib-2.0/glib/deprecated/gthread.h:154): Use 'GMutex' instead [-Wdeprecated-declarations]
UNLOCK_MANAGER (priv->manager);
^
dbus-gproxy.c: In function ‘dbus_g_proxy_manager_register’:
dbus-gproxy.c:934:3: warning: ‘g_static_mutex_get_mutex_impl’ is deprecated (declared at /home/adrien/Téléchargements/SkiffOS/workspaces/default/host/include/glib-2.0/glib/deprecated/gthread.h:154): Use 'GMutex' instead [-Wdeprecated-declarations]
LOCK_MANAGER (manager);
^
dbus-gproxy.c:1040:3: warning: ‘g_static_mutex_get_mutex_impl’ is deprecated (declared at /home/adrien/Téléchargements/SkiffOS/workspaces/default/host/include/glib-2.0/glib/deprecated/gthread.h:154): Use 'GMutex' instead [-Wdeprecated-declarations]
UNLOCK_MANAGER (manager);
^
dbus-gproxy.c: In function ‘dbus_g_proxy_manager_unregister’:
dbus-gproxy.c:1051:3: warning: ‘g_static_mutex_get_mutex_impl’ is deprecated (declared at /home/adrien/Téléchargements/SkiffOS/workspaces/default/host/include/glib-2.0/glib/deprecated/gthread.h:154): Use 'GMutex' instead [-Wdeprecated-declarations]
LOCK_MANAGER (manager);
^
dbus-gproxy.c:1151:3: warning: ‘g_static_mutex_get_mutex_impl’ is deprecated (declared at /home/adrien/Téléchargements/SkiffOS/workspaces/default/host/include/glib-2.0/glib/deprecated/gthread.h:154): Use 'GMutex' instead [-Wdeprecated-declarations]
UNLOCK_MANAGER (manager);
^
dbus-gproxy.c: In function ‘dbus_g_proxy_manager_filter’:
dbus-gproxy.c:1209:3: warning: ‘g_static_mutex_get_mutex_impl’ is deprecated (declared at /home/adrien/Téléchargements/SkiffOS/workspaces/default/host/include/glib-2.0/glib/deprecated/gthread.h:154): Use 'GMutex' instead [-Wdeprecated-declarations]
LOCK_MANAGER (manager);
^
dbus-gproxy.c:1230:11: warning: ‘g_static_mutex_get_mutex_impl’ is deprecated (declared at /home/adrien/Téléchargements/SkiffOS/workspaces/default/host/include/glib-2.0/glib/deprecated/gthread.h:154): Use 'GMutex' instead [-Wdeprecated-declarations]
UNLOCK_MANAGER (manager);
^
dbus-gproxy.c:1233:11: warning: ‘g_static_mutex_get_mutex_impl’ is deprecated (declared at /home/adrien/Téléchargements/SkiffOS/workspaces/default/host/include/glib-2.0/glib/deprecated/gthread.h:154): Use 'GMutex' instead [-Wdeprecated-declarations]
LOCK_MANAGER (manager);
^
dbus-gproxy.c:1355:4: warning: ‘g_static_mutex_get_mutex_impl’ is deprecated (declared at /home/adrien/Téléchargements/SkiffOS/workspaces/default/host/include/glib-2.0/glib/deprecated/gthread.h:154): Use 'GMutex' instead [-Wdeprecated-declarations]
UNLOCK_MANAGER (manager);
^
dbus-gproxy.c:1358:4: warning: ‘g_static_mutex_get_mutex_impl’ is deprecated (declared at /home/adrien/Téléchargements/SkiffOS/workspaces/default/host/include/glib-2.0/glib/deprecated/gthread.h:154): Use 'GMutex' instead [-Wdeprecated-declarations]
LOCK_MANAGER (manager);
^
dbus-gproxy.c:1363:3: warning: ‘g_static_mutex_get_mutex_impl’ is deprecated (declared at /home/adrien/Téléchargements/SkiffOS/workspaces/default/host/include/glib-2.0/glib/deprecated/gthread.h:154): Use 'GMutex' instead [-Wdeprecated-declarations]
UNLOCK_MANAGER (manager);
^
dbus-gproxy.c: In function ‘marshal_dbus_message_to_g_marshaller’:
dbus-gproxy.c:1738:3: warning: ‘g_value_array_prepend’ is deprecated (declared at /home/adrien/Téléchargements/SkiffOS/workspaces/default/host/include/glib-2.0/gobject/gvaluearray.h:76): Use 'GArray' instead [-Wdeprecated-declarations]
g_value_array_prepend (value_array, NULL);
^
dbus-gproxy.c:1739:3: warning: ‘g_value_array_get_nth’ is deprecated (declared at /home/adrien/Téléchargements/SkiffOS/workspaces/default/host/include/glib-2.0/gobject/gvaluearray.h:63): Use 'GArray' instead [-Wdeprecated-declarations]
g_value_init (g_value_array_get_nth (value_array, 0), G_TYPE_FROM_INSTANCE (proxy));
^
dbus-gproxy.c:1740:3: warning: ‘g_value_array_get_nth’ is deprecated (declared at /home/adrien/Téléchargements/SkiffOS/workspaces/default/host/include/glib-2.0/gobject/gvaluearray.h:63): Use 'GArray' instead [-Wdeprecated-declarations]
g_value_set_instance (g_value_array_get_nth (value_array, 0), proxy);
^
dbus-gproxy.c:1745:3: warning: ‘g_value_array_free’ is deprecated (declared at /home/adrien/Téléchargements/SkiffOS/workspaces/default/host/include/glib-2.0/gobject/gvaluearray.h:70): Use 'GArray' instead [-Wdeprecated-declarations]
g_value_array_free (value_array);
^
dbus-gproxy.c: In function ‘manager_begin_bus_call’:
dbus-gproxy.c:1921:3: warning: ‘g_value_array_new’ is deprecated (declared at /home/adrien/Téléchargements/SkiffOS/workspaces/default/host/include/glib-2.0/gobject/gvaluearray.h:67): Use 'GArray' instead [-Wdeprecated-declarations]
DBUS_G_VALUE_ARRAY_COLLECT_ALL (arg_values, first_arg_type, args);
^
dbus-gproxy.c:1921:3: warning: ‘g_value_array_append’ is deprecated (declared at /home/adrien/Téléchargements/SkiffOS/workspaces/default/host/include/glib-2.0/gobject/gvaluearray.h:80): Use 'GArray' instead [-Wdeprecated-declarations]
dbus-gproxy.c:1921:3: warning: ‘g_value_array_get_nth’ is deprecated (declared at /home/adrien/Téléchargements/SkiffOS/workspaces/default/host/include/glib-2.0/gobject/gvaluearray.h:63): Use 'GArray' instead [-Wdeprecated-declarations]
dbus-gproxy.c:1921:3: warning: ‘g_value_array_free’ is deprecated (declared at /home/adrien/Téléchargements/SkiffOS/workspaces/default/host/include/glib-2.0/gobject/gvaluearray.h:70): Use 'GArray' instead [-Wdeprecated-declarations]
dbus-gproxy.c:1928:7: warning: ‘g_value_array_free’ is deprecated (declared at /home/adrien/Téléchargements/SkiffOS/workspaces/default/host/include/glib-2.0/gobject/gvaluearray.h:70): Use 'GArray' instead [-Wdeprecated-declarations]
g_value_array_free (arg_values);
^
dbus-gproxy.c: In function ‘dbus_g_proxy_marshal_args_to_message’:
dbus-gproxy.c:2328:7: warning: ‘g_value_array_get_nth’ is deprecated (declared at /home/adrien/Téléchargements/SkiffOS/workspaces/default/host/include/glib-2.0/gobject/gvaluearray.h:63): Use 'GArray' instead [-Wdeprecated-declarations]
gvalue = g_value_array_get_nth (args, i);
^
dbus-gproxy.c: In function ‘dbus_g_proxy_begin_call’:
dbus-gproxy.c:2631:3: warning: ‘g_value_array_new’ is deprecated (declared at /home/adrien/Téléchargements/SkiffOS/workspaces/default/host/include/glib-2.0/gobject/gvaluearray.h:67): Use 'GArray' instead [-Wdeprecated-declarations]
DBUS_G_VALUE_ARRAY_COLLECT_ALL (arg_values, first_arg_type, args);
^
dbus-gproxy.c:2631:3: warning: ‘g_value_array_append’ is deprecated (declared at /home/adrien/Téléchargements/SkiffOS/workspaces/default/host/include/glib-2.0/gobject/gvaluearray.h:80): Use 'GArray' instead [-Wdeprecated-declarations]
dbus-gproxy.c:2631:3: warning: ‘g_value_array_get_nth’ is deprecated (declared at /home/adrien/Téléchargements/SkiffOS/workspaces/default/host/include/glib-2.0/gobject/gvaluearray.h:63): Use 'GArray' instead [-Wdeprecated-declarations]
dbus-gproxy.c:2631:3: warning: ‘g_value_array_free’ is deprecated (declared at /home/adrien/Téléchargements/SkiffOS/workspaces/default/host/include/glib-2.0/gobject/gvaluearray.h:70): Use 'GArray' instead [-Wdeprecated-declarations]
dbus-gproxy.c:2638:7: warning: ‘g_value_array_free’ is deprecated (declared at /home/adrien/Téléchargements/SkiffOS/workspaces/default/host/include/glib-2.0/gobject/gvaluearray.h:70): Use 'GArray' instead [-Wdeprecated-declarations]
g_value_array_free (arg_values);
^
dbus-gproxy.c: In function ‘dbus_g_proxy_begin_call_with_timeout’:
dbus-gproxy.c:2699:3: warning: ‘g_value_array_new’ is deprecated (declared at /home/adrien/Téléchargements/SkiffOS/workspaces/default/host/include/glib-2.0/gobject/gvaluearray.h:67): Use 'GArray' instead [-Wdeprecated-declarations]
DBUS_G_VALUE_ARRAY_COLLECT_ALL (arg_values, first_arg_type, args);
^
dbus-gproxy.c:2699:3: warning: ‘g_value_array_append’ is deprecated (declared at /home/adrien/Téléchargements/SkiffOS/workspaces/default/host/include/glib-2.0/gobject/gvaluearray.h:80): Use 'GArray' instead [-Wdeprecated-declarations]
dbus-gproxy.c:2699:3: warning: ‘g_value_array_get_nth’ is deprecated (declared at /home/adrien/Téléchargements/SkiffOS/workspaces/default/host/include/glib-2.0/gobject/gvaluearray.h:63): Use 'GArray' instead [-Wdeprecated-declarations]
dbus-gproxy.c:2699:3: warning: ‘g_value_array_free’ is deprecated (declared at /home/adrien/Téléchargements/SkiffOS/workspaces/default/host/include/glib-2.0/gobject/gvaluearray.h:70): Use 'GArray' instead [-Wdeprecated-declarations]
dbus-gproxy.c:2706:7: warning: ‘g_value_array_free’ is deprecated (declared at /home/adrien/Téléchargements/SkiffOS/workspaces/default/host/include/glib-2.0/gobject/gvaluearray.h:70): Use 'GArray' instead [-Wdeprecated-declarations]
g_value_array_free (arg_values);
^
dbus-gproxy.c: In function ‘dbus_g_proxy_call’:
dbus-gproxy.c:2808:3: warning: ‘g_value_array_new’ is deprecated (declared at /home/adrien/Téléchargements/SkiffOS/workspaces/default/host/include/glib-2.0/gobject/gvaluearray.h:67): Use 'GArray' instead [-Wdeprecated-declarations]
DBUS_G_VALUE_ARRAY_COLLECT_ALL (in_args, first_arg_type, args);
^
dbus-gproxy.c:2808:3: warning: ‘g_value_array_append’ is deprecated (declared at /home/adrien/Téléchargements/SkiffOS/workspaces/default/host/include/glib-2.0/gobject/gvaluearray.h:80): Use 'GArray' instead [-Wdeprecated-declarations]
dbus-gproxy.c:2808:3: warning: ‘g_value_array_get_nth’ is deprecated (declared at /home/adrien/Téléchargements/SkiffOS/workspaces/default/host/include/glib-2.0/gobject/gvaluearray.h:63): Use 'GArray' instead [-Wdeprecated-declarations]
dbus-gproxy.c:2808:3: warning: ‘g_value_array_free’ is deprecated (declared at /home/adrien/Téléchargements/SkiffOS/workspaces/default/host/include/glib-2.0/gobject/gvaluearray.h:70): Use 'GArray' instead [-Wdeprecated-declarations]
dbus-gproxy.c:2815:7: warning: ‘g_value_array_free’ is deprecated (declared at /home/adrien/Téléchargements/SkiffOS/workspaces/default/host/include/glib-2.0/gobject/gvaluearray.h:70): Use 'GArray' instead [-Wdeprecated-declarations]
g_value_array_free (in_args);
^
dbus-gproxy.c: In function ‘dbus_g_proxy_call_with_timeout’:
dbus-gproxy.c:2871:3: warning: ‘g_value_array_new’ is deprecated (declared at /home/adrien/Téléchargements/SkiffOS/workspaces/default/host/include/glib-2.0/gobject/gvaluearray.h:67): Use 'GArray' instead [-Wdeprecated-declarations]
DBUS_G_VALUE_ARRAY_COLLECT_ALL (in_args, first_arg_type, args);
^
dbus-gproxy.c:2871:3: warning: ‘g_value_array_append’ is deprecated (declared at /home/adrien/Téléchargements/SkiffOS/workspaces/default/host/include/glib-2.0/gobject/gvaluearray.h:80): Use 'GArray' instead [-Wdeprecated-declarations]
dbus-gproxy.c:2871:3: warning: ‘g_value_array_get_nth’ is deprecated (declared at /home/adrien/Téléchargements/SkiffOS/workspaces/default/host/include/glib-2.0/gobject/gvaluearray.h:63): Use 'GArray' instead [-Wdeprecated-declarations]
dbus-gproxy.c:2871:3: warning: ‘g_value_array_free’ is deprecated (declared at /home/adrien/Téléchargements/SkiffOS/workspaces/default/host/include/glib-2.0/gobject/gvaluearray.h:70): Use 'GArray' instead [-Wdeprecated-declarations]
dbus-gproxy.c:2878:7: warning: ‘g_value_array_free’ is deprecated (declared at /home/adrien/Téléchargements/SkiffOS/workspaces/default/host/include/glib-2.0/gobject/gvaluearray.h:70): Use 'GArray' instead [-Wdeprecated-declarations]
g_value_array_free (in_args);
^
dbus-gproxy.c: In function ‘dbus_g_proxy_call_no_reply’:
dbus-gproxy.c:2929:3: warning: ‘g_value_array_new’ is deprecated (declared at /home/adrien/Téléchargements/SkiffOS/workspaces/default/host/include/glib-2.0/gobject/gvaluearray.h:67): Use 'GArray' instead [-Wdeprecated-declarations]
DBUS_G_VALUE_ARRAY_COLLECT_ALL (in_args, first_arg_type, args);
^
dbus-gproxy.c:2929:3: warning: ‘g_value_array_append’ is deprecated (declared at /home/adrien/Téléchargements/SkiffOS/workspaces/default/host/include/glib-2.0/gobject/gvaluearray.h:80): Use 'GArray' instead [-Wdeprecated-declarations]
dbus-gproxy.c:2929:3: warning: ‘g_value_array_get_nth’ is deprecated (declared at /home/adrien/Téléchargements/SkiffOS/workspaces/default/host/include/glib-2.0/gobject/gvaluearray.h:63): Use 'GArray' instead [-Wdeprecated-declarations]
dbus-gproxy.c:2929:3: warning: ‘g_value_array_free’ is deprecated (declared at /home/adrien/Téléchargements/SkiffOS/workspaces/default/host/include/glib-2.0/gobject/gvaluearray.h:70): Use 'GArray' instead [-Wdeprecated-declarations]
dbus-gproxy.c:2935:7: warning: ‘g_value_array_free’ is deprecated (declared at /home/adrien/Téléchargements/SkiffOS/workspaces/default/host/include/glib-2.0/gobject/gvaluearray.h:70): Use 'GArray' instead [-Wdeprecated-declarations]
g_value_array_free (in_args);
^
dbus-gvalue.c: In function ‘_dbus_gvalue_to_signature’:
dbus-gvalue.c:507:3: warning: ‘g_value_array_get_type’ is deprecated (declared at /home/adrien/Téléchargements/SkiffOS/workspaces/default/host/include/glib-2.0/gobject/gvaluearray.h:60): Use 'GArray' instead [-Wdeprecated-declarations]
if (g_type_is_a (gtype, G_TYPE_VALUE_ARRAY))
^
dbus-gvalue.c:519:4: warning: ‘g_value_array_get_nth’ is deprecated (declared at /home/adrien/Téléchargements/SkiffOS/workspaces/default/host/include/glib-2.0/gobject/gvaluearray.h:63): Use 'GArray' instead [-Wdeprecated-declarations]
sig = _dbus_gvalue_to_signature (g_value_array_get_nth (array, i));
^
dbus-gvalue.c: In function ‘demarshal_valuearray’:
dbus-gvalue.c:896:3: warning: ‘g_value_array_new’ is deprecated (declared at /home/adrien/Téléchargements/SkiffOS/workspaces/default/host/include/glib-2.0/gobject/gvaluearray.h:67): Use 'GArray' instead [-Wdeprecated-declarations]
ret = g_value_array_new (12);
^
dbus-gvalue.c:904:7: warning: ‘g_value_array_append’ is deprecated (declared at /home/adrien/Téléchargements/SkiffOS/workspaces/default/host/include/glib-2.0/gobject/gvaluearray.h:80): Use 'GArray' instead [-Wdeprecated-declarations]
g_value_array_append (ret, NULL);
^
dbus-gvalue.c:905:7: warning: ‘g_value_array_get_nth’ is deprecated (declared at /home/adrien/Téléchargements/SkiffOS/workspaces/default/host/include/glib-2.0/gobject/gvaluearray.h:63): Use 'GArray' instead [-Wdeprecated-declarations]
val = g_value_array_get_nth (ret, ret->n_values - 1);
^
dbus-gvalue.c:912:4: warning: ‘g_value_array_free’ is deprecated (declared at /home/adrien/Téléchargements/SkiffOS/workspaces/default/host/include/glib-2.0/gobject/gvaluearray.h:70): Use 'GArray' instead [-Wdeprecated-declarations]
g_value_array_free (ret);
^
dbus-gvalue.c:926:4: warning: ‘g_value_array_free’ is deprecated (declared at /home/adrien/Téléchargements/SkiffOS/workspaces/default/host/include/glib-2.0/gobject/gvaluearray.h:70): Use 'GArray' instead [-Wdeprecated-declarations]
g_value_array_free (ret);
^
dbus-gvalue.c: In function ‘get_type_demarshaller’:
dbus-gvalue.c:1099:7: warning: ‘g_value_array_get_type’ is deprecated (declared at /home/adrien/Téléchargements/SkiffOS/workspaces/default/host/include/glib-2.0/gobject/gvaluearray.h:60): Use 'GArray' instead [-Wdeprecated-declarations]
if (g_type_is_a (type, G_TYPE_VALUE_ARRAY))
^
dbus-gvalue.c: In function ‘_dbus_gvalue_demarshal_message’:
dbus-gvalue.c:1300:3: warning: ‘g_value_array_new’ is deprecated (declared at /home/adrien/Téléchargements/SkiffOS/workspaces/default/host/include/glib-2.0/gobject/gvaluearray.h:67): Use 'GArray' instead [-Wdeprecated-declarations]
ret = g_value_array_new (6); /* 6 is a typical maximum for arguments */
^
dbus-gvalue.c:1317:7: warning: ‘g_value_array_append’ is deprecated (declared at /home/adrien/Téléchargements/SkiffOS/workspaces/default/host/include/glib-2.0/gobject/gvaluearray.h:80): Use 'GArray' instead [-Wdeprecated-declarations]
g_value_array_append (ret, NULL);
^
dbus-gvalue.c:1318:7: warning: ‘g_value_array_get_nth’ is deprecated (declared at /home/adrien/Téléchargements/SkiffOS/workspaces/default/host/include/glib-2.0/gobject/gvaluearray.h:63): Use 'GArray' instead [-Wdeprecated-declarations]
value = g_value_array_get_nth (ret, index_);
^
dbus-gvalue.c:1338:3: warning: ‘g_value_array_free’ is deprecated (declared at /home/adrien/Téléchargements/SkiffOS/workspaces/default/host/include/glib-2.0/gobject/gvaluearray.h:70): Use 'GArray' instead [-Wdeprecated-declarations]
g_value_array_free (ret);
^
dbus-gvalue.c: In function ‘marshal_basic’:
dbus-gvalue.c:1360:9: warning: ‘g_value_get_char’ is deprecated (declared at /home/adrien/Téléchargements/SkiffOS/workspaces/default/host/include/glib-2.0/gobject/gvaluetypes.h:182): Use 'g_value_get_schar' instead [-Wdeprecated-declarations]
char b = g_value_get_char (value);
^
dbus-gvalue.c: In function ‘marshal_valuearray’:
dbus-gvalue.c:1538:3: warning: ‘g_value_array_get_type’ is deprecated (declared at /home/adrien/Téléchargements/SkiffOS/workspaces/default/host/include/glib-2.0/gobject/gvaluearray.h:60): Use 'GArray' instead [-Wdeprecated-declarations]
g_assert (G_VALUE_TYPE (value) == G_TYPE_VALUE_ARRAY);
^
dbus-gvalue.c:1552:11: warning: ‘g_value_array_get_nth’ is deprecated (declared at /home/adrien/Téléchargements/SkiffOS/workspaces/default/host/include/glib-2.0/gobject/gvaluearray.h:63): Use 'GArray' instead [-Wdeprecated-declarations]
if (!_dbus_gvalue_marshal (&subiter, g_value_array_get_nth (array, i)))
^
dbus-gvalue.c: In function ‘get_type_marshaller’:
dbus-gvalue.c:1847:7: warning: ‘g_value_array_get_type’ is deprecated (declared at /home/adrien/Téléchargements/SkiffOS/workspaces/default/host/include/glib-2.0/gobject/gvaluearray.h:60): Use 'GArray' instead [-Wdeprecated-declarations]
if (g_type_is_a (type, G_TYPE_VALUE_ARRAY))
^
CC dbus-gvalue-utils.lo
CC dbus-gidl.lo
CC dbus-gloader-expat.lo
CC dbus-gparser.lo
CC dbus-binding-tool-glib.o
dbus-gvalue-utils.c: In function ‘_dbus_gvalue_store’:
dbus-gvalue-utils.c:85:7: warning: ‘g_value_get_char’ is deprecated (declared at /home/adrien/Téléchargements/SkiffOS/workspaces/default/host/include/glib-2.0/gobject/gvaluetypes.h:182): Use 'g_value_get_schar' instead [-Wdeprecated-declarations]
*((gchar *) storage) = g_value_get_char (value);
^
dbus-gvalue-utils.c: In function ‘_dbus_gvalue_set_from_pointer’:
dbus-gvalue-utils.c:136:7: warning: ‘g_value_set_char’ is deprecated (declared at /home/adrien/Téléchargements/SkiffOS/workspaces/default/host/include/glib-2.0/gobject/gvaluetypes.h:179): Use 'g_value_set_schar' instead [-Wdeprecated-declarations]
g_value_set_char (value, *((gchar *) storage));
^
dbus-gvalue-utils.c: In function ‘hash_simple_free_from_gtype’:
dbus-gvalue-utils.c:321:7: warning: ‘g_value_array_get_type’ is deprecated (declared at /home/adrien/Téléchargements/SkiffOS/workspaces/default/host/include/glib-2.0/gobject/gvaluearray.h:60): Use 'GArray' instead [-Wdeprecated-declarations]
else if (gtype == G_TYPE_VALUE_ARRAY)
^
dbus-gvalue-utils.c:323:11: warning: ‘g_value_array_free’ is deprecated (declared at /home/adrien/Téléchargements/SkiffOS/workspaces/default/host/include/glib-2.0/gobject/gvaluearray.h:70): Use 'GArray' instead [-Wdeprecated-declarations]
*func = (GDestroyNotify) g_value_array_free;
^
dbus-gvalue-utils.c: In function ‘gvalue_take_hash_value’:
dbus-gvalue-utils.c:508:7: warning: ‘g_value_set_char’ is deprecated (declared at /home/adrien/Téléchargements/SkiffOS/workspaces/default/host/include/glib-2.0/gobject/gvaluetypes.h:179): Use 'g_value_set_schar' instead [-Wdeprecated-declarations]
g_value_set_char (value, (gchar) GPOINTER_TO_INT (instance));
^
dbus-gvalue-utils.c: In function ‘hash_value_from_gvalue’:
dbus-gvalue-utils.c:539:7: warning: ‘g_value_get_char’ is deprecated (declared at /home/adrien/Téléchargements/SkiffOS/workspaces/default/host/include/glib-2.0/gobject/gvaluetypes.h:182): Use 'g_value_get_schar' instead [-Wdeprecated-declarations]
return GINT_TO_POINTER ((int) g_value_get_char (value));
^
dbus-gvalue-utils.c: In function ‘valuearray_constructor’:
dbus-gvalue-utils.c:771:3: warning: ‘g_value_array_new’ is deprecated (declared at /home/adrien/Téléchargements/SkiffOS/workspaces/default/host/include/glib-2.0/gobject/gvaluearray.h:67): Use 'GArray' instead [-Wdeprecated-declarations]
ret = g_value_array_new (size);
^
dbus-gvalue-utils.c:776:7: warning: ‘g_value_array_append’ is deprecated (declared at /home/adrien/Téléchargements/SkiffOS/workspaces/default/host/include/glib-2.0/gobject/gvaluearray.h:80): Use 'GArray' instead [-Wdeprecated-declarations]
g_value_array_append(ret, &val);
^
dbus-gvalue-utils.c: In function ‘valuearray_copy’:
dbus-gvalue-utils.c:784:3: warning: ‘g_value_array_copy’ is deprecated (declared at /home/adrien/Téléchargements/SkiffOS/workspaces/default/host/include/glib-2.0/gobject/gvaluearray.h:73): Use 'GArray' instead [-Wdeprecated-declarations]
return g_value_array_copy ((GValueArray*) src);
^
dbus-gvalue-utils.c: In function ‘valuearray_simple_free’:
dbus-gvalue-utils.c:790:3: warning: ‘g_value_array_free’ is deprecated (declared at /home/adrien/Téléchargements/SkiffOS/workspaces/default/host/include/glib-2.0/gobject/gvaluearray.h:70): Use 'GArray' instead [-Wdeprecated-declarations]
g_value_array_free (val);
^
dbus-gvalue-utils.c: In function ‘valuearray_get_member’:
dbus-gvalue-utils.c:801:7: warning: ‘g_value_array_get_nth’ is deprecated (declared at /home/adrien/Téléchargements/SkiffOS/workspaces/default/host/include/glib-2.0/gobject/gvaluearray.h:63): Use 'GArray' instead [-Wdeprecated-declarations]
val = g_value_array_get_nth (va, member);
^
dbus-gvalue-utils.c: In function ‘valuearray_set_member’:
dbus-gvalue-utils.c:817:7: warning: ‘g_value_array_get_nth’ is deprecated (declared at /home/adrien/Téléchargements/SkiffOS/workspaces/default/host/include/glib-2.0/gobject/gvaluearray.h:63): Use 'GArray' instead [-Wdeprecated-declarations]
vp = g_value_array_get_nth (va, member);
^
dbus-gvalue-utils.c: In function ‘array_iterator’:
dbus-gvalue-utils.c:882:13: warning: ‘g_value_set_char’ is deprecated (declared at /home/adrien/Téléchargements/SkiffOS/workspaces/default/host/include/glib-2.0/gobject/gvaluetypes.h:179): Use 'g_value_set_schar' instead [-Wdeprecated-declarations]
g_value_set_char (&val, g_array_index (array, gchar, i));
^
dbus-gvalue-utils.c: In function ‘array_append’:
dbus-gvalue-utils.c:962:9: warning: ‘g_value_get_char’ is deprecated (declared at /home/adrien/Téléchargements/SkiffOS/workspaces/default/host/include/glib-2.0/gobject/gvaluetypes.h:182): Use 'g_value_get_schar' instead [-Wdeprecated-declarations]
tmp.c = g_value_get_char (value);
^
CC dbus-glib-tool.o
CCLD libdbus-glib-1.la
CCLD libdbus-gtool.la
dbus-binding-tool-glib.c: In function ‘dbus_g_type_get_lookup_function’:
dbus-binding-tool-glib.c:1142:3: warning: ‘g_value_array_get_type’ is deprecated (declared at /home/adrien/Téléchargements/SkiffOS/workspaces/default/host/include/glib-2.0/gobject/gvaluearray.h:60): Use 'GArray' instead [-Wdeprecated-declarations]
MAP_KNOWN(G_TYPE_VALUE_ARRAY);
^
CCLD dbus-binding-tool
Making all in examples
/bin/bash ../../libtool --mode=execute ../../dbus/dbus-binding-tool --prefix=some_object --mode=glib-server --output=example-service-glue.h ./example-service.xml
/bin/bash ../../libtool --mode=execute ../../dbus/dbus-binding-tool --prefix=test_object --mode=glib-server --output=example-signal-emitter-glue.h ./example-signal-emitter.xml
File " File "/home/adrien/Téléchargements/SkiffOS/workspaces/default/host/bin/glib-genmarshal", line 1/home/adrien/Téléchargements/SkiffOS/workspaces/default/host/bin/glib-genmarshal", line
SyntaxError1:
Non-ASCII character '\xc3' in file /home/adrien/Téléchargements/SkiffOS/workspaces/default/host/bin/glib-genmarshal on line 1, but no encoding declared; see http://python.org/dev/peps/pep-0263/ for details
SyntaxError: Non-ASCII character '\xc3' in file /home/adrien/Téléchargements/SkiffOS/workspaces/default/host/bin/glib-genmarshal on line 1, but no encoding declared; see http://python.org/dev/peps/pep-0263/ for details
/usr/bin/make all-recursive
Making all in .
CC example-client.o
CC example-service.o
CC example-signal-recipient.o
CC example-signal-emitter.o
In file included from example-signal-emitter.c:65:0:
example-signal-emitter-glue.h:5:48: error: ‘dbus_glib_marshal_test_object_BOOLEAN__POINTER’ undeclared here (not in a function)
{ (GCallback) test_object_emit_hello_signal, dbus_glib_marshal_test_object_BOOLEAN__POINTER, 0 },
^
In file included from example-service.c:59:0:
example-service-glue.h:5:42: error: ‘dbus_glib_marshal_some_object_BOOLEAN__STRING_POINTER_POINTER’ undeclared here (not in a function)
{ (GCallback) some_object_hello_world, dbus_glib_marshal_some_object_BOOLEAN__STRING_POINTER_POINTER, 0 },
^
example-service-glue.h:6:40: error: ‘dbus_glib_marshal_some_object_BOOLEAN__POINTER_POINTER’ undeclared here (not in a function)
{ (GCallback) some_object_get_tuple, dbus_glib_marshal_some_object_BOOLEAN__POINTER_POINTER, 66 },
^
example-service.c: In function ‘some_object_get_tuple’:
example-service.c:86:3: warning: ‘g_value_array_new’ is deprecated (declared at /home/adrien/Téléchargements/SkiffOS/workspaces/default/host/include/glib-2.0/gobject/gvaluearray.h:67): Use 'GArray' instead [-Wdeprecated-declarations]
*ret = g_value_array_new (6);
^
example-service.c:87:3: warning: ‘g_value_array_prepend’ is deprecated (declared at /home/adrien/Téléchargements/SkiffOS/workspaces/default/host/include/glib-2.0/gobject/gvaluearray.h:76): Use 'GArray' instead [-Wdeprecated-declarations]
g_value_array_prepend (*ret, NULL);
^
example-service.c:88:3: warning: ‘g_value_array_get_nth’ is deprecated (declared at /home/adrien/Téléchargements/SkiffOS/workspaces/default/host/include/glib-2.0/gobject/gvaluearray.h:63): Use 'GArray' instead [-Wdeprecated-declarations]
g_value_init (g_value_array_get_nth (*ret, 0), G_TYPE_STRING);
^
example-service.c:89:3: warning: ‘g_value_array_get_nth’ is deprecated (declared at /home/adrien/Téléchargements/SkiffOS/workspaces/default/host/include/glib-2.0/gobject/gvaluearray.h:63): Use 'GArray' instead [-Wdeprecated-declarations]
g_value_set_string (g_value_array_get_nth (*ret, 0), "hello");
^
example-service.c:90:3: warning: ‘g_value_array_prepend’ is deprecated (declared at /home/adrien/Téléchargements/SkiffOS/workspaces/default/host/include/glib-2.0/gobject/gvaluearray.h:76): Use 'GArray' instead [-Wdeprecated-declarations]
g_value_array_prepend (*ret, NULL);
^
example-service.c:91:3: warning: ‘g_value_array_get_nth’ is deprecated (declared at /home/adrien/Téléchargements/SkiffOS/workspaces/default/host/include/glib-2.0/gobject/gvaluearray.h:63): Use 'GArray' instead [-Wdeprecated-declarations]
g_value_init (g_value_array_get_nth (*ret, 0), G_TYPE_UINT);
^
example-service.c:92:3: warning: ‘g_value_array_get_nth’ is deprecated (declared at /home/adrien/Téléchargements/SkiffOS/workspaces/default/host/include/glib-2.0/gobject/gvaluearray.h:63): Use 'GArray' instead [-Wdeprecated-declarations]
g_value_set_uint (g_value_array_get_nth (*ret, 0), 42);
^
make[9]: *** [example-signal-emitter.o] Erreur 1
make[9]: *** Attente des tâches non terminées....
make[9]: *** [example-service.o] Erreur 1
example-client.c: In function ‘main’:
example-client.c:78:6: warning: ‘g_value_array_get_type’ is deprecated (declared at /home/adrien/Téléchargements/SkiffOS/workspaces/default/host/include/glib-2.0/gobject/gvaluearray.h:60): Use 'GArray' instead [-Wdeprecated-declarations]
G_TYPE_VALUE_ARRAY, &hello_reply_struct, G_TYPE_INVALID))
^
example-client.c:97:7: warning: ‘g_value_array_get_nth’ is deprecated (declared at /home/adrien/Téléchargements/SkiffOS/workspaces/default/host/include/glib-2.0/gobject/gvaluearray.h:63): Use 'GArray' instead [-Wdeprecated-declarations]
if (!g_value_transform (g_value_array_get_nth (hello_reply_struct, i), &strval))
^
example-client.c:99:7: warning: ‘g_value_array_get_nth’ is deprecated (declared at /home/adrien/Téléchargements/SkiffOS/workspaces/default/host/include/glib-2.0/gobject/gvaluearray.h:63): Use 'GArray' instead [-Wdeprecated-declarations]
g_print ("%s: %s\n", g_type_name (G_VALUE_TYPE (g_value_array_get_nth (hello_reply_struct, i))),
^
example-client.c:102:3: warning: ‘g_value_array_free’ is deprecated (declared at /home/adrien/Téléchargements/SkiffOS/workspaces/default/host/include/glib-2.0/gobject/gvaluearray.h:70): Use 'GArray' instead [-Wdeprecated-declarations]
g_value_array_free (hello_reply_struct);
^
make[8]: *** [all-recursive] Erreur 1
make[7]: *** [all] Erreur 2
make[6]: *** [all-recursive] Erreur 1
make[5]: *** [all-recursive] Erreur 1
make[4]: *** [all] Erreur 2
make[3]: *** [/home/adrien/Téléchargements/SkiffOS/workspaces/default/build/host-dbus-glib-0.108/.stamp_built] Erreur 2
make[2]: *** [_all] Erreur 2
make[2]: quittant le répertoire « /home/adrien/Téléchargements/SkiffOS/workspaces/default »
make[1]: *** [compile] Erreur 2
make[1]: quittant le répertoire « /home/adrien/Téléchargements/SkiffOS/build »
make: *** [compile] Erreur 2
configure: WARNING: unrecognized options: --disable-doc, --disable-docs, --disable-documentation, --disable-debug, --with-xmlto, --with-fop, --disable-xml-docs, --disable-doxygen-docs
D-BUS GLIB BINDINGS 0.108
==============
prefix: /home/adrien/Téléchargements/SkiffOS/workspaces/default/host
exec_prefix: ${prefix}
source code location: .
compiler: /home/adrien/Téléchargements/SkiffOS/workspaces/default/host/bin/ccache /usr/bin/gcc
cflags: -O2 -I/home/adrien/Téléchargements/SkiffOS/workspaces/default/host/include -Wall -Wchar-subscripts -Wmissing-declarations -Wmissing-prototypes -Wnested-externs -Wpointer-arith -Wcast-align -Wfloat-equal -Wsign-compare -fno-strict-aliasing
cppflags: -I/home/adrien/Téléchargements/SkiffOS/workspaces/default/host/include
Maintainer mode: no
gcc coverage profiling: no
Building unit tests: no
Building assertions: yes
Building checks: yes
Building Gtk-doc docs: no
Bash Completion: no
Using XML parser:
NOTE: building with assertions increases library size and decreases performance.
>>> host-dbus-glib 0.108 Building
PATH="/home/adrien/Téléchargements/SkiffOS/workspaces/default/host/bin:/home/adrien/Téléchargements/SkiffOS/workspaces/default/host/sbin:/home/adrien/.nvm/versions/node/v4.6.2/bin:/home/adrien/.local/bin:/usr/local/sbin:/usr/local/bin:/usr/sbin:/usr/bin:/sbin:/bin:/usr/games:/usr/local/games" PKG_CONFIG="/home/adrien/Téléchargements/SkiffOS/workspaces/default/host/bin/pkg-config" PKG_CONFIG_SYSROOT_DIR="/" PKG_CONFIG_ALLOW_SYSTEM_CFLAGS=1 PKG_CONFIG_ALLOW_SYSTEM_LIBS=1 PKG_CONFIG_LIBDIR="/home/adrien/Téléchargements/SkiffOS/workspaces/default/host/lib/pkgconfig:/home/adrien/Téléchargements/SkiffOS/workspaces/default/host/share/pkgconfig" /usr/bin/make -j5 -C /home/adrien/Téléchargements/SkiffOS/workspaces/default/build/host-dbus-glib-0.108/
/usr/bin/make all-recursive
Making all in dbus
Making all in .
CC dbus-glib.lo
CC dbus-gmain.lo
CC dbus-gmarshal.lo
CC dbus-gobject.lo
CC dbus-gproxy.lo
CC dbus-gtest.lo
CC dbus-gvalue.lo
dbus-gproxy.c: In function ‘dbus_g_proxy_manager_get’:
dbus-gproxy.c:188:3: warning: ‘g_static_mutex_get_mutex_impl’ is deprecated (declared at /home/adrien/Téléchargements/SkiffOS/workspaces/default/host/include/glib-2.0/glib/deprecated/gthread.h:154): Use 'GMutex' instead [-Wdeprecated-declarations]
g_static_mutex_lock (&connection_g_proxy_lock);
^
dbus-gproxy.c:195:7: warning: ‘g_static_mutex_get_mutex_impl’ is deprecated (declared at /home/adrien/Téléchargements/SkiffOS/workspaces/default/host/include/glib-2.0/glib/deprecated/gthread.h:154): Use 'GMutex' instead [-Wdeprecated-declarations]
g_static_mutex_unlock (&connection_g_proxy_lock);
^
dbus-gproxy.c:204:3: warning: ‘g_static_mutex_init’ is deprecated (declared at /home/adrien/Téléchargements/SkiffOS/workspaces/default/host/include/glib-2.0/glib/deprecated/gthread.h:150): Use 'g_mutex_init' instead [-Wdeprecated-declarations]
g_static_mutex_init (&manager->lock);
^
dbus-gproxy.c:218:3: warning: ‘g_static_mutex_get_mutex_impl’ is deprecated (declared at /home/adrien/Téléchargements/SkiffOS/workspaces/default/host/include/glib-2.0/glib/deprecated/gthread.h:154): Use 'GMutex' instead [-Wdeprecated-declarations]
g_static_mutex_unlock (&connection_g_proxy_lock);
^
dbus-gproxy.c: In function ‘dbus_g_proxy_manager_ref’:
dbus-gproxy.c:229:3: warning: ‘g_static_mutex_get_mutex_impl’ is deprecated (declared at /home/adrien/Téléchargements/SkiffOS/workspaces/default/host/include/glib-2.0/glib/deprecated/gthread.h:154): Use 'GMutex' instead [-Wdeprecated-declarations]
LOCK_MANAGER (manager);
^
dbus-gproxy.c:233:3: warning: ‘g_static_mutex_get_mutex_impl’ is deprecated (declared at /home/adrien/Téléchargements/SkiffOS/workspaces/default/host/include/glib-2.0/glib/deprecated/gthread.h:154): Use 'GMutex' instead [-Wdeprecated-declarations]
UNLOCK_MANAGER (manager);
^
dbus-gproxy.c: In function ‘dbus_g_proxy_manager_unref’:
dbus-gproxy.c:244:3: warning: ‘g_static_mutex_get_mutex_impl’ is deprecated (declared at /home/adrien/Téléchargements/SkiffOS/workspaces/default/host/include/glib-2.0/glib/deprecated/gthread.h:154): Use 'GMutex' instead [-Wdeprecated-declarations]
LOCK_MANAGER (manager);
^
dbus-gproxy.c:248:7: warning: ‘g_static_mutex_get_mutex_impl’ is deprecated (declared at /home/adrien/Téléchargements/SkiffOS/workspaces/default/host/include/glib-2.0/glib/deprecated/gthread.h:154): Use 'GMutex' instead [-Wdeprecated-declarations]
UNLOCK_MANAGER (manager);
^
dbus-gproxy.c:288:7: warning: ‘g_static_mutex_free’ is deprecated (declared at /home/adrien/Téléchargements/SkiffOS/workspaces/default/host/include/glib-2.0/glib/deprecated/gthread.h:152): Use 'g_mutex_clear' instead [-Wdeprecated-declarations]
g_static_mutex_free (&manager->lock);
^
dbus-gproxy.c:290:7: warning: ‘g_static_mutex_get_mutex_impl’ is deprecated (declared at /home/adrien/Téléchargements/SkiffOS/workspaces/default/host/include/glib-2.0/glib/deprecated/gthread.h:154): Use 'GMutex' instead [-Wdeprecated-declarations]
g_static_mutex_lock (&connection_g_proxy_lock);
^
dbus-gproxy.c:299:7: warning: ‘g_static_mutex_get_mutex_impl’ is deprecated (declared at /home/adrien/Téléchargements/SkiffOS/workspaces/default/host/include/glib-2.0/glib/deprecated/gthread.h:154): Use 'GMutex' instead [-Wdeprecated-declarations]
g_static_mutex_unlock (&connection_g_proxy_lock);
^
dbus-gproxy.c:308:7: warning: ‘g_static_mutex_get_mutex_impl’ is deprecated (declared at /home/adrien/Téléchargements/SkiffOS/workspaces/default/host/include/glib-2.0/glib/deprecated/gthread.h:154): Use 'GMutex' instead [-Wdeprecated-declarations]
UNLOCK_MANAGER (manager);
^
dbus-gproxy.c: In function ‘dbus_g_proxy_manager_replace_name_owner’:
dbus-gproxy.c:787:4: warning: ‘g_static_mutex_get_mutex_impl’ is deprecated (declared at /home/adrien/Téléchargements/SkiffOS/workspaces/default/host/include/glib-2.0/glib/deprecated/gthread.h:154): Use 'GMutex' instead [-Wdeprecated-declarations]
UNLOCK_MANAGER (manager);
^
dbus-gproxy.c:801:4: warning: ‘g_static_mutex_get_mutex_impl’ is deprecated (declared at /home/adrien/Téléchargements/SkiffOS/workspaces/default/host/include/glib-2.0/glib/deprecated/gthread.h:154): Use 'GMutex' instead [-Wdeprecated-declarations]
LOCK_MANAGER (manager);
^
dbus-gproxy.c: In function ‘got_name_owner_cb’:
dbus-gproxy.c:829:3: warning: ‘g_static_mutex_get_mutex_impl’ is deprecated (declared at /home/adrien/Téléchargements/SkiffOS/workspaces/default/host/include/glib-2.0/glib/deprecated/gthread.h:154): Use 'GMutex' instead [-Wdeprecated-declarations]
LOCK_MANAGER (priv->manager);
^
dbus-gproxy.c:857:3: warning: ‘g_static_mutex_get_mutex_impl’ is deprecated (declared at /home/adrien/Téléchargements/SkiffOS/workspaces/default/host/include/glib-2.0/glib/deprecated/gthread.h:154): Use 'GMutex' instead [-Wdeprecated-declarations]
UNLOCK_MANAGER (priv->manager);
^
dbus-gproxy.c: In function ‘dbus_g_proxy_manager_register’:
dbus-gproxy.c:934:3: warning: ‘g_static_mutex_get_mutex_impl’ is deprecated (declared at /home/adrien/Téléchargements/SkiffOS/workspaces/default/host/include/glib-2.0/glib/deprecated/gthread.h:154): Use 'GMutex' instead [-Wdeprecated-declarations]
LOCK_MANAGER (manager);
^
dbus-gproxy.c:1040:3: warning: ‘g_static_mutex_get_mutex_impl’ is deprecated (declared at /home/adrien/Téléchargements/SkiffOS/workspaces/default/host/include/glib-2.0/glib/deprecated/gthread.h:154): Use 'GMutex' instead [-Wdeprecated-declarations]
UNLOCK_MANAGER (manager);
^
dbus-gproxy.c: In function ‘dbus_g_proxy_manager_unregister’:
dbus-gproxy.c:1051:3: warning: ‘g_static_mutex_get_mutex_impl’ is deprecated (declared at /home/adrien/Téléchargements/SkiffOS/workspaces/default/host/include/glib-2.0/glib/deprecated/gthread.h:154): Use 'GMutex' instead [-Wdeprecated-declarations]
LOCK_MANAGER (manager);
^
dbus-gproxy.c:1151:3: warning: ‘g_static_mutex_get_mutex_impl’ is deprecated (declared at /home/adrien/Téléchargements/SkiffOS/workspaces/default/host/include/glib-2.0/glib/deprecated/gthread.h:154): Use 'GMutex' instead [-Wdeprecated-declarations]
UNLOCK_MANAGER (manager);
^
dbus-gproxy.c: In function ‘dbus_g_proxy_manager_filter’:
dbus-gproxy.c:1209:3: warning: ‘g_static_mutex_get_mutex_impl’ is deprecated (declared at /home/adrien/Téléchargements/SkiffOS/workspaces/default/host/include/glib-2.0/glib/deprecated/gthread.h:154): Use 'GMutex' instead [-Wdeprecated-declarations]
LOCK_MANAGER (manager);
^
dbus-gproxy.c:1230:11: warning: ‘g_static_mutex_get_mutex_impl’ is deprecated (declared at /home/adrien/Téléchargements/SkiffOS/workspaces/default/host/include/glib-2.0/glib/deprecated/gthread.h:154): Use 'GMutex' instead [-Wdeprecated-declarations]
UNLOCK_MANAGER (manager);
^
dbus-gproxy.c:1233:11: warning: ‘g_static_mutex_get_mutex_impl’ is deprecated (declared at /home/adrien/Téléchargements/SkiffOS/workspaces/default/host/include/glib-2.0/glib/deprecated/gthread.h:154): Use 'GMutex' instead [-Wdeprecated-declarations]
LOCK_MANAGER (manager);
^
dbus-gproxy.c:1355:4: warning: ‘g_static_mutex_get_mutex_impl’ is deprecated (declared at /home/adrien/Téléchargements/SkiffOS/workspaces/default/host/include/glib-2.0/glib/deprecated/gthread.h:154): Use 'GMutex' instead [-Wdeprecated-declarations]
UNLOCK_MANAGER (manager);
^
dbus-gproxy.c:1358:4: warning: ‘g_static_mutex_get_mutex_impl’ is deprecated (declared at /home/adrien/Téléchargements/SkiffOS/workspaces/default/host/include/glib-2.0/glib/deprecated/gthread.h:154): Use 'GMutex' instead [-Wdeprecated-declarations]
LOCK_MANAGER (manager);
^
dbus-gproxy.c:1363:3: warning: ‘g_static_mutex_get_mutex_impl’ is deprecated (declared at /home/adrien/Téléchargements/SkiffOS/workspaces/default/host/include/glib-2.0/glib/deprecated/gthread.h:154): Use 'GMutex' instead [-Wdeprecated-declarations]
UNLOCK_MANAGER (manager);
^
dbus-gproxy.c: In function ‘marshal_dbus_message_to_g_marshaller’:
dbus-gproxy.c:1738:3: warning: ‘g_value_array_prepend’ is deprecated (declared at /home/adrien/Téléchargements/SkiffOS/workspaces/default/host/include/glib-2.0/gobject/gvaluearray.h:76): Use 'GArray' instead [-Wdeprecated-declarations]
g_value_array_prepend (value_array, NULL);
^
dbus-gproxy.c:1739:3: warning: ‘g_value_array_get_nth’ is deprecated (declared at /home/adrien/Téléchargements/SkiffOS/workspaces/default/host/include/glib-2.0/gobject/gvaluearray.h:63): Use 'GArray' instead [-Wdeprecated-declarations]
g_value_init (g_value_array_get_nth (value_array, 0), G_TYPE_FROM_INSTANCE (proxy));
^
dbus-gproxy.c:1740:3: warning: ‘g_value_array_get_nth’ is deprecated (declared at /home/adrien/Téléchargements/SkiffOS/workspaces/default/host/include/glib-2.0/gobject/gvaluearray.h:63): Use 'GArray' instead [-Wdeprecated-declarations]
g_value_set_instance (g_value_array_get_nth (value_array, 0), proxy);
^
dbus-gproxy.c:1745:3: warning: ‘g_value_array_free’ is deprecated (declared at /home/adrien/Téléchargements/SkiffOS/workspaces/default/host/include/glib-2.0/gobject/gvaluearray.h:70): Use 'GArray' instead [-Wdeprecated-declarations]
g_value_array_free (value_array);
^
dbus-gproxy.c: In function ‘manager_begin_bus_call’:
dbus-gproxy.c:1921:3: warning: ‘g_value_array_new’ is deprecated (declared at /home/adrien/Téléchargements/SkiffOS/workspaces/default/host/include/glib-2.0/gobject/gvaluearray.h:67): Use 'GArray' instead [-Wdeprecated-declarations]
DBUS_G_VALUE_ARRAY_COLLECT_ALL (arg_values, first_arg_type, args);
^
dbus-gproxy.c:1921:3: warning: ‘g_value_array_append’ is deprecated (declared at /home/adrien/Téléchargements/SkiffOS/workspaces/default/host/include/glib-2.0/gobject/gvaluearray.h:80): Use 'GArray' instead [-Wdeprecated-declarations]
dbus-gproxy.c:1921:3: warning: ‘g_value_array_get_nth’ is deprecated (declared at /home/adrien/Téléchargements/SkiffOS/workspaces/default/host/include/glib-2.0/gobject/gvaluearray.h:63): Use 'GArray' instead [-Wdeprecated-declarations]
dbus-gproxy.c:1921:3: warning: ‘g_value_array_free’ is deprecated (declared at /home/adrien/Téléchargements/SkiffOS/workspaces/default/host/include/glib-2.0/gobject/gvaluearray.h:70): Use 'GArray' instead [-Wdeprecated-declarations]
dbus-gproxy.c:1928:7: warning: ‘g_value_array_free’ is deprecated (declared at /home/adrien/Téléchargements/SkiffOS/workspaces/default/host/include/glib-2.0/gobject/gvaluearray.h:70): Use 'GArray' instead [-Wdeprecated-declarations]
g_value_array_free (arg_values);
^
dbus-gproxy.c: In function ‘dbus_g_proxy_marshal_args_to_message’:
dbus-gproxy.c:2328:7: warning: ‘g_value_array_get_nth’ is deprecated (declared at /home/adrien/Téléchargements/SkiffOS/workspaces/default/host/include/glib-2.0/gobject/gvaluearray.h:63): Use 'GArray' instead [-Wdeprecated-declarations]
gvalue = g_value_array_get_nth (args, i);
^
dbus-gproxy.c: In function ‘dbus_g_proxy_begin_call’:
dbus-gproxy.c:2631:3: warning: ‘g_value_array_new’ is deprecated (declared at /home/adrien/Téléchargements/SkiffOS/workspaces/default/host/include/glib-2.0/gobject/gvaluearray.h:67): Use 'GArray' instead [-Wdeprecated-declarations]
DBUS_G_VALUE_ARRAY_COLLECT_ALL (arg_values, first_arg_type, args);
^
dbus-gproxy.c:2631:3: warning: ‘g_value_array_append’ is deprecated (declared at /home/adrien/Téléchargements/SkiffOS/workspaces/default/host/include/glib-2.0/gobject/gvaluearray.h:80): Use 'GArray' instead [-Wdeprecated-declarations]
dbus-gproxy.c:2631:3: warning: ‘g_value_array_get_nth’ is deprecated (declared at /home/adrien/Téléchargements/SkiffOS/workspaces/default/host/include/glib-2.0/gobject/gvaluearray.h:63): Use 'GArray' instead [-Wdeprecated-declarations]
dbus-gproxy.c:2631:3: warning: ‘g_value_array_free’ is deprecated (declared at /home/adrien/Téléchargements/SkiffOS/workspaces/default/host/include/glib-2.0/gobject/gvaluearray.h:70): Use 'GArray' instead [-Wdeprecated-declarations]
dbus-gproxy.c:2638:7: warning: ‘g_value_array_free’ is deprecated (declared at /home/adrien/Téléchargements/SkiffOS/workspaces/default/host/include/glib-2.0/gobject/gvaluearray.h:70): Use 'GArray' instead [-Wdeprecated-declarations]
g_value_array_free (arg_values);
^
dbus-gproxy.c: In function ‘dbus_g_proxy_begin_call_with_timeout’:
dbus-gproxy.c:2699:3: warning: ‘g_value_array_new’ is deprecated (declared at /home/adrien/Téléchargements/SkiffOS/workspaces/default/host/include/glib-2.0/gobject/gvaluearray.h:67): Use 'GArray' instead [-Wdeprecated-declarations]
DBUS_G_VALUE_ARRAY_COLLECT_ALL (arg_values, first_arg_type, args);
^
dbus-gproxy.c:2699:3: warning: ‘g_value_array_append’ is deprecated (declared at /home/adrien/Téléchargements/SkiffOS/workspaces/default/host/include/glib-2.0/gobject/gvaluearray.h:80): Use 'GArray' instead [-Wdeprecated-declarations]
dbus-gproxy.c:2699:3: warning: ‘g_value_array_get_nth’ is deprecated (declared at /home/adrien/Téléchargements/SkiffOS/workspaces/default/host/include/glib-2.0/gobject/gvaluearray.h:63): Use 'GArray' instead [-Wdeprecated-declarations]
dbus-gproxy.c:2699:3: warning: ‘g_value_array_free’ is deprecated (declared at /home/adrien/Téléchargements/SkiffOS/workspaces/default/host/include/glib-2.0/gobject/gvaluearray.h:70): Use 'GArray' instead [-Wdeprecated-declarations]
dbus-gproxy.c:2706:7: warning: ‘g_value_array_free’ is deprecated (declared at /home/adrien/Téléchargements/SkiffOS/workspaces/default/host/include/glib-2.0/gobject/gvaluearray.h:70): Use 'GArray' instead [-Wdeprecated-declarations]
g_value_array_free (arg_values);
^
dbus-gproxy.c: In function ‘dbus_g_proxy_call’:
dbus-gproxy.c:2808:3: warning: ‘g_value_array_new’ is deprecated (declared at /home/adrien/Téléchargements/SkiffOS/workspaces/default/host/include/glib-2.0/gobject/gvaluearray.h:67): Use 'GArray' instead [-Wdeprecated-declarations]
DBUS_G_VALUE_ARRAY_COLLECT_ALL (in_args, first_arg_type, args);
^
dbus-gproxy.c:2808:3: warning: ‘g_value_array_append’ is deprecated (declared at /home/adrien/Téléchargements/SkiffOS/workspaces/default/host/include/glib-2.0/gobject/gvaluearray.h:80): Use 'GArray' instead [-Wdeprecated-declarations]
dbus-gproxy.c:2808:3: warning: ‘g_value_array_get_nth’ is deprecated (declared at /home/adrien/Téléchargements/SkiffOS/workspaces/default/host/include/glib-2.0/gobject/gvaluearray.h:63): Use 'GArray' instead [-Wdeprecated-declarations]
dbus-gproxy.c:2808:3: warning: ‘g_value_array_free’ is deprecated (declared at /home/adrien/Téléchargements/SkiffOS/workspaces/default/host/include/glib-2.0/gobject/gvaluearray.h:70): Use 'GArray' instead [-Wdeprecated-declarations]
dbus-gproxy.c:2815:7: warning: ‘g_value_array_free’ is deprecated (declared at /home/adrien/Téléchargements/SkiffOS/workspaces/default/host/include/glib-2.0/gobject/gvaluearray.h:70): Use 'GArray' instead [-Wdeprecated-declarations]
g_value_array_free (in_args);
^
dbus-gproxy.c: In function ‘dbus_g_proxy_call_with_timeout’:
dbus-gproxy.c:2871:3: warning: ‘g_value_array_new’ is deprecated (declared at /home/adrien/Téléchargements/SkiffOS/workspaces/default/host/include/glib-2.0/gobject/gvaluearray.h:67): Use 'GArray' instead [-Wdeprecated-declarations]
DBUS_G_VALUE_ARRAY_COLLECT_ALL (in_args, first_arg_type, args);
^
dbus-gproxy.c:2871:3: warning: ‘g_value_array_append’ is deprecated (declared at /home/adrien/Téléchargements/SkiffOS/workspaces/default/host/include/glib-2.0/gobject/gvaluearray.h:80): Use 'GArray' instead [-Wdeprecated-declarations]
dbus-gproxy.c:2871:3: warning: ‘g_value_array_get_nth’ is deprecated (declared at /home/adrien/Téléchargements/SkiffOS/workspaces/default/host/include/glib-2.0/gobject/gvaluearray.h:63): Use 'GArray' instead [-Wdeprecated-declarations]
dbus-gproxy.c:2871:3: warning: ‘g_value_array_free’ is deprecated (declared at /home/adrien/Téléchargements/SkiffOS/workspaces/default/host/include/glib-2.0/gobject/gvaluearray.h:70): Use 'GArray' instead [-Wdeprecated-declarations]
dbus-gproxy.c:2878:7: warning: ‘g_value_array_free’ is deprecated (declared at /home/adrien/Téléchargements/SkiffOS/workspaces/default/host/include/glib-2.0/gobject/gvaluearray.h:70): Use 'GArray' instead [-Wdeprecated-declarations]
g_value_array_free (in_args);
^
dbus-gproxy.c: In function ‘dbus_g_proxy_call_no_reply’:
dbus-gproxy.c:2929:3: warning: ‘g_value_array_new’ is deprecated (declared at /home/adrien/Téléchargements/SkiffOS/workspaces/default/host/include/glib-2.0/gobject/gvaluearray.h:67): Use 'GArray' instead [-Wdeprecated-declarations]
DBUS_G_VALUE_ARRAY_COLLECT_ALL (in_args, first_arg_type, args);
^
dbus-gproxy.c:2929:3: warning: ‘g_value_array_append’ is deprecated (declared at /home/adrien/Téléchargements/SkiffOS/workspaces/default/host/include/glib-2.0/gobject/gvaluearray.h:80): Use 'GArray' instead [-Wdeprecated-declarations]
dbus-gproxy.c:2929:3: warning: ‘g_value_array_get_nth’ is deprecated (declared at /home/adrien/Téléchargements/SkiffOS/workspaces/default/host/include/glib-2.0/gobject/gvaluearray.h:63): Use 'GArray' instead [-Wdeprecated-declarations]
dbus-gproxy.c:2929:3: warning: ‘g_value_array_free’ is deprecated (declared at /home/adrien/Téléchargements/SkiffOS/workspaces/default/host/include/glib-2.0/gobject/gvaluearray.h:70): Use 'GArray' instead [-Wdeprecated-declarations]
dbus-gproxy.c:2935:7: warning: ‘g_value_array_free’ is deprecated (declared at /home/adrien/Téléchargements/SkiffOS/workspaces/default/host/include/glib-2.0/gobject/gvaluearray.h:70): Use 'GArray' instead [-Wdeprecated-declarations]
g_value_array_free (in_args);
^
CC dbus-gvalue-parse-variant.lo
CC dbus-gthread.lo
dbus-gobject.c: In function ‘gerror_domaincode_to_dbus_error_name’:
dbus-gobject.c:1478:7: warning: ‘g_static_rw_lock_reader_lock’ is deprecated (declared at /home/adrien/Téléchargements/SkiffOS/workspaces/default/host/include/glib-2.0/glib/deprecated/gthread.h:216): Use 'g_rw_lock_reader_lock' instead [-Wdeprecated-declarations]
g_static_rw_lock_reader_lock (&globals_lock);
^
dbus-gobject.c:1485:7: warning: ‘g_static_rw_lock_reader_unlock’ is deprecated (declared at /home/adrien/Téléchargements/SkiffOS/workspaces/default/host/include/glib-2.0/glib/deprecated/gthread.h:222): Use 'g_rw_lock_reader_unlock' instead [-Wdeprecated-declarations]
g_static_rw_lock_reader_unlock (&globals_lock);
^
dbus-gobject.c: In function ‘invoke_object_method’:
dbus-gobject.c:1759:3: warning: ‘g_value_array_prepend’ is deprecated (declared at /home/adrien/Téléchargements/SkiffOS/workspaces/default/host/include/glib-2.0/gobject/gvaluearray.h:76): Use 'GArray' instead [-Wdeprecated-declarations]
g_value_array_prepend (value_array, NULL);
^
dbus-gobject.c:1760:3: warning: ‘g_value_array_get_nth’ is deprecated (declared at /home/adrien/Téléchargements/SkiffOS/workspaces/default/host/include/glib-2.0/gobject/gvaluearray.h:63): Use 'GArray' instead [-Wdeprecated-declarations]
g_value_init (g_value_array_get_nth (value_array, 0), G_TYPE_OBJECT);
^
dbus-gobject.c:1761:3: warning: ‘g_value_array_get_nth’ is deprecated (declared at /home/adrien/Téléchargements/SkiffOS/workspaces/default/host/include/glib-2.0/gobject/gvaluearray.h:63): Use 'GArray' instead [-Wdeprecated-declarations]
g_value_set_object (g_value_array_get_nth (value_array, 0), object);
^
dbus-gobject.c:1775:7: warning: ‘g_value_array_append’ is deprecated (declared at /home/adrien/Téléchargements/SkiffOS/workspaces/default/host/include/glib-2.0/gobject/gvaluearray.h:80): Use 'GArray' instead [-Wdeprecated-declarations]
g_value_array_append (value_array, &context_value);
^
dbus-gobject.c:1851:7: warning: ‘g_value_array_new’ is deprecated (declared at /home/adrien/Téléchargements/SkiffOS/workspaces/default/host/include/glib-2.0/gobject/gvaluearray.h:67): Use 'GArray' instead [-Wdeprecated-declarations]
out_param_gvalues = g_value_array_new (out_param_count);
^
dbus-gobject.c:1888:8: warning: ‘g_value_array_append’ is deprecated (declared at /home/adrien/Téléchargements/SkiffOS/workspaces/default/host/include/glib-2.0/gobject/gvaluearray.h:80): Use 'GArray' instead [-Wdeprecated-declarations]
g_value_array_append (out_param_gvalues, NULL);
^
dbus-gobject.c:1892:4: warning: ‘g_value_array_append’ is deprecated (declared at /home/adrien/Téléchargements/SkiffOS/workspaces/default/host/include/glib-2.0/gobject/gvaluearray.h:80): Use 'GArray' instead [-Wdeprecated-declarations]
g_value_array_append (value_array, &value);
^
dbus-gobject.c:1900:7: warning: ‘g_value_array_append’ is deprecated (declared at /home/adrien/Téléchargements/SkiffOS/workspaces/default/host/include/glib-2.0/gobject/gvaluearray.h:80): Use 'GArray' instead [-Wdeprecated-declarations]
g_value_array_append (value_array, NULL);
^
dbus-gobject.c:1901:7: warning: ‘g_value_array_get_nth’ is deprecated (declared at /home/adrien/Téléchargements/SkiffOS/workspaces/default/host/include/glib-2.0/gobject/gvaluearray.h:63): Use 'GArray' instead [-Wdeprecated-declarations]
g_value_init (g_value_array_get_nth (value_array, value_array->n_values - 1), G_TYPE_POINTER);
^
dbus-gobject.c:1902:7: warning: ‘g_value_array_get_nth’ is deprecated (declared at /home/adrien/Téléchargements/SkiffOS/workspaces/default/host/include/glib-2.0/gobject/gvaluearray.h:63): Use 'GArray' instead [-Wdeprecated-declarations]
g_value_set_pointer (g_value_array_get_nth (value_array, value_array->n_values - 1), &gerror);
^
dbus-gobject.c:2043:7: warning: ‘g_value_array_free’ is deprecated (declared at /home/adrien/Téléchargements/SkiffOS/workspaces/default/host/include/glib-2.0/gobject/gvaluearray.h:70): Use 'GArray' instead [-Wdeprecated-declarations]
g_value_array_free (out_param_gvalues);
^
dbus-gobject.c:2049:3: warning: ‘g_value_array_free’ is deprecated (declared at /home/adrien/Téléchargements/SkiffOS/workspaces/default/host/include/glib-2.0/gobject/gvaluearray.h:70): Use 'GArray' instead [-Wdeprecated-declarations]
g_value_array_free (value_array);
^
dbus-gobject.c: In function ‘dbus_g_error_domain_register’:
dbus-gobject.c:2707:3: warning: ‘g_static_rw_lock_writer_lock’ is deprecated (declared at /home/adrien/Téléchargements/SkiffOS/workspaces/default/host/include/glib-2.0/glib/deprecated/gthread.h:225): Use 'g_rw_lock_writer_lock' instead [-Wdeprecated-declarations]
g_static_rw_lock_writer_lock (&globals_lock);
^
dbus-gobject.c:2731:3: warning: ‘g_static_rw_lock_writer_unlock’ is deprecated (declared at /home/adrien/Téléchargements/SkiffOS/workspaces/default/host/include/glib-2.0/glib/deprecated/gthread.h:231): Use 'g_rw_lock_writer_unlock' instead [-Wdeprecated-declarations]
g_static_rw_lock_writer_unlock (&globals_lock);
^
CC dbus-gtype-specialized.lo
CC dbus-gutils.lo
dbus-gvalue.c: In function ‘_dbus_gvalue_to_signature’:
dbus-gvalue.c:507:3: warning: ‘g_value_array_get_type’ is deprecated (declared at /home/adrien/Téléchargements/SkiffOS/workspaces/default/host/include/glib-2.0/gobject/gvaluearray.h:60): Use 'GArray' instead [-Wdeprecated-declarations]
if (g_type_is_a (gtype, G_TYPE_VALUE_ARRAY))
^
dbus-gvalue.c:519:4: warning: ‘g_value_array_get_nth’ is deprecated (declared at /home/adrien/Téléchargements/SkiffOS/workspaces/default/host/include/glib-2.0/gobject/gvaluearray.h:63): Use 'GArray' instead [-Wdeprecated-declarations]
sig = _dbus_gvalue_to_signature (g_value_array_get_nth (array, i));
^
dbus-gvalue.c: In function ‘demarshal_valuearray’:
dbus-gvalue.c:896:3: warning: ‘g_value_array_new’ is deprecated (declared at /home/adrien/Téléchargements/SkiffOS/workspaces/default/host/include/glib-2.0/gobject/gvaluearray.h:67): Use 'GArray' instead [-Wdeprecated-declarations]
ret = g_value_array_new (12);
^
dbus-gvalue.c:904:7: warning: ‘g_value_array_append’ is deprecated (declared at /home/adrien/Téléchargements/SkiffOS/workspaces/default/host/include/glib-2.0/gobject/gvaluearray.h:80): Use 'GArray' instead [-Wdeprecated-declarations]
g_value_array_append (ret, NULL);
^
dbus-gvalue.c:905:7: warning: ‘g_value_array_get_nth’ is deprecated (declared at /home/adrien/Téléchargements/SkiffOS/workspaces/default/host/include/glib-2.0/gobject/gvaluearray.h:63): Use 'GArray' instead [-Wdeprecated-declarations]
val = g_value_array_get_nth (ret, ret->n_values - 1);
^
dbus-gvalue.c:912:4: warning: ‘g_value_array_free’ is deprecated (declared at /home/adrien/Téléchargements/SkiffOS/workspaces/default/host/include/glib-2.0/gobject/gvaluearray.h:70): Use 'GArray' instead [-Wdeprecated-declarations]
g_value_array_free (ret);
^
dbus-gvalue.c:926:4: warning: ‘g_value_array_free’ is deprecated (declared at /home/adrien/Téléchargements/SkiffOS/workspaces/default/host/include/glib-2.0/gobject/gvaluearray.h:70): Use 'GArray' instead [-Wdeprecated-declarations]
g_value_array_free (ret);
^
dbus-gvalue.c: In function ‘get_type_demarshaller’:
dbus-gvalue.c:1099:7: warning: ‘g_value_array_get_type’ is deprecated (declared at /home/adrien/Téléchargements/SkiffOS/workspaces/default/host/include/glib-2.0/gobject/gvaluearray.h:60): Use 'GArray' instead [-Wdeprecated-declarations]
if (g_type_is_a (type, G_TYPE_VALUE_ARRAY))
^
dbus-gvalue.c: In function ‘_dbus_gvalue_demarshal_message’:
dbus-gvalue.c:1300:3: warning: ‘g_value_array_new’ is deprecated (declared at /home/adrien/Téléchargements/SkiffOS/workspaces/default/host/include/glib-2.0/gobject/gvaluearray.h:67): Use 'GArray' instead [-Wdeprecated-declarations]
ret = g_value_array_new (6); /* 6 is a typical maximum for arguments */
^
dbus-gvalue.c:1317:7: warning: ‘g_value_array_append’ is deprecated (declared at /home/adrien/Téléchargements/SkiffOS/workspaces/default/host/include/glib-2.0/gobject/gvaluearray.h:80): Use 'GArray' instead [-Wdeprecated-declarations]
g_value_array_append (ret, NULL);
^
dbus-gvalue.c:1318:7: warning: ‘g_value_array_get_nth’ is deprecated (declared at /home/adrien/Téléchargements/SkiffOS/workspaces/default/host/include/glib-2.0/gobject/gvaluearray.h:63): Use 'GArray' instead [-Wdeprecated-declarations]
value = g_value_array_get_nth (ret, index_);
^
dbus-gvalue.c:1338:3: warning: ‘g_value_array_free’ is deprecated (declared at /home/adrien/Téléchargements/SkiffOS/workspaces/default/host/include/glib-2.0/gobject/gvaluearray.h:70): Use 'GArray' instead [-Wdeprecated-declarations]
g_value_array_free (ret);
^
dbus-gvalue.c: In function ‘marshal_basic’:
dbus-gvalue.c:1360:9: warning: ‘g_value_get_char’ is deprecated (declared at /home/adrien/Téléchargements/SkiffOS/workspaces/default/host/include/glib-2.0/gobject/gvaluetypes.h:182): Use 'g_value_get_schar' instead [-Wdeprecated-declarations]
char b = g_value_get_char (value);
^
dbus-gvalue.c: In function ‘marshal_valuearray’:
dbus-gvalue.c:1538:3: warning: ‘g_value_array_get_type’ is deprecated (declared at /home/adrien/Téléchargements/SkiffOS/workspaces/default/host/include/glib-2.0/gobject/gvaluearray.h:60): Use 'GArray' instead [-Wdeprecated-declarations]
g_assert (G_VALUE_TYPE (value) == G_TYPE_VALUE_ARRAY);
^
dbus-gvalue.c:1552:11: warning: ‘g_value_array_get_nth’ is deprecated (declared at /home/adrien/Téléchargements/SkiffOS/workspaces/default/host/include/glib-2.0/gobject/gvaluearray.h:63): Use 'GArray' instead [-Wdeprecated-declarations]
if (!_dbus_gvalue_marshal (&subiter, g_value_array_get_nth (array, i)))
^
dbus-gvalue.c: In function ‘get_type_marshaller’:
dbus-gvalue.c:1847:7: warning: ‘g_value_array_get_type’ is deprecated (declared at /home/adrien/Téléchargements/SkiffOS/workspaces/default/host/include/glib-2.0/gobject/gvaluearray.h:60): Use 'GArray' instead [-Wdeprecated-declarations]
if (g_type_is_a (type, G_TYPE_VALUE_ARRAY))
^
CC dbus-gsignature.lo
CC dbus-gvalue-utils.lo
dbus-gvalue-parse-variant.c: In function ‘dbus_g_value_tuple_parse_variant’:
dbus-gvalue-parse-variant.c:265:3: warning: ‘g_value_array_new’ is deprecated (declared at /home/adrien/Téléchargements/SkiffOS/workspaces/default/host/include/glib-2.0/gobject/gvaluearray.h:67): Use 'GArray' instead [-Wdeprecated-declarations]
GValueArray *va = g_value_array_new (n);
^
dbus-gvalue-parse-variant.c:281:7: warning: ‘g_value_array_append’ is deprecated (declared at /home/adrien/Téléchargements/SkiffOS/workspaces/default/host/include/glib-2.0/gobject/gvaluearray.h:80): Use 'GArray' instead [-Wdeprecated-declarations]
g_value_array_append (va, NULL);
^
dbus-gvalue-parse-variant.c:293:5: warning: ‘g_value_array_free’ is deprecated (declared at /home/adrien/Téléchargements/SkiffOS/workspaces/default/host/include/glib-2.0/gobject/gvaluearray.h:70): Use 'GArray' instead [-Wdeprecated-declarations]
g_value_array_free (va);
^
CC dbus-gidl.lo
CC dbus-gloader-expat.lo
CC dbus-gparser.lo
CC dbus-binding-tool-glib.o
CC dbus-glib-tool.o
dbus-gvalue-utils.c: In function ‘_dbus_gvalue_store’:
dbus-gvalue-utils.c:85:7: warning: ‘g_value_get_char’ is deprecated (declared at /home/adrien/Téléchargements/SkiffOS/workspaces/default/host/include/glib-2.0/gobject/gvaluetypes.h:182): Use 'g_value_get_schar' instead [-Wdeprecated-declarations]
*((gchar *) storage) = g_value_get_char (value);
^
dbus-gvalue-utils.c: In function ‘_dbus_gvalue_set_from_pointer’:
dbus-gvalue-utils.c:136:7: warning: ‘g_value_set_char’ is deprecated (declared at /home/adrien/Téléchargements/SkiffOS/workspaces/default/host/include/glib-2.0/gobject/gvaluetypes.h:179): Use 'g_value_set_schar' instead [-Wdeprecated-declarations]
g_value_set_char (value, *((gchar *) storage));
^
dbus-gvalue-utils.c: In function ‘hash_simple_free_from_gtype’:
dbus-gvalue-utils.c:321:7: warning: ‘g_value_array_get_type’ is deprecated (declared at /home/adrien/Téléchargements/SkiffOS/workspaces/default/host/include/glib-2.0/gobject/gvaluearray.h:60): Use 'GArray' instead [-Wdeprecated-declarations]
else if (gtype == G_TYPE_VALUE_ARRAY)
^
dbus-gvalue-utils.c:323:11: warning: ‘g_value_array_free’ is deprecated (declared at /home/adrien/Téléchargements/SkiffOS/workspaces/default/host/include/glib-2.0/gobject/gvaluearray.h:70): Use 'GArray' instead [-Wdeprecated-declarations]
*func = (GDestroyNotify) g_value_array_free;
^
dbus-gvalue-utils.c: In function ‘gvalue_take_hash_value’:
dbus-gvalue-utils.c:508:7: warning: ‘g_value_set_char’ is deprecated (declared at /home/adrien/Téléchargements/SkiffOS/workspaces/default/host/include/glib-2.0/gobject/gvaluetypes.h:179): Use 'g_value_set_schar' instead [-Wdeprecated-declarations]
g_value_set_char (value, (gchar) GPOINTER_TO_INT (instance));
^
dbus-gvalue-utils.c: In function ‘hash_value_from_gvalue’:
dbus-gvalue-utils.c:539:7: warning: ‘g_value_get_char’ is deprecated (declared at /home/adrien/Téléchargements/SkiffOS/workspaces/default/host/include/glib-2.0/gobject/gvaluetypes.h:182): Use 'g_value_get_schar' instead [-Wdeprecated-declarations]
return GINT_TO_POINTER ((int) g_value_get_char (value));
^
dbus-gvalue-utils.c: In function ‘valuearray_constructor’:
dbus-gvalue-utils.c:771:3: warning: ‘g_value_array_new’ is deprecated (declared at /home/adrien/Téléchargements/SkiffOS/workspaces/default/host/include/glib-2.0/gobject/gvaluearray.h:67): Use 'GArray' instead [-Wdeprecated-declarations]
ret = g_value_array_new (size);
^
dbus-gvalue-utils.c:776:7: warning: ‘g_value_array_append’ is deprecated (declared at /home/adrien/Téléchargements/SkiffOS/workspaces/default/host/include/glib-2.0/gobject/gvaluearray.h:80): Use 'GArray' instead [-Wdeprecated-declarations]
g_value_array_append(ret, &val);
^
dbus-gvalue-utils.c: In function ‘valuearray_copy’:
dbus-gvalue-utils.c:784:3: warning: ‘g_value_array_copy’ is deprecated (declared at /home/adrien/Téléchargements/SkiffOS/workspaces/default/host/include/glib-2.0/gobject/gvaluearray.h:73): Use 'GArray' instead [-Wdeprecated-declarations]
return g_value_array_copy ((GValueArray*) src);
^
dbus-gvalue-utils.c: In function ‘valuearray_simple_free’:
dbus-gvalue-utils.c:790:3: warning: ‘g_value_array_free’ is deprecated (declared at /home/adrien/Téléchargements/SkiffOS/workspaces/default/host/include/glib-2.0/gobject/gvaluearray.h:70): Use 'GArray' instead [-Wdeprecated-declarations]
g_value_array_free (val);
^
dbus-gvalue-utils.c: In function ‘valuearray_get_member’:
dbus-gvalue-utils.c:801:7: warning: ‘g_value_array_get_nth’ is deprecated (declared at /home/adrien/Téléchargements/SkiffOS/workspaces/default/host/include/glib-2.0/gobject/gvaluearray.h:63): Use 'GArray' instead [-Wdeprecated-declarations]
val = g_value_array_get_nth (va, member);
^
dbus-gvalue-utils.c: In function ‘valuearray_set_member’:
dbus-gvalue-utils.c:817:7: warning: ‘g_value_array_get_nth’ is deprecated (declared at /home/adrien/Téléchargements/SkiffOS/workspaces/default/host/include/glib-2.0/gobject/gvaluearray.h:63): Use 'GArray' instead [-Wdeprecated-declarations]
vp = g_value_array_get_nth (va, member);
^
dbus-gvalue-utils.c: In function ‘array_iterator’:
dbus-gvalue-utils.c:882:13: warning: ‘g_value_set_char’ is deprecated (declared at /home/adrien/Téléchargements/SkiffOS/workspaces/default/host/include/glib-2.0/gobject/gvaluetypes.h:179): Use 'g_value_set_schar' instead [-Wdeprecated-declarations]
g_value_set_char (&val, g_array_index (array, gchar, i));
^
dbus-gvalue-utils.c: In function ‘array_append’:
dbus-gvalue-utils.c:962:9: warning: ‘g_value_get_char’ is deprecated (declared at /home/adrien/Téléchargements/SkiffOS/workspaces/default/host/include/glib-2.0/gobject/gvaluetypes.h:182): Use 'g_value_get_schar' instead [-Wdeprecated-declarations]
tmp.c = g_value_get_char (value);
^
CCLD libdbus-glib-1.la
dbus-binding-tool-glib.c: In function ‘dbus_g_type_get_lookup_function’:
dbus-binding-tool-glib.c:1142:3: warning: ‘g_value_array_get_type’ is deprecated (declared at /home/adrien/Téléchargements/SkiffOS/workspaces/default/host/include/glib-2.0/gobject/gvaluearray.h:60): Use 'GArray' instead [-Wdeprecated-declarations]
MAP_KNOWN(G_TYPE_VALUE_ARRAY);
^
CCLD libdbus-gtool.la
CCLD dbus-binding-tool
Making all in examples
/bin/bash ../../libtool --mode=execute ../../dbus/dbus-binding-tool --prefix=some_object --mode=glib-server --output=example-service-glue.h ./example-service.xml
/bin/bash ../../libtool --mode=execute ../../dbus/dbus-binding-tool --prefix=test_object --mode=glib-server --output=example-signal-emitter-glue.h ./example-signal-emitter.xml
File "/home/adrien/Téléchargements/SkiffOS/workspaces/default/host/bin/glib-genmarshal", line 1
SyntaxError: Non-ASCII character '\xc3' in file /home/adrien/Téléchargements/SkiffOS/workspaces/default/host/bin/glib-genmarshal on line 1, but no encoding declared; see http://python.org/dev/peps/pep-0263/ for details
File "/home/adrien/Téléchargements/SkiffOS/workspaces/default/host/bin/glib-genmarshal", line 1
SyntaxError: Non-ASCII character '\xc3' in file /home/adrien/Téléchargements/SkiffOS/workspaces/default/host/bin/glib-genmarshal on line 1, but no encoding declared; see http://python.org/dev/peps/pep-0263/ for details
/usr/bin/make all-recursive
Making all in .
CC example-service.o
CC example-client.o
CC example-signal-emitter.o
CC example-signal-recipient.o
example-client.c: In function ‘main’:
example-client.c:78:6: warning: ‘g_value_array_get_type’ is deprecated (declared at /home/adrien/Téléchargements/SkiffOS/workspaces/default/host/include/glib-2.0/gobject/gvaluearray.h:60): Use 'GArray' instead [-Wdeprecated-declarations]
G_TYPE_VALUE_ARRAY, &hello_reply_struct, G_TYPE_INVALID))
^
example-client.c:97:7: warning: ‘g_value_array_get_nth’ is deprecated (declared at /home/adrien/Téléchargements/SkiffOS/workspaces/default/host/include/glib-2.0/gobject/gvaluearray.h:63): Use 'GArray' instead [-Wdeprecated-declarations]
if (!g_value_transform (g_value_array_get_nth (hello_reply_struct, i), &strval))
^
example-client.c:99:7: warning: ‘g_value_array_get_nth’ is deprecated (declared at /home/adrien/Téléchargements/SkiffOS/workspaces/default/host/include/glib-2.0/gobject/gvaluearray.h:63): Use 'GArray' instead [-Wdeprecated-declarations]
g_print ("%s: %s\n", g_type_name (G_VALUE_TYPE (g_value_array_get_nth (hello_reply_struct, i))),
^
example-client.c:102:3: warning: ‘g_value_array_free’ is deprecated (declared at /home/adrien/Téléchargements/SkiffOS/workspaces/default/host/include/glib-2.0/gobject/gvaluearray.h:70): Use 'GArray' instead [-Wdeprecated-declarations]
g_value_array_free (hello_reply_struct);
^
CCLD example-client
CCLD example-signal-recipient
In file included from example-signal-emitter.c:65:0:
example-signal-emitter-glue.h:5:48: error: ‘dbus_glib_marshal_test_object_BOOLEAN__POINTER’ undeclared here (not in a function)
{ (GCallback) test_object_emit_hello_signal, dbus_glib_marshal_test_object_BOOLEAN__POINTER, 0 },
^
make[9]: *** [example-signal-emitter.o] Erreur 1
make[9]: *** Attente des tâches non terminées....
In file included from example-service.c:59:0:
example-service-glue.h:5:42: error: ‘dbus_glib_marshal_some_object_BOOLEAN__STRING_POINTER_POINTER’ undeclared here (not in a function)
{ (GCallback) some_object_hello_world, dbus_glib_marshal_some_object_BOOLEAN__STRING_POINTER_POINTER, 0 },
^
example-service-glue.h:6:40: error: ‘dbus_glib_marshal_some_object_BOOLEAN__POINTER_POINTER’ undeclared here (not in a function)
{ (GCallback) some_object_get_tuple, dbus_glib_marshal_some_object_BOOLEAN__POINTER_POINTER, 66 },
^
example-service.c: In function ‘some_object_get_tuple’:
example-service.c:86:3: warning: ‘g_value_array_new’ is deprecated (declared at /home/adrien/Téléchargements/SkiffOS/workspaces/default/host/include/glib-2.0/gobject/gvaluearray.h:67): Use 'GArray' instead [-Wdeprecated-declarations]
*ret = g_value_array_new (6);
^
example-service.c:87:3: warning: ‘g_value_array_prepend’ is deprecated (declared at /home/adrien/Téléchargements/SkiffOS/workspaces/default/host/include/glib-2.0/gobject/gvaluearray.h:76): Use 'GArray' instead [-Wdeprecated-declarations]
g_value_array_prepend (*ret, NULL);
^
example-service.c:88:3: warning: ‘g_value_array_get_nth’ is deprecated (declared at /home/adrien/Téléchargements/SkiffOS/workspaces/default/host/include/glib-2.0/gobject/gvaluearray.h:63): Use 'GArray' instead [-Wdeprecated-declarations]
g_value_init (g_value_array_get_nth (*ret, 0), G_TYPE_STRING);
^
example-service.c:89:3: warning: ‘g_value_array_get_nth’ is deprecated (declared at /home/adrien/Téléchargements/SkiffOS/workspaces/default/host/include/glib-2.0/gobject/gvaluearray.h:63): Use 'GArray' instead [-Wdeprecated-declarations]
g_value_set_string (g_value_array_get_nth (*ret, 0), "hello");
^
example-service.c:90:3: warning: ‘g_value_array_prepend’ is deprecated (declared at /home/adrien/Téléchargements/SkiffOS/workspaces/default/host/include/glib-2.0/gobject/gvaluearray.h:76): Use 'GArray' instead [-Wdeprecated-declarations]
g_value_array_prepend (*ret, NULL);
^
example-service.c:91:3: warning: ‘g_value_array_get_nth’ is deprecated (declared at /home/adrien/Téléchargements/SkiffOS/workspaces/default/host/include/glib-2.0/gobject/gvaluearray.h:63): Use 'GArray' instead [-Wdeprecated-declarations]
g_value_init (g_value_array_get_nth (*ret, 0), G_TYPE_UINT);
^
example-service.c:92:3: warning: ‘g_value_array_get_nth’ is deprecated (declared at /home/adrien/Téléchargements/SkiffOS/workspaces/default/host/include/glib-2.0/gobject/gvaluearray.h:63): Use 'GArray' instead [-Wdeprecated-declarations]
g_value_set_uint (g_value_array_get_nth (*ret, 0), 42);
^
make[9]: *** [example-service.o] Erreur 1
make[8]: *** [all-recursive] Erreur 1
make[7]: *** [all] Erreur 2
make[6]: *** [all-recursive] Erreur 1
make[5]: *** [all-recursive] Erreur 1
make[4]: *** [all] Erreur 2
make[3]: *** [/home/adrien/Téléchargements/SkiffOS/workspaces/default/build/host-dbus-glib-0.108/.stamp_built] Erreur 2
make[2]: *** [_all] Erreur 2
make[2]: quittant le répertoire « /home/adrien/Téléchargements/SkiffOS/workspaces/default »
make[1]: *** [compile] Erreur 2
make[1]: quittant le répertoire « /home/adrien/Téléchargements/SkiffOS/build »
make: *** [compile] Erreur 2
Sign up for free to join this conversation on GitHub. Already have an account? Sign in to comment
You can’t perform that action at this time.