Skip to content

Instantly share code, notes, and snippets.

@alexreg alexreg/log
Created Feb 21, 2013

Embed
What would you like to do?
Shell log for installation of Catkin (as part of ROS)
alex-mbp:ros_catkin_ws alex$ ./src/catkin/bin/catkin_make_isolated --install
Base path: /Users/alex/ros_catkin_ws
Source space: /Users/alex/ros_catkin_ws/src
Build space: /Users/alex/ros_catkin_ws/build_isolated
Devel space: /Users/alex/ros_catkin_ws/devel_isolated
Install space: /Users/alex/ros_catkin_ws/install_isolated
WARNING(s) in /Users/alex/ros_catkin_ws/src/camera_info_manager/package.xml:
- The test dependency on "rostest" is redundant with: build_depend, run_depend
WARNING(s) in /Users/alex/ros_catkin_ws/src/diagnostic_analysis/package.xml:
- The test dependency on "rosbag" is redundant with: build_depend, run_depend
- The test dependency on "rostest" is redundant with: build_depend
- The test dependency on "diagnostic_msgs" is redundant with: build_depend, run_depend
~~~~~~~~~~~~~~~~~~~~~~~~~~~~~~~~~~~~~~~~~~~~~
~~ traversing packages in topological order:
~~ - catkin
~~ - angles
~~ - bond_core (metapackage)
~~ - common_msgs (metapackage)
~~ - console_bridge
~~ - class_loader
~~ - convex_decomposition
~~ - cpp_common
~~ - diagnostics (metapackage)
~~ - driver_common (metapackage)
~~ - flann (plain cmake)
~~ - genmsg
~~ - gencpp
~~ - genlisp
~~ - genpy
~~ - geometry (metapackage)
~~ - image_common (metapackage)
~~ - ivcon
~~ - kdl (metapackage)
~~ - message_generation
~~ - message_runtime
~~ - mk
~~ - nodelet_core (metapackage)
~~ - opencv2 (plain cmake)
~~ - orocos_kdl
~~ - orocos_kinematics_dynamics (metapackage)
~~ - perception_pcl (metapackage)
~~ - python_orocos_kdl
~~ - qt_dotgraph
~~ - qt_gui
~~ - qt_gui_app
~~ - qt_gui_core (metapackage)
~~ - qt_gui_py_common
~~ - ros (metapackage)
~~ - ros_comm (metapackage)
~~ - ros_tutorials (metapackage)
~~ - rosbash
~~ - rosboost_cfg
~~ - rosbuild
~~ - rosclean
~~ - roscpp_traits
~~ - roscreate
~~ - rosgraph
~~ - roslang
~~ - roslaunch
~~ - rosmake
~~ - rosmaster
~~ - rosmsg
~~ - rospack
~~ - roslib
~~ - rosparam
~~ - rospy
~~ - rosservice
~~ - rostime
~~ - roscpp_serialization
~~ - python_qt_binding
~~ - rosunit
~~ - rosconsole
~~ - pluginlib
~~ - qt_gui_cpp
~~ - resource_retriever
~~ - rosconsole_bridge
~~ - rostest
~~ - rqt_bag
~~ - rqt_bag_plugins
~~ - rqt_common_plugins (metapackage)
~~ - rqt_console
~~ - rqt_dep
~~ - rqt_graph
~~ - rqt_gui
~~ - rqt_logger_level
~~ - rqt_msg
~~ - rqt_plot
~~ - rqt_publisher
~~ - rqt_py_common
~~ - rqt_py_console
~~ - rqt_reconfigure
~~ - rqt_service_caller
~~ - rqt_shell
~~ - rqt_srv
~~ - rqt_topic
~~ - rqt_web
~~ - smclib
~~ - std_msgs
~~ - actionlib_msgs
~~ - bond
~~ - diagnostic_msgs
~~ - geometry_msgs
~~ - eigen_conversions
~~ - kdl_conversions
~~ - nav_msgs
~~ - rosgraph_msgs
~~ - bondpy
~~ - diagnostic_common_diagnostics
~~ - rqt_gui_py
~~ - sensor_msgs
~~ - camera_calibration_parsers
~~ - cv_bridge
~~ - image_geometry
~~ - pcl_msgs
~~ - shape_msgs
~~ - std_srvs
~~ - stereo_msgs
~~ - trajectory_msgs
~~ - urdfdom_headers
~~ - srdfdom
~~ - srdf
~~ - urdfdom
~~ - urdf_interface
~~ - urdf_parser
~~ - vision_opencv (metapackage)
~~ - visualization_msgs
~~ - xmlrpcpp
~~ - roscpp
~~ - bondcpp
~~ - collada_parser
~~ - dynamic_reconfigure
~~ - nodelet
~~ - roscpp_tutorials
~~ - rosout
~~ - actionlib
~~ - diagnostic_aggregator
~~ - diagnostic_updater
~~ - message_filters
~~ - image_transport
~~ - camera_info_manager
~~ - polled_camera
~~ - rosnode
~~ - rospy_tutorials
~~ - rostopic
~~ - roswtf
~~ - rqt_gui_cpp
~~ - rqt_image_view
~~ - self_test
~~ - tf
~~ - laser_geometry
~~ - tf_conversions
~~ - timestamp_tools
~~ - topic_tools
~~ - rosbag
~~ - diagnostic_analysis
~~ - driver_base
~~ - interactive_markers
~~ - nodelet_topic_tools
~~ - pcl (plain cmake)
~~ - pcl_ros
~~ - turtlesim
~~ - urdf
~~ - collada_urdf
~~ - kdl_parser
~~ - robot_model (metapackage)
~~ - robot_state_publisher
~~ - rviz
~~~~~~~~~~~~~~~~~~~~~~~~~~~~~~~~~~~~~~~~~~~~~
WARNING(s) in /Users/alex/ros_catkin_ws/src/camera_info_manager/package.xml:
- The test dependency on "rostest" is redundant with: build_depend, run_depend
WARNING(s) in /Users/alex/ros_catkin_ws/src/diagnostic_analysis/package.xml:
- The test dependency on "rosbag" is redundant with: build_depend, run_depend
- The test dependency on "rostest" is redundant with: build_depend
- The test dependency on "diagnostic_msgs" is redundant with: build_depend, run_depend
==> Processing catkin package: 'catkin'
Makefile exists, skipping explicit cmake invocation...
==> make cmake_check_build_system in '/Users/alex/ros_catkin_ws/build_isolated/catkin'
==> make -j8 -l8 in '/Users/alex/ros_catkin_ws/build_isolated/catkin'
==> make install in '/Users/alex/ros_catkin_ws/build_isolated/catkin'
<== Finished processing package [1 of 153]: 'catkin'
==> Processing catkin package: 'angles'
==> Building with env: '/Users/alex/ros_catkin_ws/install_isolated/env.sh'
Makefile exists, skipping explicit cmake invocation...
==> make cmake_check_build_system in '/Users/alex/ros_catkin_ws/build_isolated/angles'
==> make -j8 -l8 in '/Users/alex/ros_catkin_ws/build_isolated/angles'
==> make install in '/Users/alex/ros_catkin_ws/build_isolated/angles'
<== Finished processing package [2 of 153]: 'angles'
==> Skipping metapackage: 'bond_core'
<== Finished processing package [3 of 153]: 'bond_core'
==> Skipping metapackage: 'common_msgs'
<== Finished processing package [4 of 153]: 'common_msgs'
==> Processing catkin package: 'console_bridge'
==> Building with env: '/Users/alex/ros_catkin_ws/install_isolated/env.sh'
Makefile exists, skipping explicit cmake invocation...
==> make cmake_check_build_system in '/Users/alex/ros_catkin_ws/build_isolated/console_bridge'
==> make -j8 -l8 in '/Users/alex/ros_catkin_ws/build_isolated/console_bridge'
==> make install in '/Users/alex/ros_catkin_ws/build_isolated/console_bridge'
<== Finished processing package [5 of 153]: 'console_bridge'
==> Processing catkin package: 'class_loader'
==> Building with env: '/Users/alex/ros_catkin_ws/install_isolated/env.sh'
Makefile exists, skipping explicit cmake invocation...
==> make cmake_check_build_system in '/Users/alex/ros_catkin_ws/build_isolated/class_loader'
==> make -j8 -l8 in '/Users/alex/ros_catkin_ws/build_isolated/class_loader'
==> make install in '/Users/alex/ros_catkin_ws/build_isolated/class_loader'
<== Finished processing package [6 of 153]: 'class_loader'
==> Processing catkin package: 'convex_decomposition'
==> Building with env: '/Users/alex/ros_catkin_ws/install_isolated/env.sh'
Makefile exists, skipping explicit cmake invocation...
==> make cmake_check_build_system in '/Users/alex/ros_catkin_ws/build_isolated/convex_decomposition'
==> make -j8 -l8 in '/Users/alex/ros_catkin_ws/build_isolated/convex_decomposition'
==> make install in '/Users/alex/ros_catkin_ws/build_isolated/convex_decomposition'
<== Finished processing package [7 of 153]: 'convex_decomposition'
==> Processing catkin package: 'cpp_common'
==> Building with env: '/Users/alex/ros_catkin_ws/install_isolated/env.sh'
Makefile exists, skipping explicit cmake invocation...
==> make cmake_check_build_system in '/Users/alex/ros_catkin_ws/build_isolated/cpp_common'
==> make -j8 -l8 in '/Users/alex/ros_catkin_ws/build_isolated/cpp_common'
==> make install in '/Users/alex/ros_catkin_ws/build_isolated/cpp_common'
<== Finished processing package [8 of 153]: 'cpp_common'
==> Skipping metapackage: 'diagnostics'
<== Finished processing package [9 of 153]: 'diagnostics'
==> Skipping metapackage: 'driver_common'
<== Finished processing package [10 of 153]: 'driver_common'
==> Processing plain cmake package: 'flann'
==> Building with env: '/Users/alex/ros_catkin_ws/install_isolated/env.sh'
Makefile exists, skipping explicit cmake invocation...
==> make cmake_check_build_system in '/Users/alex/ros_catkin_ws/build_isolated/flann'
==> make -j8 -l8 in '/Users/alex/ros_catkin_ws/build_isolated/flann'
==> make install in '/Users/alex/ros_catkin_ws/build_isolated/flann'
<== Finished processing package [11 of 153]: 'flann'
==> Processing catkin package: 'genmsg'
==> Building with env: '/Users/alex/ros_catkin_ws/install_isolated/env.sh'
Makefile exists, skipping explicit cmake invocation...
==> make cmake_check_build_system in '/Users/alex/ros_catkin_ws/build_isolated/genmsg'
==> make -j8 -l8 in '/Users/alex/ros_catkin_ws/build_isolated/genmsg'
==> make install in '/Users/alex/ros_catkin_ws/build_isolated/genmsg'
<== Finished processing package [12 of 153]: 'genmsg'
==> Processing catkin package: 'gencpp'
==> Building with env: '/Users/alex/ros_catkin_ws/install_isolated/env.sh'
Makefile exists, skipping explicit cmake invocation...
==> make cmake_check_build_system in '/Users/alex/ros_catkin_ws/build_isolated/gencpp'
==> make -j8 -l8 in '/Users/alex/ros_catkin_ws/build_isolated/gencpp'
==> make install in '/Users/alex/ros_catkin_ws/build_isolated/gencpp'
<== Finished processing package [13 of 153]: 'gencpp'
==> Processing catkin package: 'genlisp'
==> Building with env: '/Users/alex/ros_catkin_ws/install_isolated/env.sh'
Makefile exists, skipping explicit cmake invocation...
==> make cmake_check_build_system in '/Users/alex/ros_catkin_ws/build_isolated/genlisp'
==> make -j8 -l8 in '/Users/alex/ros_catkin_ws/build_isolated/genlisp'
==> make install in '/Users/alex/ros_catkin_ws/build_isolated/genlisp'
<== Finished processing package [14 of 153]: 'genlisp'
==> Processing catkin package: 'genpy'
==> Building with env: '/Users/alex/ros_catkin_ws/install_isolated/env.sh'
Makefile exists, skipping explicit cmake invocation...
==> make cmake_check_build_system in '/Users/alex/ros_catkin_ws/build_isolated/genpy'
==> make -j8 -l8 in '/Users/alex/ros_catkin_ws/build_isolated/genpy'
==> make install in '/Users/alex/ros_catkin_ws/build_isolated/genpy'
<== Finished processing package [15 of 153]: 'genpy'
==> Skipping metapackage: 'geometry'
<== Finished processing package [16 of 153]: 'geometry'
==> Skipping metapackage: 'image_common'
<== Finished processing package [17 of 153]: 'image_common'
==> Processing catkin package: 'ivcon'
==> Building with env: '/Users/alex/ros_catkin_ws/install_isolated/env.sh'
Makefile exists, skipping explicit cmake invocation...
==> make cmake_check_build_system in '/Users/alex/ros_catkin_ws/build_isolated/ivcon'
==> make -j8 -l8 in '/Users/alex/ros_catkin_ws/build_isolated/ivcon'
==> make install in '/Users/alex/ros_catkin_ws/build_isolated/ivcon'
<== Finished processing package [18 of 153]: 'ivcon'
==> Skipping metapackage: 'kdl'
<== Finished processing package [19 of 153]: 'kdl'
==> Processing catkin package: 'message_generation'
==> Building with env: '/Users/alex/ros_catkin_ws/install_isolated/env.sh'
Makefile exists, skipping explicit cmake invocation...
==> make cmake_check_build_system in '/Users/alex/ros_catkin_ws/build_isolated/message_generation'
==> make -j8 -l8 in '/Users/alex/ros_catkin_ws/build_isolated/message_generation'
==> make install in '/Users/alex/ros_catkin_ws/build_isolated/message_generation'
<== Finished processing package [20 of 153]: 'message_generation'
==> Processing catkin package: 'message_runtime'
==> Building with env: '/Users/alex/ros_catkin_ws/install_isolated/env.sh'
Makefile exists, skipping explicit cmake invocation...
==> make cmake_check_build_system in '/Users/alex/ros_catkin_ws/build_isolated/message_runtime'
==> make -j8 -l8 in '/Users/alex/ros_catkin_ws/build_isolated/message_runtime'
==> make install in '/Users/alex/ros_catkin_ws/build_isolated/message_runtime'
<== Finished processing package [21 of 153]: 'message_runtime'
==> Processing catkin package: 'mk'
==> Building with env: '/Users/alex/ros_catkin_ws/install_isolated/env.sh'
Makefile exists, skipping explicit cmake invocation...
==> make cmake_check_build_system in '/Users/alex/ros_catkin_ws/build_isolated/mk'
==> make -j8 -l8 in '/Users/alex/ros_catkin_ws/build_isolated/mk'
==> make install in '/Users/alex/ros_catkin_ws/build_isolated/mk'
<== Finished processing package [22 of 153]: 'mk'
==> Skipping metapackage: 'nodelet_core'
<== Finished processing package [23 of 153]: 'nodelet_core'
==> Processing plain cmake package: 'opencv2'
==> Building with env: '/Users/alex/ros_catkin_ws/install_isolated/env.sh'
Makefile exists, skipping explicit cmake invocation...
==> make cmake_check_build_system in '/Users/alex/ros_catkin_ws/build_isolated/opencv2'
==> make -j8 -l8 in '/Users/alex/ros_catkin_ws/build_isolated/opencv2'
==> make install in '/Users/alex/ros_catkin_ws/build_isolated/opencv2'
<== Finished processing package [24 of 153]: 'opencv2'
==> Processing catkin package: 'orocos_kdl'
==> Building with env: '/Users/alex/ros_catkin_ws/install_isolated/env.sh'
Makefile exists, skipping explicit cmake invocation...
==> make cmake_check_build_system in '/Users/alex/ros_catkin_ws/build_isolated/orocos_kdl'
==> make -j8 -l8 in '/Users/alex/ros_catkin_ws/build_isolated/orocos_kdl'
==> make install in '/Users/alex/ros_catkin_ws/build_isolated/orocos_kdl'
<== Finished processing package [25 of 153]: 'orocos_kdl'
==> Skipping metapackage: 'orocos_kinematics_dynamics'
<== Finished processing package [26 of 153]: 'orocos_kinematics_dynamics'
==> Skipping metapackage: 'perception_pcl'
<== Finished processing package [27 of 153]: 'perception_pcl'
==> Processing catkin package: 'python_orocos_kdl'
==> Building with env: '/Users/alex/ros_catkin_ws/install_isolated/env.sh'
Makefile exists, skipping explicit cmake invocation...
==> make cmake_check_build_system in '/Users/alex/ros_catkin_ws/build_isolated/python_orocos_kdl'
==> make -j8 -l8 in '/Users/alex/ros_catkin_ws/build_isolated/python_orocos_kdl'
==> make install in '/Users/alex/ros_catkin_ws/build_isolated/python_orocos_kdl'
<== Finished processing package [28 of 153]: 'python_orocos_kdl'
==> Processing catkin package: 'qt_dotgraph'
==> Building with env: '/Users/alex/ros_catkin_ws/install_isolated/env.sh'
Makefile exists, skipping explicit cmake invocation...
==> make cmake_check_build_system in '/Users/alex/ros_catkin_ws/build_isolated/qt_dotgraph'
==> make -j8 -l8 in '/Users/alex/ros_catkin_ws/build_isolated/qt_dotgraph'
==> make install in '/Users/alex/ros_catkin_ws/build_isolated/qt_dotgraph'
<== Finished processing package [29 of 153]: 'qt_dotgraph'
==> Processing catkin package: 'qt_gui'
==> Building with env: '/Users/alex/ros_catkin_ws/install_isolated/env.sh'
Makefile exists, skipping explicit cmake invocation...
==> make cmake_check_build_system in '/Users/alex/ros_catkin_ws/build_isolated/qt_gui'
==> make -j8 -l8 in '/Users/alex/ros_catkin_ws/build_isolated/qt_gui'
==> make install in '/Users/alex/ros_catkin_ws/build_isolated/qt_gui'
<== Finished processing package [30 of 153]: 'qt_gui'
==> Processing catkin package: 'qt_gui_app'
==> Building with env: '/Users/alex/ros_catkin_ws/install_isolated/env.sh'
Makefile exists, skipping explicit cmake invocation...
==> make cmake_check_build_system in '/Users/alex/ros_catkin_ws/build_isolated/qt_gui_app'
==> make -j8 -l8 in '/Users/alex/ros_catkin_ws/build_isolated/qt_gui_app'
==> make install in '/Users/alex/ros_catkin_ws/build_isolated/qt_gui_app'
<== Finished processing package [31 of 153]: 'qt_gui_app'
==> Skipping metapackage: 'qt_gui_core'
<== Finished processing package [32 of 153]: 'qt_gui_core'
==> Processing catkin package: 'qt_gui_py_common'
==> Building with env: '/Users/alex/ros_catkin_ws/install_isolated/env.sh'
Makefile exists, skipping explicit cmake invocation...
==> make cmake_check_build_system in '/Users/alex/ros_catkin_ws/build_isolated/qt_gui_py_common'
==> make -j8 -l8 in '/Users/alex/ros_catkin_ws/build_isolated/qt_gui_py_common'
==> make install in '/Users/alex/ros_catkin_ws/build_isolated/qt_gui_py_common'
<== Finished processing package [33 of 153]: 'qt_gui_py_common'
==> Skipping metapackage: 'ros'
<== Finished processing package [34 of 153]: 'ros'
==> Skipping metapackage: 'ros_comm'
<== Finished processing package [35 of 153]: 'ros_comm'
==> Skipping metapackage: 'ros_tutorials'
<== Finished processing package [36 of 153]: 'ros_tutorials'
==> Processing catkin package: 'rosbash'
==> Building with env: '/Users/alex/ros_catkin_ws/install_isolated/env.sh'
Makefile exists, skipping explicit cmake invocation...
==> make cmake_check_build_system in '/Users/alex/ros_catkin_ws/build_isolated/rosbash'
==> make -j8 -l8 in '/Users/alex/ros_catkin_ws/build_isolated/rosbash'
==> make install in '/Users/alex/ros_catkin_ws/build_isolated/rosbash'
<== Finished processing package [37 of 153]: 'rosbash'
==> Processing catkin package: 'rosboost_cfg'
==> Building with env: '/Users/alex/ros_catkin_ws/install_isolated/env.sh'
Makefile exists, skipping explicit cmake invocation...
==> make cmake_check_build_system in '/Users/alex/ros_catkin_ws/build_isolated/rosboost_cfg'
==> make -j8 -l8 in '/Users/alex/ros_catkin_ws/build_isolated/rosboost_cfg'
==> make install in '/Users/alex/ros_catkin_ws/build_isolated/rosboost_cfg'
<== Finished processing package [38 of 153]: 'rosboost_cfg'
==> Processing catkin package: 'rosbuild'
==> Building with env: '/Users/alex/ros_catkin_ws/install_isolated/env.sh'
Makefile exists, skipping explicit cmake invocation...
==> make cmake_check_build_system in '/Users/alex/ros_catkin_ws/build_isolated/rosbuild'
==> make -j8 -l8 in '/Users/alex/ros_catkin_ws/build_isolated/rosbuild'
==> make install in '/Users/alex/ros_catkin_ws/build_isolated/rosbuild'
<== Finished processing package [39 of 153]: 'rosbuild'
==> Processing catkin package: 'rosclean'
==> Building with env: '/Users/alex/ros_catkin_ws/install_isolated/env.sh'
Makefile exists, skipping explicit cmake invocation...
==> make cmake_check_build_system in '/Users/alex/ros_catkin_ws/build_isolated/rosclean'
==> make -j8 -l8 in '/Users/alex/ros_catkin_ws/build_isolated/rosclean'
==> make install in '/Users/alex/ros_catkin_ws/build_isolated/rosclean'
<== Finished processing package [40 of 153]: 'rosclean'
==> Processing catkin package: 'roscpp_traits'
==> Building with env: '/Users/alex/ros_catkin_ws/install_isolated/env.sh'
Makefile exists, skipping explicit cmake invocation...
==> make cmake_check_build_system in '/Users/alex/ros_catkin_ws/build_isolated/roscpp_traits'
==> make -j8 -l8 in '/Users/alex/ros_catkin_ws/build_isolated/roscpp_traits'
==> make install in '/Users/alex/ros_catkin_ws/build_isolated/roscpp_traits'
<== Finished processing package [41 of 153]: 'roscpp_traits'
==> Processing catkin package: 'roscreate'
==> Building with env: '/Users/alex/ros_catkin_ws/install_isolated/env.sh'
Makefile exists, skipping explicit cmake invocation...
==> make cmake_check_build_system in '/Users/alex/ros_catkin_ws/build_isolated/roscreate'
==> make -j8 -l8 in '/Users/alex/ros_catkin_ws/build_isolated/roscreate'
==> make install in '/Users/alex/ros_catkin_ws/build_isolated/roscreate'
<== Finished processing package [42 of 153]: 'roscreate'
==> Processing catkin package: 'rosgraph'
==> Building with env: '/Users/alex/ros_catkin_ws/install_isolated/env.sh'
Makefile exists, skipping explicit cmake invocation...
==> make cmake_check_build_system in '/Users/alex/ros_catkin_ws/build_isolated/rosgraph'
==> make -j8 -l8 in '/Users/alex/ros_catkin_ws/build_isolated/rosgraph'
==> make install in '/Users/alex/ros_catkin_ws/build_isolated/rosgraph'
<== Finished processing package [43 of 153]: 'rosgraph'
==> Processing catkin package: 'roslang'
==> Building with env: '/Users/alex/ros_catkin_ws/install_isolated/env.sh'
Makefile exists, skipping explicit cmake invocation...
==> make cmake_check_build_system in '/Users/alex/ros_catkin_ws/build_isolated/roslang'
==> make -j8 -l8 in '/Users/alex/ros_catkin_ws/build_isolated/roslang'
==> make install in '/Users/alex/ros_catkin_ws/build_isolated/roslang'
<== Finished processing package [44 of 153]: 'roslang'
==> Processing catkin package: 'roslaunch'
==> Building with env: '/Users/alex/ros_catkin_ws/install_isolated/env.sh'
Makefile exists, skipping explicit cmake invocation...
==> make cmake_check_build_system in '/Users/alex/ros_catkin_ws/build_isolated/roslaunch'
==> make -j8 -l8 in '/Users/alex/ros_catkin_ws/build_isolated/roslaunch'
==> make install in '/Users/alex/ros_catkin_ws/build_isolated/roslaunch'
<== Finished processing package [45 of 153]: 'roslaunch'
==> Processing catkin package: 'rosmake'
==> Building with env: '/Users/alex/ros_catkin_ws/install_isolated/env.sh'
Makefile exists, skipping explicit cmake invocation...
==> make cmake_check_build_system in '/Users/alex/ros_catkin_ws/build_isolated/rosmake'
==> make -j8 -l8 in '/Users/alex/ros_catkin_ws/build_isolated/rosmake'
==> make install in '/Users/alex/ros_catkin_ws/build_isolated/rosmake'
<== Finished processing package [46 of 153]: 'rosmake'
==> Processing catkin package: 'rosmaster'
==> Building with env: '/Users/alex/ros_catkin_ws/install_isolated/env.sh'
Makefile exists, skipping explicit cmake invocation...
==> make cmake_check_build_system in '/Users/alex/ros_catkin_ws/build_isolated/rosmaster'
==> make -j8 -l8 in '/Users/alex/ros_catkin_ws/build_isolated/rosmaster'
==> make install in '/Users/alex/ros_catkin_ws/build_isolated/rosmaster'
<== Finished processing package [47 of 153]: 'rosmaster'
==> Processing catkin package: 'rosmsg'
==> Building with env: '/Users/alex/ros_catkin_ws/install_isolated/env.sh'
Makefile exists, skipping explicit cmake invocation...
==> make cmake_check_build_system in '/Users/alex/ros_catkin_ws/build_isolated/rosmsg'
==> make -j8 -l8 in '/Users/alex/ros_catkin_ws/build_isolated/rosmsg'
==> make install in '/Users/alex/ros_catkin_ws/build_isolated/rosmsg'
<== Finished processing package [48 of 153]: 'rosmsg'
==> Processing catkin package: 'rospack'
==> Building with env: '/Users/alex/ros_catkin_ws/install_isolated/env.sh'
Makefile exists, skipping explicit cmake invocation...
==> make cmake_check_build_system in '/Users/alex/ros_catkin_ws/build_isolated/rospack'
==> make -j8 -l8 in '/Users/alex/ros_catkin_ws/build_isolated/rospack'
==> make install in '/Users/alex/ros_catkin_ws/build_isolated/rospack'
<== Finished processing package [49 of 153]: 'rospack'
==> Processing catkin package: 'roslib'
==> Building with env: '/Users/alex/ros_catkin_ws/install_isolated/env.sh'
Makefile exists, skipping explicit cmake invocation...
==> make cmake_check_build_system in '/Users/alex/ros_catkin_ws/build_isolated/roslib'
==> make -j8 -l8 in '/Users/alex/ros_catkin_ws/build_isolated/roslib'
==> make install in '/Users/alex/ros_catkin_ws/build_isolated/roslib'
<== Finished processing package [50 of 153]: 'roslib'
==> Processing catkin package: 'rosparam'
==> Building with env: '/Users/alex/ros_catkin_ws/install_isolated/env.sh'
Makefile exists, skipping explicit cmake invocation...
==> make cmake_check_build_system in '/Users/alex/ros_catkin_ws/build_isolated/rosparam'
==> make -j8 -l8 in '/Users/alex/ros_catkin_ws/build_isolated/rosparam'
==> make install in '/Users/alex/ros_catkin_ws/build_isolated/rosparam'
<== Finished processing package [51 of 153]: 'rosparam'
==> Processing catkin package: 'rospy'
==> Building with env: '/Users/alex/ros_catkin_ws/install_isolated/env.sh'
Makefile exists, skipping explicit cmake invocation...
==> make cmake_check_build_system in '/Users/alex/ros_catkin_ws/build_isolated/rospy'
==> make -j8 -l8 in '/Users/alex/ros_catkin_ws/build_isolated/rospy'
==> make install in '/Users/alex/ros_catkin_ws/build_isolated/rospy'
<== Finished processing package [52 of 153]: 'rospy'
==> Processing catkin package: 'rosservice'
==> Building with env: '/Users/alex/ros_catkin_ws/install_isolated/env.sh'
Makefile exists, skipping explicit cmake invocation...
==> make cmake_check_build_system in '/Users/alex/ros_catkin_ws/build_isolated/rosservice'
==> make -j8 -l8 in '/Users/alex/ros_catkin_ws/build_isolated/rosservice'
==> make install in '/Users/alex/ros_catkin_ws/build_isolated/rosservice'
<== Finished processing package [53 of 153]: 'rosservice'
==> Processing catkin package: 'rostime'
==> Building with env: '/Users/alex/ros_catkin_ws/install_isolated/env.sh'
Makefile exists, skipping explicit cmake invocation...
==> make cmake_check_build_system in '/Users/alex/ros_catkin_ws/build_isolated/rostime'
==> make -j8 -l8 in '/Users/alex/ros_catkin_ws/build_isolated/rostime'
==> make install in '/Users/alex/ros_catkin_ws/build_isolated/rostime'
<== Finished processing package [54 of 153]: 'rostime'
==> Processing catkin package: 'roscpp_serialization'
==> Building with env: '/Users/alex/ros_catkin_ws/install_isolated/env.sh'
Makefile exists, skipping explicit cmake invocation...
==> make cmake_check_build_system in '/Users/alex/ros_catkin_ws/build_isolated/roscpp_serialization'
==> make -j8 -l8 in '/Users/alex/ros_catkin_ws/build_isolated/roscpp_serialization'
==> make install in '/Users/alex/ros_catkin_ws/build_isolated/roscpp_serialization'
<== Finished processing package [55 of 153]: 'roscpp_serialization'
==> Processing catkin package: 'python_qt_binding'
==> Building with env: '/Users/alex/ros_catkin_ws/install_isolated/env.sh'
Makefile exists, skipping explicit cmake invocation...
==> make cmake_check_build_system in '/Users/alex/ros_catkin_ws/build_isolated/python_qt_binding'
==> make -j8 -l8 in '/Users/alex/ros_catkin_ws/build_isolated/python_qt_binding'
==> make install in '/Users/alex/ros_catkin_ws/build_isolated/python_qt_binding'
<== Finished processing package [56 of 153]: 'python_qt_binding'
==> Processing catkin package: 'rosunit'
==> Building with env: '/Users/alex/ros_catkin_ws/install_isolated/env.sh'
Makefile exists, skipping explicit cmake invocation...
==> make cmake_check_build_system in '/Users/alex/ros_catkin_ws/build_isolated/rosunit'
==> make -j8 -l8 in '/Users/alex/ros_catkin_ws/build_isolated/rosunit'
==> make install in '/Users/alex/ros_catkin_ws/build_isolated/rosunit'
<== Finished processing package [57 of 153]: 'rosunit'
==> Processing catkin package: 'rosconsole'
==> Building with env: '/Users/alex/ros_catkin_ws/install_isolated/env.sh'
Makefile exists, skipping explicit cmake invocation...
==> make cmake_check_build_system in '/Users/alex/ros_catkin_ws/build_isolated/rosconsole'
==> make -j8 -l8 in '/Users/alex/ros_catkin_ws/build_isolated/rosconsole'
==> make install in '/Users/alex/ros_catkin_ws/build_isolated/rosconsole'
<== Finished processing package [58 of 153]: 'rosconsole'
==> Processing catkin package: 'pluginlib'
==> Building with env: '/Users/alex/ros_catkin_ws/install_isolated/env.sh'
Makefile exists, skipping explicit cmake invocation...
==> make cmake_check_build_system in '/Users/alex/ros_catkin_ws/build_isolated/pluginlib'
==> make -j8 -l8 in '/Users/alex/ros_catkin_ws/build_isolated/pluginlib'
==> make install in '/Users/alex/ros_catkin_ws/build_isolated/pluginlib'
<== Finished processing package [59 of 153]: 'pluginlib'
==> Processing catkin package: 'qt_gui_cpp'
==> Building with env: '/Users/alex/ros_catkin_ws/install_isolated/env.sh'
Makefile exists, skipping explicit cmake invocation...
==> make cmake_check_build_system in '/Users/alex/ros_catkin_ws/build_isolated/qt_gui_cpp'
==> make -j8 -l8 in '/Users/alex/ros_catkin_ws/build_isolated/qt_gui_cpp'
==> make install in '/Users/alex/ros_catkin_ws/build_isolated/qt_gui_cpp'
<== Finished processing package [60 of 153]: 'qt_gui_cpp'
==> Processing catkin package: 'resource_retriever'
==> Building with env: '/Users/alex/ros_catkin_ws/install_isolated/env.sh'
Makefile exists, skipping explicit cmake invocation...
==> make cmake_check_build_system in '/Users/alex/ros_catkin_ws/build_isolated/resource_retriever'
==> make -j8 -l8 in '/Users/alex/ros_catkin_ws/build_isolated/resource_retriever'
==> make install in '/Users/alex/ros_catkin_ws/build_isolated/resource_retriever'
<== Finished processing package [61 of 153]: 'resource_retriever'
==> Processing catkin package: 'rosconsole_bridge'
==> Building with env: '/Users/alex/ros_catkin_ws/install_isolated/env.sh'
Makefile exists, skipping explicit cmake invocation...
==> make cmake_check_build_system in '/Users/alex/ros_catkin_ws/build_isolated/rosconsole_bridge'
==> make -j8 -l8 in '/Users/alex/ros_catkin_ws/build_isolated/rosconsole_bridge'
==> make install in '/Users/alex/ros_catkin_ws/build_isolated/rosconsole_bridge'
<== Finished processing package [62 of 153]: 'rosconsole_bridge'
==> Processing catkin package: 'rostest'
==> Building with env: '/Users/alex/ros_catkin_ws/install_isolated/env.sh'
Makefile exists, skipping explicit cmake invocation...
==> make cmake_check_build_system in '/Users/alex/ros_catkin_ws/build_isolated/rostest'
==> make -j8 -l8 in '/Users/alex/ros_catkin_ws/build_isolated/rostest'
==> make install in '/Users/alex/ros_catkin_ws/build_isolated/rostest'
<== Finished processing package [63 of 153]: 'rostest'
==> Processing catkin package: 'rqt_bag'
==> Building with env: '/Users/alex/ros_catkin_ws/install_isolated/env.sh'
Makefile exists, skipping explicit cmake invocation...
==> make cmake_check_build_system in '/Users/alex/ros_catkin_ws/build_isolated/rqt_bag'
==> make -j8 -l8 in '/Users/alex/ros_catkin_ws/build_isolated/rqt_bag'
==> make install in '/Users/alex/ros_catkin_ws/build_isolated/rqt_bag'
<== Finished processing package [64 of 153]: 'rqt_bag'
==> Processing catkin package: 'rqt_bag_plugins'
==> Building with env: '/Users/alex/ros_catkin_ws/install_isolated/env.sh'
Makefile exists, skipping explicit cmake invocation...
==> make cmake_check_build_system in '/Users/alex/ros_catkin_ws/build_isolated/rqt_bag_plugins'
==> make -j8 -l8 in '/Users/alex/ros_catkin_ws/build_isolated/rqt_bag_plugins'
==> make install in '/Users/alex/ros_catkin_ws/build_isolated/rqt_bag_plugins'
<== Finished processing package [65 of 153]: 'rqt_bag_plugins'
==> Skipping metapackage: 'rqt_common_plugins'
<== Finished processing package [66 of 153]: 'rqt_common_plugins'
==> Processing catkin package: 'rqt_console'
==> Building with env: '/Users/alex/ros_catkin_ws/install_isolated/env.sh'
Makefile exists, skipping explicit cmake invocation...
==> make cmake_check_build_system in '/Users/alex/ros_catkin_ws/build_isolated/rqt_console'
==> make -j8 -l8 in '/Users/alex/ros_catkin_ws/build_isolated/rqt_console'
==> make install in '/Users/alex/ros_catkin_ws/build_isolated/rqt_console'
<== Finished processing package [67 of 153]: 'rqt_console'
==> Processing catkin package: 'rqt_dep'
==> Building with env: '/Users/alex/ros_catkin_ws/install_isolated/env.sh'
Makefile exists, skipping explicit cmake invocation...
==> make cmake_check_build_system in '/Users/alex/ros_catkin_ws/build_isolated/rqt_dep'
==> make -j8 -l8 in '/Users/alex/ros_catkin_ws/build_isolated/rqt_dep'
==> make install in '/Users/alex/ros_catkin_ws/build_isolated/rqt_dep'
<== Finished processing package [68 of 153]: 'rqt_dep'
==> Processing catkin package: 'rqt_graph'
==> Building with env: '/Users/alex/ros_catkin_ws/install_isolated/env.sh'
Makefile exists, skipping explicit cmake invocation...
==> make cmake_check_build_system in '/Users/alex/ros_catkin_ws/build_isolated/rqt_graph'
==> make -j8 -l8 in '/Users/alex/ros_catkin_ws/build_isolated/rqt_graph'
==> make install in '/Users/alex/ros_catkin_ws/build_isolated/rqt_graph'
<== Finished processing package [69 of 153]: 'rqt_graph'
==> Processing catkin package: 'rqt_gui'
==> Building with env: '/Users/alex/ros_catkin_ws/install_isolated/env.sh'
Makefile exists, skipping explicit cmake invocation...
==> make cmake_check_build_system in '/Users/alex/ros_catkin_ws/build_isolated/rqt_gui'
==> make -j8 -l8 in '/Users/alex/ros_catkin_ws/build_isolated/rqt_gui'
==> make install in '/Users/alex/ros_catkin_ws/build_isolated/rqt_gui'
<== Finished processing package [70 of 153]: 'rqt_gui'
==> Processing catkin package: 'rqt_logger_level'
==> Building with env: '/Users/alex/ros_catkin_ws/install_isolated/env.sh'
Makefile exists, skipping explicit cmake invocation...
==> make cmake_check_build_system in '/Users/alex/ros_catkin_ws/build_isolated/rqt_logger_level'
==> make -j8 -l8 in '/Users/alex/ros_catkin_ws/build_isolated/rqt_logger_level'
==> make install in '/Users/alex/ros_catkin_ws/build_isolated/rqt_logger_level'
<== Finished processing package [71 of 153]: 'rqt_logger_level'
==> Processing catkin package: 'rqt_msg'
==> Building with env: '/Users/alex/ros_catkin_ws/install_isolated/env.sh'
Makefile exists, skipping explicit cmake invocation...
==> make cmake_check_build_system in '/Users/alex/ros_catkin_ws/build_isolated/rqt_msg'
==> make -j8 -l8 in '/Users/alex/ros_catkin_ws/build_isolated/rqt_msg'
==> make install in '/Users/alex/ros_catkin_ws/build_isolated/rqt_msg'
<== Finished processing package [72 of 153]: 'rqt_msg'
==> Processing catkin package: 'rqt_plot'
==> Building with env: '/Users/alex/ros_catkin_ws/install_isolated/env.sh'
Makefile exists, skipping explicit cmake invocation...
==> make cmake_check_build_system in '/Users/alex/ros_catkin_ws/build_isolated/rqt_plot'
==> make -j8 -l8 in '/Users/alex/ros_catkin_ws/build_isolated/rqt_plot'
==> make install in '/Users/alex/ros_catkin_ws/build_isolated/rqt_plot'
<== Finished processing package [73 of 153]: 'rqt_plot'
==> Processing catkin package: 'rqt_publisher'
==> Building with env: '/Users/alex/ros_catkin_ws/install_isolated/env.sh'
Makefile exists, skipping explicit cmake invocation...
==> make cmake_check_build_system in '/Users/alex/ros_catkin_ws/build_isolated/rqt_publisher'
==> make -j8 -l8 in '/Users/alex/ros_catkin_ws/build_isolated/rqt_publisher'
==> make install in '/Users/alex/ros_catkin_ws/build_isolated/rqt_publisher'
<== Finished processing package [74 of 153]: 'rqt_publisher'
==> Processing catkin package: 'rqt_py_common'
==> Building with env: '/Users/alex/ros_catkin_ws/install_isolated/env.sh'
Makefile exists, skipping explicit cmake invocation...
==> make cmake_check_build_system in '/Users/alex/ros_catkin_ws/build_isolated/rqt_py_common'
==> make -j8 -l8 in '/Users/alex/ros_catkin_ws/build_isolated/rqt_py_common'
==> make install in '/Users/alex/ros_catkin_ws/build_isolated/rqt_py_common'
<== Finished processing package [75 of 153]: 'rqt_py_common'
==> Processing catkin package: 'rqt_py_console'
==> Building with env: '/Users/alex/ros_catkin_ws/install_isolated/env.sh'
Makefile exists, skipping explicit cmake invocation...
==> make cmake_check_build_system in '/Users/alex/ros_catkin_ws/build_isolated/rqt_py_console'
==> make -j8 -l8 in '/Users/alex/ros_catkin_ws/build_isolated/rqt_py_console'
==> make install in '/Users/alex/ros_catkin_ws/build_isolated/rqt_py_console'
<== Finished processing package [76 of 153]: 'rqt_py_console'
==> Processing catkin package: 'rqt_reconfigure'
==> Building with env: '/Users/alex/ros_catkin_ws/install_isolated/env.sh'
Makefile exists, skipping explicit cmake invocation...
==> make cmake_check_build_system in '/Users/alex/ros_catkin_ws/build_isolated/rqt_reconfigure'
==> make -j8 -l8 in '/Users/alex/ros_catkin_ws/build_isolated/rqt_reconfigure'
==> make install in '/Users/alex/ros_catkin_ws/build_isolated/rqt_reconfigure'
<== Finished processing package [77 of 153]: 'rqt_reconfigure'
==> Processing catkin package: 'rqt_service_caller'
==> Building with env: '/Users/alex/ros_catkin_ws/install_isolated/env.sh'
Makefile exists, skipping explicit cmake invocation...
==> make cmake_check_build_system in '/Users/alex/ros_catkin_ws/build_isolated/rqt_service_caller'
==> make -j8 -l8 in '/Users/alex/ros_catkin_ws/build_isolated/rqt_service_caller'
==> make install in '/Users/alex/ros_catkin_ws/build_isolated/rqt_service_caller'
<== Finished processing package [78 of 153]: 'rqt_service_caller'
==> Processing catkin package: 'rqt_shell'
==> Building with env: '/Users/alex/ros_catkin_ws/install_isolated/env.sh'
Makefile exists, skipping explicit cmake invocation...
==> make cmake_check_build_system in '/Users/alex/ros_catkin_ws/build_isolated/rqt_shell'
==> make -j8 -l8 in '/Users/alex/ros_catkin_ws/build_isolated/rqt_shell'
==> make install in '/Users/alex/ros_catkin_ws/build_isolated/rqt_shell'
<== Finished processing package [79 of 153]: 'rqt_shell'
==> Processing catkin package: 'rqt_srv'
==> Building with env: '/Users/alex/ros_catkin_ws/install_isolated/env.sh'
Makefile exists, skipping explicit cmake invocation...
==> make cmake_check_build_system in '/Users/alex/ros_catkin_ws/build_isolated/rqt_srv'
==> make -j8 -l8 in '/Users/alex/ros_catkin_ws/build_isolated/rqt_srv'
==> make install in '/Users/alex/ros_catkin_ws/build_isolated/rqt_srv'
<== Finished processing package [80 of 153]: 'rqt_srv'
==> Processing catkin package: 'rqt_topic'
==> Building with env: '/Users/alex/ros_catkin_ws/install_isolated/env.sh'
Makefile exists, skipping explicit cmake invocation...
==> make cmake_check_build_system in '/Users/alex/ros_catkin_ws/build_isolated/rqt_topic'
==> make -j8 -l8 in '/Users/alex/ros_catkin_ws/build_isolated/rqt_topic'
==> make install in '/Users/alex/ros_catkin_ws/build_isolated/rqt_topic'
<== Finished processing package [81 of 153]: 'rqt_topic'
==> Processing catkin package: 'rqt_web'
==> Building with env: '/Users/alex/ros_catkin_ws/install_isolated/env.sh'
Makefile exists, skipping explicit cmake invocation...
==> make cmake_check_build_system in '/Users/alex/ros_catkin_ws/build_isolated/rqt_web'
==> make -j8 -l8 in '/Users/alex/ros_catkin_ws/build_isolated/rqt_web'
==> make install in '/Users/alex/ros_catkin_ws/build_isolated/rqt_web'
<== Finished processing package [82 of 153]: 'rqt_web'
==> Processing catkin package: 'smclib'
==> Building with env: '/Users/alex/ros_catkin_ws/install_isolated/env.sh'
Makefile exists, skipping explicit cmake invocation...
==> make cmake_check_build_system in '/Users/alex/ros_catkin_ws/build_isolated/smclib'
==> make -j8 -l8 in '/Users/alex/ros_catkin_ws/build_isolated/smclib'
==> make install in '/Users/alex/ros_catkin_ws/build_isolated/smclib'
<== Finished processing package [83 of 153]: 'smclib'
==> Processing catkin package: 'std_msgs'
==> Building with env: '/Users/alex/ros_catkin_ws/install_isolated/env.sh'
Makefile exists, skipping explicit cmake invocation...
==> make cmake_check_build_system in '/Users/alex/ros_catkin_ws/build_isolated/std_msgs'
==> make -j8 -l8 in '/Users/alex/ros_catkin_ws/build_isolated/std_msgs'
==> make install in '/Users/alex/ros_catkin_ws/build_isolated/std_msgs'
<== Finished processing package [84 of 153]: 'std_msgs'
==> Processing catkin package: 'actionlib_msgs'
==> Building with env: '/Users/alex/ros_catkin_ws/install_isolated/env.sh'
Makefile exists, skipping explicit cmake invocation...
==> make cmake_check_build_system in '/Users/alex/ros_catkin_ws/build_isolated/actionlib_msgs'
==> make -j8 -l8 in '/Users/alex/ros_catkin_ws/build_isolated/actionlib_msgs'
==> make install in '/Users/alex/ros_catkin_ws/build_isolated/actionlib_msgs'
<== Finished processing package [85 of 153]: 'actionlib_msgs'
==> Processing catkin package: 'bond'
==> Building with env: '/Users/alex/ros_catkin_ws/install_isolated/env.sh'
Makefile exists, skipping explicit cmake invocation...
==> make cmake_check_build_system in '/Users/alex/ros_catkin_ws/build_isolated/bond'
==> make -j8 -l8 in '/Users/alex/ros_catkin_ws/build_isolated/bond'
==> make install in '/Users/alex/ros_catkin_ws/build_isolated/bond'
<== Finished processing package [86 of 153]: 'bond'
==> Processing catkin package: 'diagnostic_msgs'
==> Building with env: '/Users/alex/ros_catkin_ws/install_isolated/env.sh'
Makefile exists, skipping explicit cmake invocation...
==> make cmake_check_build_system in '/Users/alex/ros_catkin_ws/build_isolated/diagnostic_msgs'
==> make -j8 -l8 in '/Users/alex/ros_catkin_ws/build_isolated/diagnostic_msgs'
==> make install in '/Users/alex/ros_catkin_ws/build_isolated/diagnostic_msgs'
<== Finished processing package [87 of 153]: 'diagnostic_msgs'
==> Processing catkin package: 'geometry_msgs'
==> Building with env: '/Users/alex/ros_catkin_ws/install_isolated/env.sh'
Makefile exists, skipping explicit cmake invocation...
==> make cmake_check_build_system in '/Users/alex/ros_catkin_ws/build_isolated/geometry_msgs'
==> make -j8 -l8 in '/Users/alex/ros_catkin_ws/build_isolated/geometry_msgs'
==> make install in '/Users/alex/ros_catkin_ws/build_isolated/geometry_msgs'
<== Finished processing package [88 of 153]: 'geometry_msgs'
==> Processing catkin package: 'eigen_conversions'
==> Building with env: '/Users/alex/ros_catkin_ws/install_isolated/env.sh'
Makefile exists, skipping explicit cmake invocation...
==> make cmake_check_build_system in '/Users/alex/ros_catkin_ws/build_isolated/eigen_conversions'
==> make -j8 -l8 in '/Users/alex/ros_catkin_ws/build_isolated/eigen_conversions'
==> make install in '/Users/alex/ros_catkin_ws/build_isolated/eigen_conversions'
<== Finished processing package [89 of 153]: 'eigen_conversions'
==> Processing catkin package: 'kdl_conversions'
==> Building with env: '/Users/alex/ros_catkin_ws/install_isolated/env.sh'
Makefile exists, skipping explicit cmake invocation...
==> make cmake_check_build_system in '/Users/alex/ros_catkin_ws/build_isolated/kdl_conversions'
==> make -j8 -l8 in '/Users/alex/ros_catkin_ws/build_isolated/kdl_conversions'
==> make install in '/Users/alex/ros_catkin_ws/build_isolated/kdl_conversions'
<== Finished processing package [90 of 153]: 'kdl_conversions'
==> Processing catkin package: 'nav_msgs'
==> Building with env: '/Users/alex/ros_catkin_ws/install_isolated/env.sh'
Makefile exists, skipping explicit cmake invocation...
==> make cmake_check_build_system in '/Users/alex/ros_catkin_ws/build_isolated/nav_msgs'
==> make -j8 -l8 in '/Users/alex/ros_catkin_ws/build_isolated/nav_msgs'
==> make install in '/Users/alex/ros_catkin_ws/build_isolated/nav_msgs'
<== Finished processing package [91 of 153]: 'nav_msgs'
==> Processing catkin package: 'rosgraph_msgs'
==> Building with env: '/Users/alex/ros_catkin_ws/install_isolated/env.sh'
Makefile exists, skipping explicit cmake invocation...
==> make cmake_check_build_system in '/Users/alex/ros_catkin_ws/build_isolated/rosgraph_msgs'
==> make -j8 -l8 in '/Users/alex/ros_catkin_ws/build_isolated/rosgraph_msgs'
==> make install in '/Users/alex/ros_catkin_ws/build_isolated/rosgraph_msgs'
<== Finished processing package [92 of 153]: 'rosgraph_msgs'
==> Processing catkin package: 'bondpy'
==> Building with env: '/Users/alex/ros_catkin_ws/install_isolated/env.sh'
Makefile exists, skipping explicit cmake invocation...
==> make cmake_check_build_system in '/Users/alex/ros_catkin_ws/build_isolated/bondpy'
==> make -j8 -l8 in '/Users/alex/ros_catkin_ws/build_isolated/bondpy'
==> make install in '/Users/alex/ros_catkin_ws/build_isolated/bondpy'
<== Finished processing package [93 of 153]: 'bondpy'
==> Processing catkin package: 'diagnostic_common_diagnostics'
==> Building with env: '/Users/alex/ros_catkin_ws/install_isolated/env.sh'
Makefile exists, skipping explicit cmake invocation...
==> make cmake_check_build_system in '/Users/alex/ros_catkin_ws/build_isolated/diagnostic_common_diagnostics'
==> make -j8 -l8 in '/Users/alex/ros_catkin_ws/build_isolated/diagnostic_common_diagnostics'
==> make install in '/Users/alex/ros_catkin_ws/build_isolated/diagnostic_common_diagnostics'
<== Finished processing package [94 of 153]: 'diagnostic_common_diagnostics'
==> Processing catkin package: 'rqt_gui_py'
==> Building with env: '/Users/alex/ros_catkin_ws/install_isolated/env.sh'
Makefile exists, skipping explicit cmake invocation...
==> make cmake_check_build_system in '/Users/alex/ros_catkin_ws/build_isolated/rqt_gui_py'
==> make -j8 -l8 in '/Users/alex/ros_catkin_ws/build_isolated/rqt_gui_py'
==> make install in '/Users/alex/ros_catkin_ws/build_isolated/rqt_gui_py'
<== Finished processing package [95 of 153]: 'rqt_gui_py'
==> Processing catkin package: 'sensor_msgs'
==> Building with env: '/Users/alex/ros_catkin_ws/install_isolated/env.sh'
Makefile exists, skipping explicit cmake invocation...
==> make cmake_check_build_system in '/Users/alex/ros_catkin_ws/build_isolated/sensor_msgs'
==> make -j8 -l8 in '/Users/alex/ros_catkin_ws/build_isolated/sensor_msgs'
==> make install in '/Users/alex/ros_catkin_ws/build_isolated/sensor_msgs'
<== Finished processing package [96 of 153]: 'sensor_msgs'
==> Processing catkin package: 'camera_calibration_parsers'
==> Building with env: '/Users/alex/ros_catkin_ws/install_isolated/env.sh'
Makefile exists, skipping explicit cmake invocation...
==> make cmake_check_build_system in '/Users/alex/ros_catkin_ws/build_isolated/camera_calibration_parsers'
==> make -j8 -l8 in '/Users/alex/ros_catkin_ws/build_isolated/camera_calibration_parsers'
==> make install in '/Users/alex/ros_catkin_ws/build_isolated/camera_calibration_parsers'
<== Finished processing package [97 of 153]: 'camera_calibration_parsers'
==> Processing catkin package: 'cv_bridge'
==> Building with env: '/Users/alex/ros_catkin_ws/install_isolated/env.sh'
Makefile exists, skipping explicit cmake invocation...
==> make cmake_check_build_system in '/Users/alex/ros_catkin_ws/build_isolated/cv_bridge'
==> make -j8 -l8 in '/Users/alex/ros_catkin_ws/build_isolated/cv_bridge'
==> make install in '/Users/alex/ros_catkin_ws/build_isolated/cv_bridge'
<== Finished processing package [98 of 153]: 'cv_bridge'
==> Processing catkin package: 'image_geometry'
==> Building with env: '/Users/alex/ros_catkin_ws/install_isolated/env.sh'
Makefile exists, skipping explicit cmake invocation...
==> make cmake_check_build_system in '/Users/alex/ros_catkin_ws/build_isolated/image_geometry'
==> make -j8 -l8 in '/Users/alex/ros_catkin_ws/build_isolated/image_geometry'
==> make install in '/Users/alex/ros_catkin_ws/build_isolated/image_geometry'
<== Finished processing package [99 of 153]: 'image_geometry'
==> Processing catkin package: 'pcl_msgs'
==> Building with env: '/Users/alex/ros_catkin_ws/install_isolated/env.sh'
Makefile exists, skipping explicit cmake invocation...
==> make cmake_check_build_system in '/Users/alex/ros_catkin_ws/build_isolated/pcl_msgs'
==> make -j8 -l8 in '/Users/alex/ros_catkin_ws/build_isolated/pcl_msgs'
==> make install in '/Users/alex/ros_catkin_ws/build_isolated/pcl_msgs'
<== Finished processing package [100 of 153]: 'pcl_msgs'
==> Processing catkin package: 'shape_msgs'
==> Building with env: '/Users/alex/ros_catkin_ws/install_isolated/env.sh'
Makefile exists, skipping explicit cmake invocation...
==> make cmake_check_build_system in '/Users/alex/ros_catkin_ws/build_isolated/shape_msgs'
==> make -j8 -l8 in '/Users/alex/ros_catkin_ws/build_isolated/shape_msgs'
==> make install in '/Users/alex/ros_catkin_ws/build_isolated/shape_msgs'
<== Finished processing package [101 of 153]: 'shape_msgs'
==> Processing catkin package: 'std_srvs'
==> Building with env: '/Users/alex/ros_catkin_ws/install_isolated/env.sh'
Makefile exists, skipping explicit cmake invocation...
==> make cmake_check_build_system in '/Users/alex/ros_catkin_ws/build_isolated/std_srvs'
==> make -j8 -l8 in '/Users/alex/ros_catkin_ws/build_isolated/std_srvs'
==> make install in '/Users/alex/ros_catkin_ws/build_isolated/std_srvs'
<== Finished processing package [102 of 153]: 'std_srvs'
==> Processing catkin package: 'stereo_msgs'
==> Building with env: '/Users/alex/ros_catkin_ws/install_isolated/env.sh'
Makefile exists, skipping explicit cmake invocation...
==> make cmake_check_build_system in '/Users/alex/ros_catkin_ws/build_isolated/stereo_msgs'
==> make -j8 -l8 in '/Users/alex/ros_catkin_ws/build_isolated/stereo_msgs'
==> make install in '/Users/alex/ros_catkin_ws/build_isolated/stereo_msgs'
<== Finished processing package [103 of 153]: 'stereo_msgs'
==> Processing catkin package: 'trajectory_msgs'
==> Building with env: '/Users/alex/ros_catkin_ws/install_isolated/env.sh'
Makefile exists, skipping explicit cmake invocation...
==> make cmake_check_build_system in '/Users/alex/ros_catkin_ws/build_isolated/trajectory_msgs'
==> make -j8 -l8 in '/Users/alex/ros_catkin_ws/build_isolated/trajectory_msgs'
==> make install in '/Users/alex/ros_catkin_ws/build_isolated/trajectory_msgs'
<== Finished processing package [104 of 153]: 'trajectory_msgs'
==> Processing catkin package: 'urdfdom_headers'
==> Building with env: '/Users/alex/ros_catkin_ws/install_isolated/env.sh'
Makefile exists, skipping explicit cmake invocation...
==> make cmake_check_build_system in '/Users/alex/ros_catkin_ws/build_isolated/urdfdom_headers'
==> make -j8 -l8 in '/Users/alex/ros_catkin_ws/build_isolated/urdfdom_headers'
==> make install in '/Users/alex/ros_catkin_ws/build_isolated/urdfdom_headers'
<== Finished processing package [105 of 153]: 'urdfdom_headers'
==> Processing catkin package: 'srdfdom'
==> Building with env: '/Users/alex/ros_catkin_ws/install_isolated/env.sh'
Makefile exists, skipping explicit cmake invocation...
==> make cmake_check_build_system in '/Users/alex/ros_catkin_ws/build_isolated/srdfdom'
==> make -j8 -l8 in '/Users/alex/ros_catkin_ws/build_isolated/srdfdom'
==> make install in '/Users/alex/ros_catkin_ws/build_isolated/srdfdom'
<== Finished processing package [106 of 153]: 'srdfdom'
==> Processing catkin package: 'srdf'
==> Building with env: '/Users/alex/ros_catkin_ws/install_isolated/env.sh'
Makefile exists, skipping explicit cmake invocation...
==> make cmake_check_build_system in '/Users/alex/ros_catkin_ws/build_isolated/srdf'
==> make -j8 -l8 in '/Users/alex/ros_catkin_ws/build_isolated/srdf'
==> make install in '/Users/alex/ros_catkin_ws/build_isolated/srdf'
<== Finished processing package [107 of 153]: 'srdf'
==> Processing catkin package: 'urdfdom'
==> Building with env: '/Users/alex/ros_catkin_ws/install_isolated/env.sh'
Makefile exists, skipping explicit cmake invocation...
==> make cmake_check_build_system in '/Users/alex/ros_catkin_ws/build_isolated/urdfdom'
==> make -j8 -l8 in '/Users/alex/ros_catkin_ws/build_isolated/urdfdom'
==> make install in '/Users/alex/ros_catkin_ws/build_isolated/urdfdom'
<== Finished processing package [108 of 153]: 'urdfdom'
==> Processing catkin package: 'urdf_interface'
==> Building with env: '/Users/alex/ros_catkin_ws/install_isolated/env.sh'
Makefile exists, skipping explicit cmake invocation...
==> make cmake_check_build_system in '/Users/alex/ros_catkin_ws/build_isolated/urdf_interface'
==> make -j8 -l8 in '/Users/alex/ros_catkin_ws/build_isolated/urdf_interface'
==> make install in '/Users/alex/ros_catkin_ws/build_isolated/urdf_interface'
<== Finished processing package [109 of 153]: 'urdf_interface'
==> Processing catkin package: 'urdf_parser'
==> Building with env: '/Users/alex/ros_catkin_ws/install_isolated/env.sh'
Makefile exists, skipping explicit cmake invocation...
==> make cmake_check_build_system in '/Users/alex/ros_catkin_ws/build_isolated/urdf_parser'
==> make -j8 -l8 in '/Users/alex/ros_catkin_ws/build_isolated/urdf_parser'
==> make install in '/Users/alex/ros_catkin_ws/build_isolated/urdf_parser'
<== Finished processing package [110 of 153]: 'urdf_parser'
==> Skipping metapackage: 'vision_opencv'
<== Finished processing package [111 of 153]: 'vision_opencv'
==> Processing catkin package: 'visualization_msgs'
==> Building with env: '/Users/alex/ros_catkin_ws/install_isolated/env.sh'
Makefile exists, skipping explicit cmake invocation...
==> make cmake_check_build_system in '/Users/alex/ros_catkin_ws/build_isolated/visualization_msgs'
==> make -j8 -l8 in '/Users/alex/ros_catkin_ws/build_isolated/visualization_msgs'
==> make install in '/Users/alex/ros_catkin_ws/build_isolated/visualization_msgs'
<== Finished processing package [112 of 153]: 'visualization_msgs'
==> Processing catkin package: 'xmlrpcpp'
==> Building with env: '/Users/alex/ros_catkin_ws/install_isolated/env.sh'
Makefile exists, skipping explicit cmake invocation...
==> make cmake_check_build_system in '/Users/alex/ros_catkin_ws/build_isolated/xmlrpcpp'
==> make -j8 -l8 in '/Users/alex/ros_catkin_ws/build_isolated/xmlrpcpp'
==> make install in '/Users/alex/ros_catkin_ws/build_isolated/xmlrpcpp'
<== Finished processing package [113 of 153]: 'xmlrpcpp'
==> Processing catkin package: 'roscpp'
==> Building with env: '/Users/alex/ros_catkin_ws/install_isolated/env.sh'
Makefile exists, skipping explicit cmake invocation...
==> make cmake_check_build_system in '/Users/alex/ros_catkin_ws/build_isolated/roscpp'
==> make -j8 -l8 in '/Users/alex/ros_catkin_ws/build_isolated/roscpp'
==> make install in '/Users/alex/ros_catkin_ws/build_isolated/roscpp'
<== Finished processing package [114 of 153]: 'roscpp'
==> Processing catkin package: 'bondcpp'
==> Building with env: '/Users/alex/ros_catkin_ws/install_isolated/env.sh'
Makefile exists, skipping explicit cmake invocation...
==> make cmake_check_build_system in '/Users/alex/ros_catkin_ws/build_isolated/bondcpp'
==> make -j8 -l8 in '/Users/alex/ros_catkin_ws/build_isolated/bondcpp'
==> make install in '/Users/alex/ros_catkin_ws/build_isolated/bondcpp'
<== Finished processing package [115 of 153]: 'bondcpp'
==> Processing catkin package: 'collada_parser'
==> Building with env: '/Users/alex/ros_catkin_ws/install_isolated/env.sh'
Makefile exists, skipping explicit cmake invocation...
==> make cmake_check_build_system in '/Users/alex/ros_catkin_ws/build_isolated/collada_parser'
==> make -j8 -l8 in '/Users/alex/ros_catkin_ws/build_isolated/collada_parser'
==> make install in '/Users/alex/ros_catkin_ws/build_isolated/collada_parser'
<== Finished processing package [116 of 153]: 'collada_parser'
==> Processing catkin package: 'dynamic_reconfigure'
==> Building with env: '/Users/alex/ros_catkin_ws/install_isolated/env.sh'
Makefile exists, skipping explicit cmake invocation...
==> make cmake_check_build_system in '/Users/alex/ros_catkin_ws/build_isolated/dynamic_reconfigure'
==> make -j8 -l8 in '/Users/alex/ros_catkin_ws/build_isolated/dynamic_reconfigure'
==> make install in '/Users/alex/ros_catkin_ws/build_isolated/dynamic_reconfigure'
<== Finished processing package [117 of 153]: 'dynamic_reconfigure'
==> Processing catkin package: 'nodelet'
==> Building with env: '/Users/alex/ros_catkin_ws/install_isolated/env.sh'
Makefile exists, skipping explicit cmake invocation...
==> make cmake_check_build_system in '/Users/alex/ros_catkin_ws/build_isolated/nodelet'
==> make -j8 -l8 in '/Users/alex/ros_catkin_ws/build_isolated/nodelet'
==> make install in '/Users/alex/ros_catkin_ws/build_isolated/nodelet'
<== Finished processing package [118 of 153]: 'nodelet'
==> Processing catkin package: 'roscpp_tutorials'
==> Building with env: '/Users/alex/ros_catkin_ws/install_isolated/env.sh'
Makefile exists, skipping explicit cmake invocation...
==> make cmake_check_build_system in '/Users/alex/ros_catkin_ws/build_isolated/roscpp_tutorials'
==> make -j8 -l8 in '/Users/alex/ros_catkin_ws/build_isolated/roscpp_tutorials'
==> make install in '/Users/alex/ros_catkin_ws/build_isolated/roscpp_tutorials'
<== Finished processing package [119 of 153]: 'roscpp_tutorials'
==> Processing catkin package: 'rosout'
==> Building with env: '/Users/alex/ros_catkin_ws/install_isolated/env.sh'
Makefile exists, skipping explicit cmake invocation...
==> make cmake_check_build_system in '/Users/alex/ros_catkin_ws/build_isolated/rosout'
==> make -j8 -l8 in '/Users/alex/ros_catkin_ws/build_isolated/rosout'
==> make install in '/Users/alex/ros_catkin_ws/build_isolated/rosout'
<== Finished processing package [120 of 153]: 'rosout'
==> Processing catkin package: 'actionlib'
==> Building with env: '/Users/alex/ros_catkin_ws/install_isolated/env.sh'
Makefile exists, skipping explicit cmake invocation...
==> make cmake_check_build_system in '/Users/alex/ros_catkin_ws/build_isolated/actionlib'
==> make -j8 -l8 in '/Users/alex/ros_catkin_ws/build_isolated/actionlib'
==> make install in '/Users/alex/ros_catkin_ws/build_isolated/actionlib'
<== Finished processing package [121 of 153]: 'actionlib'
==> Processing catkin package: 'diagnostic_aggregator'
==> Building with env: '/Users/alex/ros_catkin_ws/install_isolated/env.sh'
Makefile exists, skipping explicit cmake invocation...
==> make cmake_check_build_system in '/Users/alex/ros_catkin_ws/build_isolated/diagnostic_aggregator'
==> make -j8 -l8 in '/Users/alex/ros_catkin_ws/build_isolated/diagnostic_aggregator'
==> make install in '/Users/alex/ros_catkin_ws/build_isolated/diagnostic_aggregator'
<== Finished processing package [122 of 153]: 'diagnostic_aggregator'
==> Processing catkin package: 'diagnostic_updater'
==> Building with env: '/Users/alex/ros_catkin_ws/install_isolated/env.sh'
Makefile exists, skipping explicit cmake invocation...
==> make cmake_check_build_system in '/Users/alex/ros_catkin_ws/build_isolated/diagnostic_updater'
==> make -j8 -l8 in '/Users/alex/ros_catkin_ws/build_isolated/diagnostic_updater'
==> make install in '/Users/alex/ros_catkin_ws/build_isolated/diagnostic_updater'
<== Finished processing package [123 of 153]: 'diagnostic_updater'
==> Processing catkin package: 'message_filters'
==> Building with env: '/Users/alex/ros_catkin_ws/install_isolated/env.sh'
Makefile exists, skipping explicit cmake invocation...
==> make cmake_check_build_system in '/Users/alex/ros_catkin_ws/build_isolated/message_filters'
==> make -j8 -l8 in '/Users/alex/ros_catkin_ws/build_isolated/message_filters'
==> make install in '/Users/alex/ros_catkin_ws/build_isolated/message_filters'
<== Finished processing package [124 of 153]: 'message_filters'
==> Processing catkin package: 'image_transport'
==> Building with env: '/Users/alex/ros_catkin_ws/install_isolated/env.sh'
Makefile exists, skipping explicit cmake invocation...
==> make cmake_check_build_system in '/Users/alex/ros_catkin_ws/build_isolated/image_transport'
==> make -j8 -l8 in '/Users/alex/ros_catkin_ws/build_isolated/image_transport'
==> make install in '/Users/alex/ros_catkin_ws/build_isolated/image_transport'
<== Finished processing package [125 of 153]: 'image_transport'
==> Processing catkin package: 'camera_info_manager'
==> Building with env: '/Users/alex/ros_catkin_ws/install_isolated/env.sh'
Makefile exists, skipping explicit cmake invocation...
==> make cmake_check_build_system in '/Users/alex/ros_catkin_ws/build_isolated/camera_info_manager'
==> make -j8 -l8 in '/Users/alex/ros_catkin_ws/build_isolated/camera_info_manager'
==> make install in '/Users/alex/ros_catkin_ws/build_isolated/camera_info_manager'
<== Finished processing package [126 of 153]: 'camera_info_manager'
==> Processing catkin package: 'polled_camera'
==> Building with env: '/Users/alex/ros_catkin_ws/install_isolated/env.sh'
Makefile exists, skipping explicit cmake invocation...
==> make cmake_check_build_system in '/Users/alex/ros_catkin_ws/build_isolated/polled_camera'
==> make -j8 -l8 in '/Users/alex/ros_catkin_ws/build_isolated/polled_camera'
==> make install in '/Users/alex/ros_catkin_ws/build_isolated/polled_camera'
<== Finished processing package [127 of 153]: 'polled_camera'
==> Processing catkin package: 'rosnode'
==> Building with env: '/Users/alex/ros_catkin_ws/install_isolated/env.sh'
Makefile exists, skipping explicit cmake invocation...
==> make cmake_check_build_system in '/Users/alex/ros_catkin_ws/build_isolated/rosnode'
==> make -j8 -l8 in '/Users/alex/ros_catkin_ws/build_isolated/rosnode'
==> make install in '/Users/alex/ros_catkin_ws/build_isolated/rosnode'
<== Finished processing package [128 of 153]: 'rosnode'
==> Processing catkin package: 'rospy_tutorials'
==> Building with env: '/Users/alex/ros_catkin_ws/install_isolated/env.sh'
Makefile exists, skipping explicit cmake invocation...
==> make cmake_check_build_system in '/Users/alex/ros_catkin_ws/build_isolated/rospy_tutorials'
==> make -j8 -l8 in '/Users/alex/ros_catkin_ws/build_isolated/rospy_tutorials'
==> make install in '/Users/alex/ros_catkin_ws/build_isolated/rospy_tutorials'
<== Finished processing package [129 of 153]: 'rospy_tutorials'
==> Processing catkin package: 'rostopic'
==> Building with env: '/Users/alex/ros_catkin_ws/install_isolated/env.sh'
Makefile exists, skipping explicit cmake invocation...
==> make cmake_check_build_system in '/Users/alex/ros_catkin_ws/build_isolated/rostopic'
==> make -j8 -l8 in '/Users/alex/ros_catkin_ws/build_isolated/rostopic'
==> make install in '/Users/alex/ros_catkin_ws/build_isolated/rostopic'
<== Finished processing package [130 of 153]: 'rostopic'
==> Processing catkin package: 'roswtf'
==> Building with env: '/Users/alex/ros_catkin_ws/install_isolated/env.sh'
Makefile exists, skipping explicit cmake invocation...
==> make cmake_check_build_system in '/Users/alex/ros_catkin_ws/build_isolated/roswtf'
==> make -j8 -l8 in '/Users/alex/ros_catkin_ws/build_isolated/roswtf'
==> make install in '/Users/alex/ros_catkin_ws/build_isolated/roswtf'
<== Finished processing package [131 of 153]: 'roswtf'
==> Processing catkin package: 'rqt_gui_cpp'
==> Building with env: '/Users/alex/ros_catkin_ws/install_isolated/env.sh'
Makefile exists, skipping explicit cmake invocation...
==> make cmake_check_build_system in '/Users/alex/ros_catkin_ws/build_isolated/rqt_gui_cpp'
==> make -j8 -l8 in '/Users/alex/ros_catkin_ws/build_isolated/rqt_gui_cpp'
==> make install in '/Users/alex/ros_catkin_ws/build_isolated/rqt_gui_cpp'
<== Finished processing package [132 of 153]: 'rqt_gui_cpp'
==> Processing catkin package: 'rqt_image_view'
==> Building with env: '/Users/alex/ros_catkin_ws/install_isolated/env.sh'
Makefile exists, skipping explicit cmake invocation...
==> make cmake_check_build_system in '/Users/alex/ros_catkin_ws/build_isolated/rqt_image_view'
==> make -j8 -l8 in '/Users/alex/ros_catkin_ws/build_isolated/rqt_image_view'
==> make install in '/Users/alex/ros_catkin_ws/build_isolated/rqt_image_view'
<== Finished processing package [133 of 153]: 'rqt_image_view'
==> Processing catkin package: 'self_test'
==> Building with env: '/Users/alex/ros_catkin_ws/install_isolated/env.sh'
Makefile exists, skipping explicit cmake invocation...
==> make cmake_check_build_system in '/Users/alex/ros_catkin_ws/build_isolated/self_test'
==> make -j8 -l8 in '/Users/alex/ros_catkin_ws/build_isolated/self_test'
==> make install in '/Users/alex/ros_catkin_ws/build_isolated/self_test'
<== Finished processing package [134 of 153]: 'self_test'
==> Processing catkin package: 'tf'
==> Building with env: '/Users/alex/ros_catkin_ws/install_isolated/env.sh'
Makefile exists, skipping explicit cmake invocation...
==> make cmake_check_build_system in '/Users/alex/ros_catkin_ws/build_isolated/tf'
==> make -j8 -l8 in '/Users/alex/ros_catkin_ws/build_isolated/tf'
==> make install in '/Users/alex/ros_catkin_ws/build_isolated/tf'
<== Finished processing package [135 of 153]: 'tf'
==> Processing catkin package: 'laser_geometry'
==> Building with env: '/Users/alex/ros_catkin_ws/install_isolated/env.sh'
Makefile exists, skipping explicit cmake invocation...
==> make cmake_check_build_system in '/Users/alex/ros_catkin_ws/build_isolated/laser_geometry'
==> make -j8 -l8 in '/Users/alex/ros_catkin_ws/build_isolated/laser_geometry'
==> make install in '/Users/alex/ros_catkin_ws/build_isolated/laser_geometry'
<== Finished processing package [136 of 153]: 'laser_geometry'
==> Processing catkin package: 'tf_conversions'
==> Building with env: '/Users/alex/ros_catkin_ws/install_isolated/env.sh'
Makefile exists, skipping explicit cmake invocation...
==> make cmake_check_build_system in '/Users/alex/ros_catkin_ws/build_isolated/tf_conversions'
==> make -j8 -l8 in '/Users/alex/ros_catkin_ws/build_isolated/tf_conversions'
==> make install in '/Users/alex/ros_catkin_ws/build_isolated/tf_conversions'
<== Finished processing package [137 of 153]: 'tf_conversions'
==> Processing catkin package: 'timestamp_tools'
==> Building with env: '/Users/alex/ros_catkin_ws/install_isolated/env.sh'
Makefile exists, skipping explicit cmake invocation...
==> make cmake_check_build_system in '/Users/alex/ros_catkin_ws/build_isolated/timestamp_tools'
==> make -j8 -l8 in '/Users/alex/ros_catkin_ws/build_isolated/timestamp_tools'
==> make install in '/Users/alex/ros_catkin_ws/build_isolated/timestamp_tools'
<== Finished processing package [138 of 153]: 'timestamp_tools'
==> Processing catkin package: 'topic_tools'
==> Building with env: '/Users/alex/ros_catkin_ws/install_isolated/env.sh'
Makefile exists, skipping explicit cmake invocation...
==> make cmake_check_build_system in '/Users/alex/ros_catkin_ws/build_isolated/topic_tools'
==> make -j8 -l8 in '/Users/alex/ros_catkin_ws/build_isolated/topic_tools'
==> make install in '/Users/alex/ros_catkin_ws/build_isolated/topic_tools'
<== Finished processing package [139 of 153]: 'topic_tools'
==> Processing catkin package: 'rosbag'
==> Building with env: '/Users/alex/ros_catkin_ws/install_isolated/env.sh'
Makefile exists, skipping explicit cmake invocation...
==> make cmake_check_build_system in '/Users/alex/ros_catkin_ws/build_isolated/rosbag'
==> make -j8 -l8 in '/Users/alex/ros_catkin_ws/build_isolated/rosbag'
==> make install in '/Users/alex/ros_catkin_ws/build_isolated/rosbag'
<== Finished processing package [140 of 153]: 'rosbag'
==> Processing catkin package: 'diagnostic_analysis'
==> Building with env: '/Users/alex/ros_catkin_ws/install_isolated/env.sh'
Makefile exists, skipping explicit cmake invocation...
==> make cmake_check_build_system in '/Users/alex/ros_catkin_ws/build_isolated/diagnostic_analysis'
==> make -j8 -l8 in '/Users/alex/ros_catkin_ws/build_isolated/diagnostic_analysis'
==> make install in '/Users/alex/ros_catkin_ws/build_isolated/diagnostic_analysis'
<== Finished processing package [141 of 153]: 'diagnostic_analysis'
==> Processing catkin package: 'driver_base'
==> Building with env: '/Users/alex/ros_catkin_ws/install_isolated/env.sh'
Makefile exists, skipping explicit cmake invocation...
==> make cmake_check_build_system in '/Users/alex/ros_catkin_ws/build_isolated/driver_base'
==> make -j8 -l8 in '/Users/alex/ros_catkin_ws/build_isolated/driver_base'
==> make install in '/Users/alex/ros_catkin_ws/build_isolated/driver_base'
<== Finished processing package [142 of 153]: 'driver_base'
==> Processing catkin package: 'interactive_markers'
==> Building with env: '/Users/alex/ros_catkin_ws/install_isolated/env.sh'
Makefile exists, skipping explicit cmake invocation...
==> make cmake_check_build_system in '/Users/alex/ros_catkin_ws/build_isolated/interactive_markers'
==> make -j8 -l8 in '/Users/alex/ros_catkin_ws/build_isolated/interactive_markers'
==> make install in '/Users/alex/ros_catkin_ws/build_isolated/interactive_markers'
<== Finished processing package [143 of 153]: 'interactive_markers'
==> Processing catkin package: 'nodelet_topic_tools'
==> Building with env: '/Users/alex/ros_catkin_ws/install_isolated/env.sh'
Makefile exists, skipping explicit cmake invocation...
==> make cmake_check_build_system in '/Users/alex/ros_catkin_ws/build_isolated/nodelet_topic_tools'
==> make -j8 -l8 in '/Users/alex/ros_catkin_ws/build_isolated/nodelet_topic_tools'
==> make install in '/Users/alex/ros_catkin_ws/build_isolated/nodelet_topic_tools'
<== Finished processing package [144 of 153]: 'nodelet_topic_tools'
==> Processing plain cmake package: 'pcl'
==> Building with env: '/Users/alex/ros_catkin_ws/install_isolated/env.sh'
Makefile exists, skipping explicit cmake invocation...
==> make cmake_check_build_system in '/Users/alex/ros_catkin_ws/build_isolated/pcl'
==> make -j8 -l8 in '/Users/alex/ros_catkin_ws/build_isolated/pcl'
[ 0%] Built target pcl_pcd_convert_NaN_nan
[ 1%] Built target test_vector_average
[ 2%] Built target pcl_io_ply
[ 2%] Built target pcl_octree
[ 2%] Built target pcl_plyheader
[ 3%] [ 3%] [ 3%] Building CXX object io/tools/ply/CMakeFiles/pcl_ply2obj.dir/ply2obj.cpp.o
Building CXX object io/tools/ply/CMakeFiles/pcl_ply2raw.dir/ply2raw.cpp.o
Building CXX object io/tools/ply/CMakeFiles/pcl_ply2ply.dir/ply2ply.cpp.o
Linking CXX shared library ../lib/libpcl_common.dylib
clang: warning: unknown warning option '-Wl'
[ 8%] Built target pcl_common
Linking CXX executable test_macros
clang: warning: unknown warning option '-Wl'
[ 9%] Built target test_macros
Linking CXX executable test_gaussian
[ 9%] Linking CXX executable test_common
Building CXX object common/test/CMakeFiles/test_intensity.dir/test_intensity.cpp.o
clang: warning: unknown warning option '-Wl'
clang: warning: unknown warning option '-Wl'
[ 9%] Built target test_gaussian
[ 9%] Built target test_common
Linking CXX executable test_eigen
[ 9%] Building CXX object common/test/CMakeFiles/test_operators.dir/test_operators.cpp.o
clang: warning: unknown warning option '-Wl'
[ 10%] Built target test_eigen
Linking CXX executable test_pca
clang: warning: unknown warning option '-Wl'
Linking CXX executable test_plane_intersection
clang: warning: unknown warning option '-Wl'
[ 10%] Built target test_pca
[ 10%] Built target test_plane_intersection
Linking CXX executable test_wrappers
clang: warning: unknown warning option '-Wl'
[ 10%] Built target test_wrappers
Scanning dependencies of target pcl_kdtree
Scanning dependencies of target test_octree
[ 10%] [ 10%] Building CXX object kdtree/CMakeFiles/pcl_kdtree.dir/src/kdtree_flann.cpp.o
Building CXX object octree/test/CMakeFiles/test_octree.dir/test_octree.cpp.o
/Users/alex/ros_catkin_ws/src/pcl/io/tools/ply/ply2ply.cpp:359:17: error: no template named 'at' in namespace 'pcl::io::ply'; did you mean 'boost::mpl::at'?
pcl::io::ply::at<pcl::io::ply::int8>(scalar_property_definition_callbacks) = boost::bind(&ply_to_ply_converter::scalar_property_definition_callback<pcl::io::ply::int8>, this, _1, _2);
~~~~~~~~~~~~~~^~
boost::mpl::at
/usr/local/include/boost/mpl/at_fwd.hpp:20:50: note: 'boost::mpl::at' declared here
template< typename Sequence, typename N > struct at;
^
/Users/alex/ros_catkin_ws/src/pcl/io/tools/ply/ply2ply.cpp:359:17: error: too few template arguments for class template 'at'
pcl::io::ply::at<pcl::io::ply::int8>(scalar_property_definition_callbacks) = boost::bind(&ply_to_ply_converter::scalar_property_definition_callback<pcl::io::ply::int8>, this, _1, _2);
^
/usr/local/include/boost/mpl/at_fwd.hpp:20:50: note: template is declared here
template< typename Sequence, typename N > struct at;
~~~~~~~~~~~~~~~~~~~~~~~~~~~~~~~~~~~~~~~~~ ^
/Users/alex/ros_catkin_ws/src/pcl/io/tools/ply/ply2ply.cpp:360:17: error: no template named 'at' in namespace 'pcl::io::ply'; did you mean 'boost::mpl::at'?
pcl::io::ply::at<pcl::io::ply::int16>(scalar_property_definition_callbacks) = boost::bind(&ply_to_ply_converter::scalar_property_definition_callback<pcl::io::ply::int16>, this, _1, _2);
~~~~~~~~~~~~~~^~
boost::mpl::at
/usr/local/include/boost/mpl/at_fwd.hpp:20:50: note: 'boost::mpl::at' declared here
template< typename Sequence, typename N > struct at;
^
/Users/alex/ros_catkin_ws/src/pcl/io/tools/ply/ply2ply.cpp:360:17: error: too few template arguments for class template 'at'
pcl::io::ply::at<pcl::io::ply::int16>(scalar_property_definition_callbacks) = boost::bind(&ply_to_ply_converter::scalar_property_definition_callback<pcl::io::ply::int16>, this, _1, _2);
^
/usr/local/include/boost/mpl/at_fwd.hpp:20:50: note: template is declared here
template< typename Sequence, typename N > struct at;
~~~~~~~~~~~~~~~~~~~~~~~~~~~~~~~~~~~~~~~~~ ^
/Users/alex/ros_catkin_ws/src/pcl/io/tools/ply/ply2ply.cpp:361:17: error: no template named 'at' in namespace 'pcl::io::ply'; did you mean 'boost::mpl::at'?
pcl::io::ply::at<pcl::io::ply::int32>(scalar_property_definition_callbacks) = boost::bind(&ply_to_ply_converter::scalar_property_definition_callback<pcl::io::ply::int32>, this, _1, _2);
~~~~~~~~~~~~~~^~
boost::mpl::at
/usr/local/include/boost/mpl/at_fwd.hpp:20:50: note: 'boost::mpl::at' declared here
template< typename Sequence, typename N > struct at;
^
/Users/alex/ros_catkin_ws/src/pcl/io/tools/ply/ply2ply.cpp:361:17: error: too few template arguments for class template 'at'
pcl::io::ply::at<pcl::io::ply::int32>(scalar_property_definition_callbacks) = boost::bind(&ply_to_ply_converter::scalar_property_definition_callback<pcl::io::ply::int32>, this, _1, _2);
^
/usr/local/include/boost/mpl/at_fwd.hpp:20:50: note: template is declared here
template< typename Sequence, typename N > struct at;
~~~~~~~~~~~~~~~~~~~~~~~~~~~~~~~~~~~~~~~~~ ^
/Users/alex/ros_catkin_ws/src/pcl/io/tools/ply/ply2obj.cpp:308:17: error: no template named 'at' in namespace 'pcl::io::ply'; did you mean 'boost::mpl::at'?
pcl::io::ply::at<pcl::io::ply::float32> (scalar_property_definition_callbacks) = boost::bind (&ply_to_obj_converter::scalar_property_definition_callback<pcl::io::ply::float32>, this, _1, _2);
~~~~~~~~~~~~~~^~
boost::mpl::at
/usr/local/include/boost/mpl/at_fwd.hpp:20:50: note: 'boost::mpl::at' declared here
template< typename Sequence, typename N > struct at;
^
/Users/alex/ros_catkin_ws/src/pcl/io/tools/ply/ply2obj.cpp:308:17: error: too few template arguments for class template 'at'
pcl::io::ply::at<pcl::io::ply::float32> (scalar_property_definition_callbacks) = boost::bind (&ply_to_obj_converter::scalar_property_definition_callback<pcl::io::ply::float32>, this, _1, _2);
^
/usr/local/include/boost/mpl/at_fwd.hpp:20:50: note: template is declared her/Users/alex/ros_catkin_ws/src/pcl/io/tools/ply/ply2ply.cpp:362:17: error: e
template< typename Sequence, typename N > struct at;
~~~~~~~~~~~~~~~~~~~~~~~~~~~~~~~~~~~~~~~~~ ^n
o template named 'at' in namespace 'pcl::io::ply'; did you mean 'boost::mpl::at'?
pcl::io::ply::at<pcl::io::ply::uint8>(scalar_property_definition_callbacks) = boost::bind(&ply_to_ply_converter::scalar_property_definition_callback<pcl::io::ply::uint8>, this, _1, _2);
~~~~~~~~~~~~~~^~
boost::mpl::at
/usr/local/include/boost/mpl/at_fwd.hpp:20:50: note: 'boost::mpl::at' declared here
template< typename Sequence, typename N > struct at;
^
/Users/alex/ros_catkin_ws/src/pcl/io/tools/ply/ply2ply.cpp:362:17: error: too few template arguments for class template 'at'
pcl::io::ply::at<pcl::io::ply::uint8>(scalar_property_definition_callbacks) = boost::bind(&ply_to_ply_converter::scalar_property_definition_callback<pcl::io::ply::uint8>, this, _1, _2);
^
/usr/local/include/boost/mpl/at_fwd.hpp:20:50: note: template is declared here
template< typename Sequence, typename N > struct at;
~~~~~~~~~~~~~~~~~~~~~~~~~~~~~~~~~~~~~~~~~ ^
/Users/alex/ros_catkin_ws/src/pcl/io/tools/ply/ply2obj.cpp:312:17: error: no template named 'at' in namespace 'pcl::io::ply'; did you mean 'boost::mpl::at'?
pcl::io::ply::at<pcl::io::ply::uint8, pcl::io::ply::int32> (list_property_definition_callbacks) = boost::bind (&ply_to_obj_converter::list_property_definition_callback<pcl::io::ply::uint8, pcl::io::ply::int32>, this, _1, _2);
~~~~~~~~~~~~~~^~
boost::mpl::at
/usr/local/include/boost/mpl/at_fwd.hpp:20:50: note: 'boost::mpl::at' declared here
template< typename Sequence, typename N > struct at;
^
/Users/alex/ros_catkin_ws/src/pcl/io/tools/ply/ply2ply.cpp:363:17: error: no template named 'at' in namespace 'pcl::io::ply'; did you mean 'boost::mpl::at'?
/Users/alex/ros_catkin_ws/src/pcl/io/tools/ply/ply2obj.cpp:312:63: error: redefinition of 'list_property_definition_callbacks' with a different type: 'pcl::io::ply::at<pcl::io::ply::uint8, pcl::io::ply::in pcl::io::ply::at<pcl::io::ply::uint16>(scalar_property_definition_callbacks) = boost::bind(&ply_to_ply_converter::scalar_property_definition_callback<pcl::io::ply::uint16>, this, _1, _2);
t32>' vs 'pcl::io::ply::ply_parser::list_property_definition_callbacks_type'
pcl::io::ply::at<pcl::io::ply::uint8, pcl::io::ply::int32> (list_property_definition_callbacks) = boost::bind (&ply_to_obj_converter::list_property_definition_callback<pcl::io::ply::uint8, pcl::io::ply::int32>, this, _1, _2);
^
/Users/alex/ros_catkin_ws/src/pcl/io/tools/ply/ply2obj.cpp:311:69: note: previous definition is here
pcl::io::ply::ply_parser::list_property_definition_callbacks_type list_property_definition_callbacks;
^
~~~~~~~~~~~~~~^~
boost::mpl::at
/usr/local/include/boost/mpl/at_fwd.hpp:20:50: note: 'boost::mpl::at' declared here
template< typename Sequence, typename N > struct at;
^
/Users/alex/ros_catkin_ws/src/pcl/io/tools/ply/ply2ply.cpp:363:17: error: too few template arguments for class template 'at'
pcl::io::ply::at<pcl::io::ply::uint16>(scalar_property_definition_callbacks) = boost::bind(&ply_to_ply_converter::scalar_property_definition_callback<pcl::io::ply::uint16>, this, _1, _2);
^
/usr/local/include/boost/mpl/at_fwd.hpp:20:50: note: template is declared here
template< typename Sequence, typename N > struct at;
~~~~~~~~~~~~~~~~~~~~~~~~~~~~~~~~~~~~~~~~~ ^
/Users/alex/ros_catkin_ws/src/pcl/io/tools/ply/ply2ply.cpp:364:17: error: no template named 'at' in namespace 'pcl::io::ply'; did you mean 'boost::mpl::at'?
pcl::io::ply::at<pcl::io::ply::uint32>(scalar_property_definition_callbacks) = boost::bind(&ply_to_ply_converter::scalar_property_definition_callback<pcl::io::ply::uint32>, this, _1, _2);
~~~~~~~~~~~~~~^~
boost::mpl::at
/usr/local/include/boost/mpl/at_fwd.hpp:20:50: note: 'boost::mpl::at' declared here
template< typename Sequence, typename N > struct at;
^
/Users/alex/ros_catkin_ws/src/pcl/io/tools/ply/ply2ply.cpp:364:17: error: too few template arguments for class template 'at'
pcl::io::ply::at<pcl::io::ply::uint32>(scalar_property_definition_callbacks) = boost::bind(&ply_to_ply_converter::scalar_property_definition_callback<pcl::io::ply::uint32>, this, _1, _2);
^
/usr/local/include/boost/mpl/at_fwd.hpp:20:50: note: template is declared here
template< typename Sequence, typename N > struct at;
~~~~~~~~~~~~~~~~~~~~~~~~~~~~~~~~~~~~~~~~~ ^
/Users/alex/ros_catkin_ws/src/pcl/io/tools/ply/ply2ply.cpp:365:17: error: no template named 'at' in namespace 'pcl::io::ply'; did you mean 'boost::mpl::at'?
pcl::io::ply::at<pcl::io::ply::float32>(scalar_property_definition_callbacks) = boost::bind(&ply_to_ply_converter::scalar_property_definition_callback<pcl::io::ply::float32>, this, _1, _2);
~~~~~~~~~~~~~~^~
boost::mpl::at
/usr/local/include/boost/mpl/at_fwd.hpp:20:50: note: 'boost::mpl::at' declared here
template< typename Sequence, typename N > struct at;
^
/Users/alex/ros_catkin_ws/src/pcl/io/tools/ply/ply2ply.cpp:365:17: error: too few template arguments for class template 'at'
pcl::io::ply::at<pcl::io::ply::float32>(scalar_property_definition_callbacks) = boost::bind(&ply_to_ply_converter::scalar_property_definition_callback<pcl::io::ply::float32>, this, _1, _2);
^
/usr/local/include/boost/mpl/at_fwd.hpp:20:50: note: template is declared here
template< typename Sequence, typename N > struct at;
~~~~~~~~~~~~~~~~~~~~~~~~~~~~~~~~~~~~~~~~~ ^
/Users/alex/ros_catkin_ws/src/pcl/io/tools/ply/ply2ply.cpp:366:17: error: no template named 'at' in namespace 'pcl::io::ply'; did you mean 'boost::mpl::at'?
pcl::io::ply::at<pcl::io::ply::float64>(scalar_property_definition_callbacks) = boost::bind(&ply_to_ply_converter::scalar_property_definition_callback<pcl::io::ply::float64>, this, _1, _2);
~~~~~~~~~~~~~~^~
boost::mpl::at
/usr/local/include/boost/mpl/at_fwd.hpp:20:50: note: 'boost::mpl::at' declared here
template< typename Sequence, typename N > struct at;
^
/Users/alex/ros_catkin_ws/src/pcl/io/tools/ply/ply2ply.cpp:366:17: error: too few template arguments for class template 'at'
pcl::io::ply::at<pcl::io::ply::float64>(scalar_property_definition_callbacks) = boost::bind(&ply_to_ply_converter::scalar_property_definition_callback<pcl::io::ply::float64>, this, _1, _2);
^
/usr/local/include/boost/mpl/at_fwd.hpp:20:50: note: template is declared here
template< typename Sequence, typename N > struct at;
~~~~~~~~~~~~~~~~~~~~~~~~~~~~~~~~~~~~~~~~~ ^
/Users/alex/ros_catkin_ws/src/pcl/io/tools/ply/ply2raw.cpp:317:17: error: no template named 'at' in namespace 'pcl::io::ply'; did you mean 'boost::mpl::at'?
pcl::io::ply::at<pcl::io::ply::float32> (scalar_property_definition_callbacks) = boost::bind (&ply_to_raw_converter::scalar_property_definition_callback<pcl::io::ply::float32>, this, _1, _2);
~~~~~~~~~~~~~~^~
boost::mpl::at
/usr/local/include/boost/mpl/at_fwd.hpp:20:50: note: 'boost::mpl::at' declared here
template< typename Sequence, typename N > struct at;
^
/Users/alex/ros_catkin_ws/src/pcl/io/tools/ply/ply2raw.cpp:317:17: error: too few template arguments for class template 'at'
/Users/alex/ros_catkin_ws/src/pcl/io/tools/ply/ply2ply.cpp:372:17: error: no template named 'at' pcl::io::ply::at<pcl::io::ply::float32> (scalar_property_definition_callbacks) = boost::bind (&ply_to_raw_converter::scalar_property_definition_callback<pcl::io::ply::float32>, this, _1, _2); in
namespace 'pc ^
l::io::pl/usr/local/include/boost/mpl/at_fwd.hpp:20:50: y';note: templ adtie is declared here
template< typename Sequence, typename N > struct at;
~~~~~~~~~~~~~~~~~~~~~~~~~~~~~~~~~~~~~~~~~ ^d
you mean 'boost::mpl::at'?
pcl::io::ply::at<pcl::io::ply::uint8, pcl::io::ply::int8>(list_property_definition_callbacks) = boost::bind(&ply_to_ply_converter::list_property_definition_callback<pcl::io::ply::uint8, pcl::io::ply::int8>, this, _1, _2);
~~~~~~~~~~~~~~^~
boost::mpl::at
/usr/local/include/boost/mpl/at_fwd.hpp:20:50: note: 'boost::mpl::at' declared here
template< typename Sequence, typename N > struct at;
^
/Users/alex/ros_catkin_ws/src/pcl/io/tools/ply/ply2ply.cpp:372:61: error: redefinition of 'list_property_definition_callbacks' with a different type: 'pcl::io::ply::at<pcl::io/Users/alex/ros_catkin_ws/src/pcl/io/tools/ply/ply2raw.cpp::p:321:l17y:: error: no template named 'at' in namespace 'pcl::io::ply'; did you mean 'boost::mpl::a:t'?
uint8, pcl::io::ply::int8>' vs 'pcl::io::ply::ply_parser::lis pcl::io::ply::at<pcl::io::ply::uint8, pcl::io::ply::int32> (list_property_definition_callbacks) = boost::bind (&ply_to_raw_converter::list_property_definition_callback<pcl::io::ply::uint8, pcl::io::ply::int32>, this, _1, _2);
~~~~~~~~~~~~~~^~
boost::mpl::att_property_
d/usr/local/include/boost/mpl/at_fwd.hpp:20:50: note: 'boost::mpl::at' declared hefienre
itemplate< typename Sequence, typename N > struct at;
^
/Users/alex/ros_catkin_ws/src/pcl/io/tools/ply/ply2raw.cpp:321:t63ion_ca:l lerror: braecdkesf_itnyipe'
pcl::io::ply::at<pcl::io::ply::uint8, pcl::io::ply::int8>(list_property_definition_callbacks) = boost::bind(&ply_to_ply_converter::list_property_definition_callback<pcl::io::ply::uint8, pcl::io::ply::int8>, this, _1, _2);
tion of ^
'list_pr/Users/alex/ros_catkin_ws/src/pcl/io/tools/ply/ply2ply.cpp:ope370:69: note: previous definition is here
pcl::io::ply::ply_parser::list_property_definition_callbacks_type list_property_definition_callbacks;
^
rty_definition_callbacks' with a different type: 'pcl::io::ply::at<pcl::io::ply::uint8, pcl::io::ply::int32>' vs 'pcl::io::ply::ply_parser::list_property_definition_callbacks_type'
pcl::io::ply::at<pcl::io::ply::uint8, pcl::io::ply::int32> (list_property_definition_callbacks) = boost::bind (&ply_to_raw_converter::list_property_definition_callback<pcl::io::ply::uint8, pcl::io::ply::int32>, this, _1, _2);
^
/Users/alex/ros_catkin_ws/src/pcl/io/tools/ply/ply2raw.cpp:320:69: note: previous definition is here
pcl::io::ply::ply_parser::list_property_definition_callbacks_type list_property_definition_callbacks;
^
/Users/alex/ros_catkin_ws/src/pcl/io/tools/ply/ply2ply.cpp:373:17: error: no template named 'at' in namespace 'pcl::io::ply'; did you mean 'boost::mpl::at'?
pcl::io::ply::at<pcl::io::ply::uint8, pcl::io::ply::int16>(list_property_definition_callbacks) = boost::bind(&ply_to_ply_converter::list_property_definition_callback<pcl::io::ply::uint8, pcl::io::ply::int16>, this, _1, _2);
~~~~~~~~~~~~~~^~
boost::mpl::at
/usr/local/include/boost/mpl/at_fwd.hpp:20:50: note: 'boost::mpl::at' declared here
template< typename Sequence, typename N > struct at;
^
fatal error: too many errors emitted, stopping now [-ferror-limit=]
4 errors generated.
make[2]: *** [io/tools/ply/CMakeFiles/pcl_ply2obj.dir/ply2obj.cpp.o] Error 1
make[1]: *** [io/tools/ply/CMakeFiles/pcl_ply2obj.dir/all] Error 2
make[1]: *** Waiting for unfinished jobs....
4 errors generated.
make[2]: *** [io/tools/ply/CMakeFiles/pcl_ply2raw.dir/ply2raw.cpp.o] Error 1
make[1]: *** [io/tools/ply/CMakeFiles/pcl_ply2raw.dir/all] Error 2
20 errors generated.
make[2]: *** [io/tools/ply/CMakeFiles/pcl_ply2ply.dir/ply2ply.cpp.o] Error 1
make[1]: *** [io/tools/ply/CMakeFiles/pcl_ply2ply.dir/all] Error 2
Scanning dependencies of target pcl_io
[ 11%] [ 11%] [ 11%] [ 12%] Building CXX object io/CMakeFiles/pcl_io.dir/src/pcd_io.cpp.o
Building CXX object io/CMakeFiles/pcl_io.dir/src/pcd_grabber.cpp.o
Building CXX object io/CMakeFiles/pcl_io.dir/src/vtk_io.cpp.o
Building CXX object io/CMakeFiles/pcl_io.dir/src/ply_io.cpp.o
In file included from /Users/alex/ros_catkin_ws/src/pcl/kdtree/src/kdtree_flann.cpp:39:
/Users/alex/ros_catkin_ws/src/pcl/common/include/pcl/point_types.h:371:1: warning: offset of on non-POD type 'pcl::PointXYZL' [-Winvalid-offsetof]
POINT_CLOUD_REGISTER_POINT_STRUCT (pcl::PointXYZL,
^
/Users/alex/ros_catkin_ws/src/pcl/common/include/pcl/ros/register_point_struct.h:58:3: note: expanded from macro 'POINT_CLOUD_REGISTER_POINT_STRUCT'
POINT_CLOUD_REGISTER_POINT_STRUCT_I(name, \
^
/Users/alex/ros_catkin_ws/src/pcl/common/include/pcl/ros/register_point_struct.h:93:29: note: expanded from macro 'POINT_CLOUD_REGISTER_POINT_STRUCT_I'
BOOST_PP_SEQ_FOR_EACH(POINT_CLOUD_REGISTER_FIELD_OFFSET, name, seq) \
^
/usr/local/include/boost/preprocessor/seq/for_each.hpp:26:67: note: expanded from macro 'BOOST_PP_SEQ_FOR_EACH'
In file included from /Users/alex/ros_catkin_ws/src/pcl/common/test/test_intensity.cpp:# define BOOST_PP_SEQ_FOR_EACH(macro, data, seq) BOOST_PP_FOR((macro, data, seq (nil)), BOOST_PP_SEQ_FOR_EACH_P, BOOST_PP_SEQ_FOR_EACH_O, BOOST_PP_SEQ_FOR_EACH_M)
42:
/Users/alex/ros_catkin_ws/src/pcl/common/include/pcl/point_types.h:371:1: warning: offset of ^
on nnote: (skipping 5 expansions in backtrace; use -fmacro-backtrace-limit=0 to see all)on-P
OD/usr/local/include/boost/preprocessor/seq/for_each.hpp :49:57: note: expanded from macro 'BOOST_PP_SEQ_FOR_EACH_M_I'type
'pcl::# define BOOST_PP_SEQ_FOR_EACH_M_I(r, macro, data, seq) macro(r, data, BOOST_PP_SEQ_HEAD(seq))
^
P/Users/alex/ros_catkin_ws/src/pcl/common/include/pcl/ros/register_point_struct.h:121:33: note: expaointXYZL' [-Winvalid-ondefd ffrsom macro 'POINT_CLOUD_REGISTER_FIELD_OFFSET'
static const size_t value = offsetof(name, BOOST_PP_TUPLE_ELEM(3, 1, elem)); \
^
/usr/bin/../lib/clang/4.2/include/stddef.h:e62:24: note: tof]
expanded from macro 'offsetofPOINT_CLOUD_REGISTER_POINT_STRUCT (pcl::PointXYZL,
'
^
#define offsetof(t, d) __builtin_offsetof(t, d)/Users/alex/ros_catkin_ws/src/pcl/common/include/pcl/ros/register_point_struct.h:58:3: note: expanded from macro 'POINT_CLOUD_REGISTER_POINT_STRUCT'
POINT_CLOUD_REGISTER_POINT_STRUCT_I(name, \
^
/Users/alex/ros_catkin_ws/src/pcl/common/include/pcl/ros/register_point_struct.h:93:29
: ^note: expande
d from macro 'POINT_CLOUD_REGISTER_POIn file included from /Users/alex/ros_catkin_ws/src/pcl/kdtree/src/kdtree_flann.cppIN:39:
T_/Users/alex/ros_catkin_ws/src/pcl/common/include/pcl/point_types.h:371:1: warning: offset of on non-POD type 'pcl::PointXYZL' [-Winvalid-offsetof]
STPOINT_CLOUD_REGISTER_POINT_STRUCT (pcl::PointXYZL,
RUCT_I'
BOOST_PP_SEQ_FOR_EACH(POINT_CLOUD_REGISTER_FIELD_OFFSET, name, seq) \
^
/usr/local/include/boost/preprocessor/seq/for_each.hpp:26:67: note: expanded from macro 'BOOST_PP_SEQ_FOR_EACH'
# define BOOST_PP_SEQ_FOR_EACH(macro, data, seq) BOOST_PP_FOR((macro, data, seq (nil)), BOOST_PP_SEQ_FOR_EACH_P, BOOST_PP_SEQ_FOR_EACH_O, BOOST_PP_SEQ_FOR_EACH_M)
^
note: (skipping 5 expansions in backtrace; use -fmacro-backtrace-limit=0 to see all)
/usr/local/include/boost/preprocessor/seq/for_each.hpp:49:57: note: expanded from macro 'BOOST_PP_SEQ_FOR_EACH_M_I'
# define BOOST_PP_SEQ_FOR_EACH_M_I(r, macro, data, seq) macro(r, data, BOOST_PP_SEQ_HEAD(seq))
^
/Users/alex/ros_catkin_ws/src/pcl/common/include/pcl/ros/register_point_struct.h:121:33: note: expanded from macro 'POINT_CLOUD_REGISTER_FI^
E/Users/alex/ros_catkin_ws/src/pcl/common/include/pcl/ros/register_point_struct.h:58:3: note: expanded from macro 'POINT_CLOUD_REGISTER_POINT_STRUCT'
LD_OFFSET'
POINT_CLOUD_REGISTER_POINT_STRUCT_I(name, \
^
static const size_t value = offsetof(name, BOOST_PP_TUPLE_ELEM(3, 1, elem)); \
^
/Users/alex/ros_catkin_ws/src/pcl/common/include/pcl/ros/register_point_struct.h:93:29: note: expanded from /usr/bin/../lib/clang/4.2/include/stddef.h:62macr:24o 'POINT_CLOUD_RE: Gnote: IeSxTpEaRn_dPeOdI NfTr_oSmT RmUaCcTr_oI'
'o BOOST_PP_SEQ_FOR_EACH(POINT_CLOUD_REGISTER_FIELD_OFFSET, name, seq) \f
fsIn file included from /Users/alex/ros_catkin_ws/src/pcl/common/test/test_operators.cppeto ^
:f40:
/Users/alex/ros_catkin_ws/src/pcl/common/include/pcl/point_types.h:371:1: warning: offset of on non-POD type 'pcl::Poi/usr/local/include/boost/preprocessor/seq/for_each.hpp'
ntX:26Y:67: note: #define offsetof(t, d) __builtin_offsetof(t, d)
exZL' [- ^Wipnavnadleidd -forfofms emtaocfro 'BO]
OST_PP_SEQ_FOR_EACH'
# define BOOST_PP_SEQ_FOR_EACH(macro, data, seq) BOOST_PP_FOR((macro, data, seq (nil)), BOOST_PP_SEQ_FOR_EACH_P, BOOST_PP_SEQ_FOR_EACH_O, BOOST_PP_SEQ_FOR_EACH_M)
^
note: (skipping 9 expansions in backtrace; use -fmacro-backtrace-limit=0 to see all)
/usr/local/include/boost/preprocessor/seq/for_each.hpp:49:57: note: expanded from macro 'BOOST_PP_SEQ_FOR_EACH_M_I'
# define BOOST_PP_SEQ_FOR_EACH_M_I(r, macro, data, seq) macro(r, data, BOOST_PP_SEQ_HEAD(seq))
^
/Users/alex/ros_catkin_ws/src/pcl/common/include/pcl/ros/register_point_struct.h:121:33: note: expanded from macro 'POINT_CLOUD_REGISTER_FIELD_OFFSET'
static const size_t value = offsetof(name, BOOST_PP_TUPLE_ELEM(3, 1, elem)); \
^
/usr/bin/../lib/clang/4.2/include/stddef.h:62:24: note: expanded from macro 'offsetof'
#define offsetof(t, d) __builtin_offsetof(t, d)
^
POINT_CLOUD_REGISTER_POINT_STRUCT (pcl::PointXYZL,
^
/Users/alex/ros_catkin_ws/src/pcl/common/include/pcl/ros/register_point_struct.h:58:3: note: expandeIn file included from /Users/alex/ros_catkin_ws/src/pcl/common/test/test_intensity.cppd:42:
/Users/alex/ros_catkin_ws/src/pcl/common/include/pcl/point_types.h:371 :1: warning: offrom fset of on non-POD type 'pcl::PointXYZL' [-Winvalid-offsetof]
macro 'POINT_CLOUD_REGISTER_POINT_STRUCT'
POINT_CLOUD_REGISTER_POINT_STRUCT_I(name, \
^POINT_CLOUD_REGISTER_POINT_STRUCT (pcl::PointXYZL,
^
In file included from /Users/alex/ros_catkin_ws/src/pcl/kdtree/src/kdtree_flann.cpp:39:
/Users/alex/ros_catkin_ws/src/pcl/common/include/pcl/point_types.h:371:1: warning: offset of on /Users/alex/ros_catkin_ws/src/pcl/common/include/pcl/ros/register_point_struct.h:/Users/alex/ros_catkin_ws/src/pcl/common/include/pcl/ros/register_point_struct.h:58:3: no93:29: note: expann-POnote: deedx frDom ma cpratoy p'en 'PpOIdNcl::PoT_Ced LOUD_REGISTinER_POINT_STRUCT'
t POINT_CLOUD_REGISTER_POINT_STRUCT_I(name, \
^XYf
/Users/alex/ros_catkin_ws/src/pcl/common/include/pcl/ros/register_point_struct.h:93Z:29: note: L' exr[panded -Wifnrvoaml imda-corfof s'ePtOoIfN]T_CL
OUD_REGISTER_POINT_STRUCT_I'
BOOST_PP_SEQ_FOR_EACH(POINT_CLOUD_REGISTER_FIELD_OFFSET, name, seq) \
^
POINT_CLOUD_REGISTER_POINT_STRUCT (pcl::PointXYZL,
^
/usr/local/include/boost/preprocessor/seq/for_each.hpp:26:67: note: expanded from macro 'BOOST_PP_/Users/alex/ros_catkin_ws/src/pcl/common/include/pcl/ros/register_point_struct.hS:E58Q:_3F:O Rnote: _eExApCaHn'd
ed from macro 'POINT_CLOUD_REGISTER_POINT_STRUCT'
POINT_CLOUD_REGISTER_POINT_STRUCT_I(name, \
^
# define BOOST_PP_SEQ_FOR_EACH(macro, data, seq) BOOST_PP_FOR((macro, data, seq (nil)), BOOST_PP_SEQ_FOR_EACH_P, BOOST_PP_SEQ_FOR_EACH_O, BOOST_PP_SEQ_FOR_EACH_M)
^
note: (skipping 9 expansions in backtrace; use -fmacro-backtrace-limit=0 to see all)
/Users/alex/ros_catkin_ws/src/pcl/common/include/pcl/ros/register_point_struct.h:93:29:/usr/local/include/boost/preprocessor/seq/for_each.hpp:49:57: note: expanded from macro 'BOOST_PP_SEQ_FOR_EACH_M_I'
note: ex# define BOOST_PP_SEQ_FOR_EACH_M_I(r, macro, data, seq) macro(r, data, BOOST_PP_SEQ_HEAD(seq))p
om macro ^
anded from macro 'PO INT_CLOUD_REG/Users/alex/ros_catkin_ws/src/pcl/common/include/pcl/ros/register_point_struct.h:121I:STE'PRO_IPNOTI_NCT33_:S Tnote: ReLUCOUD_RExpandT_IGIed Sfrom macro ''
POINT_CLOUD_REGISTER_FIELD_OFFSET'
BOOST_PP_SEQ_FOR_EACH(POINT_CLOUD_REGISTER_FIELD_OFFSET, name, seq) \
^
static const size_t value = offsetof(name, BOOST_PP_TUPLE_ELEM(3, 1, elem)); \
^
/usr/local/include/boost/preprocessor/seq/for_each.hpp:26:67: note: expanded from maTERcr_POo/usr/bin/../lib/clang/4.2/include/stddef.h I'NBTO_O:S62TSRT_:24U:PCPT_ Snote: EeQx_p_I'
anded from macro 'offsetof'
BOOST_PP_SEQ_FOR_EACH(POINT_CLOUD_REGISTER_FIELD_OFFSET, name, seq) \
^FO
R_EA#define offsetof(t, d) __builtin_offsetof(t, d)CH'
^
/usr/local/include/boost/preprocessor/seq/for_each.hpp:26:67: note: expanded from macro 'BOOST_PP_SEQ_FOR_EACH'
# define BOOST_PP_SEQ_FOR_EACH(macro, data, seq) BOOST_PP_FOR((macro, data, seq (nil)), BOOST_PP_SEQ_FOR_EACH_P, BOOST_PP_SEQ_FOR_EACH_O, BOOST_PP_SEQ_FOR_EACH_M)
^
note: (skipping 13 expansions in backtrace; use -fmacro-backtrace-limit=0 to see all)
# define BOOST_PP_SEQ_FOR_EACH(macro, data, seq) BOOST_PP_FOR((macro, data, seq (nil)), BOOST_PP_SEQ_FOR_EACH_P, BOOST_PP_SEQ_FOR_EACH_O, BOOST_PP_SEQ_FOR_EACH_M)
/usr/local/include/boost/preprocessor/seq/for_each.hpp ^:
49:57: note: expanded from macro 'BOOST_PP_SEQ_FOR_EACH_M_I'
# define BOOST_PP_SEQ_FOR_EACH_M_I(r, macro, data, seq) macro(r, data, BOOST_PP_SEQ_HEAD(seq))
^
/Users/alex/ros_catkin_ws/src/pcl/common/include/pcl/ros/register_point_struct.h:121:33: note: expanded from macro 'POINT_CLOUD_REGISTER_FIELD_OFFSET'
static const size_t value = offsetof(name, BOOST_PP_TUPLE_ELEM(3, 1, elem)); \
^
In file included from /Users/alex/ros_catkin_ws/src/pcl/common/test/test_intensity.cpp:42:
/Users/alex/ros_catkin_ws/src/pcl/common/include/pcl/point_types.h:371:1: warning: offset o/usr/bin/../lib/clang/4.2/include/stddef.h:62:note: (skipping 5 expansions in backtrace; use -fmacro-backtrace-limit=0 to see all)f on non-POD type 'pcl::PointXY24Z: note: eL'
xp [a-nWdiendv aflriodm- omfafcsreot o'fo]f
fsetof'
/usr/local/include/boost/preprocessor/seq/for_each.hpp:49:57: note: expanded from macro 'BOOST_PP#define offsetof(t, d) __builtin_offsetof(t, d)
^
POINT_CLOUD_REGISTER_POINT_STRUCT (pcl::PointXYZL,
^
/Users/alex/ros_catkin_ws/src/pcl/common/include/pcl/ros/register_point_struct.h:58:3: note: expanded from macro 'POINT_CLOUD_REGISTER_POINT_STRUCT'
POINT_CLOUD_REGISTER_POINT_STRUCT_I(name, \
^
/Users/alex/ros_catkin_ws/src/pcl/common/include/pcl/ros/register_point_struct.h:93:29: note: expanded from macro 'POINT_CLOUD_REGISTER_POINT_STRUCT_I'
BOOST_PP_SEQ_FOR_EACH(POINT_CLOUD_REGISTER_FIELD_OFFSET, name, seq) \
^
/usr/local/include/boost/preprocessor/seq/for_each.hpp:26:67: note: expanded from macro 'BOOST_PP_SEQ_FOR_EACH'
In file included from /Users/alex/ros_catkin_ws/src/pcl/kdtree/src/kdtree_flann.cpp:39:
/Users/alex/ros_catkin_ws/src/pcl/common/include/pcl/point_types.h:371:1: warning: offset of on non-POD type 'pcl::PointXYZL' [-Winv# define BOOST_PP_SEQ_FOR_EACH(macro, data, seq) BOOST_PP_FOR((macro, data, seq (nil)), BOOST_PP_SEQ_FOR_EACH_P, BOOST_PP_SEQ_FOR_EACH_O, BOOST_PP_SEQ_FOR_EACH_M)
^_SE
alid-offsetoQ_f]
POINT_CLOUD_REGISTER_POINT_STRUCT (pcl::PointXYZL,
^
/Users/alex/ros_catkin_ws/src/pcl/common/include/pcl/ros/register_point_struct.h:58:3: note: note: (skipping 13 expansions in backtrace; use -fmacro-backtrace-limit=0 to see all)FOexpanded from macro 'POIN
R_EACH_M_I'
/usr/local/include/boost/preprocessor/seq/for_each.hpp:49:57:# define BOOST_PP_SEQ_FOR_EACH_M_I(r, macro, data, seq) macro(r, data, BOOST_PP_SEQ_HEAD(seq))
^T_CLOUD_REGI
/Users/alex/ros_catkin_ws/src/pcl/common/include/pcl/ros/register_point_struct.h:121 note: exSTEpa:nded from macro 'BOOST_PP_SEQ_FOR_EACH_M_I'
# define BOOST_PP_SEQ_FOR_EACH_M_I(r, macro, data, seq) macro(r, data, BOOST_PP_SEQ_HEAD(seq))
^
R_POINT_STRUCT'
33: POINT_CLOUD_REGISTER_POINT_STRUCT_I(name, \
/Users/alex/ros_catkin_ws/src/pcl/common/include/pcl/ros/register_point_struct.h ^:
121:33: note: expanded from macro 'POINT_CLOUD_REGISTER_FIELD_OFFSET'
/Users/alex/ros_catkin_ws/src/pcl/common/include/pcl/ros/register_point_struct.h:93:29: note: expanded from macro 'POINT_CL static const size_t value = offsetof(name, BOOST_PP_TUPLE_ELEM(3, 1, elem)); \
^
/usr/bin/../lib/clang/4.2/include/stddef.h:62:24: note: expande note: Od expanfrom maded from macro 'POINT_CLOUD_REGISTER_FIELD_OFFSET'
static const size_t value = offsetof(name, BOOST_PP_TUPLE_ELEM(3, 1, elem)); \
^
/usr/bin/../lib/clang/4.2/include/stddef.h:62UDcro 'offs:24: note: expanded from maetof'
_REGISTER_cro#define offsetof(t, d) __builtin_offsetof(t, d)
^
'offsetof'
#define offsetof(t, d) __builtin_offsetof(t, d)
^
In file included from /Users/alex/ros_catkin_ws/src/pcl/common/test/test_intensity.cpp:42:
/Users/alex/ros_catkin_ws/src/pcl/common/include/pcl/point_types.h:371:1: warning: offset of on non-POD type 'pcl::PointXYZL' [-Winvalid-offsetof]
POINT_CLOUD_REGISTER_POINT_STRUCT (pcl::PointXYZL,
^
/Users/alex/ros_catkin_ws/src/pcl/common/include/pcl/ros/register_point_struct.h:58:3: note: expanded from macro 'POINT_CLOUD_REGISTER_POINT_STRUCT'
In file included from /Users/alex/ros_catkin_ws/src/pcl/common/test/test_operators.cpp:40:
/Users/alex/ros_catkin_ws/src/pcl/common/include/pcl/point_types.h:371:1: warning: offset of on non-POD type POINT_CLOUD_REGISTER_POINT_STRUCT_I(name, \
^
/Users/alex/ros_catkin_ws/src/pcl/common/include/pcl/ros/register_point_struct.h:93:29: note: expanded from macro 'POINT_CLOUD_REGISTER_POINT_STRUCT_I'
BOOST_PP_SEQ_FOR_EACH(POINT_CLOUD_REGISTER_FIELD_OFFSET, name, seq) \
^
/usr/local/include/boost/preprocessor/seq/for_each.hpp:26:67: note: expanded from macro 'BOOST_PP_SEQ_FOR_EACH'
'pcl::# define BOOST_PP_SEQ_FOR_EACH(macro, data, seq) BOOST_PP_FOR((macro, data, seq (nil)), BOOST_PP_SEQ_FOR_EACH_P, BOOST_PP_SEQ_FOR_EACH_O, BOOST_PP_SEQ_FOR_EACH_M)
^
POnote: (skipping 17 expansions in backtrace; use -fmacro-backtrace-limit=0 to see all)
INT_STRUCT_I'
BOOST_PP_SEQ_FOR_EACH(POINT_CLOUD_REGISTER_FIELD_OFFSET, name, seq) \
^/usr/local/include/boost/preprocessor/seq/for_each.hpp:49:P
oint57: note: expanded froXYZL' [-Winvalid-offsetof]
/usr/local/include/boost/preprocessor/seq/for_each.hpp:26:67: note: expanded from macro 'BOOST_PP_SEQ_FOR_EACH'
# define BOOST_PP_SEQ_FOR_EACH(macro, data, seq) BOOST_PP_FOR((macro, data, seq (nil)), BOOST_PP_SEQ_FOR_EACH_P, BOOST_PP_SEQ_FOR_EACH_O, BOOST_PP_SEQ_FOR_EACH_M)
^
note: (skipping 17 expansions in backtrace; use -fmacro-backtrace-limit=0 to see all)
/usr/local/include/boost/preprocessor/seq/for_each.hpp:49:57: note: expanded from macro 'BOOST_PP_SEQ_FOR_EACH_M_I'
# define BOOST_PP_SEQ_FOR_EACH_M_I(r, macro, data, seq) macro(r, data, BOOST_PP_SEQ_HEAD(seq))
m macro ' ^
/Users/alex/ros_catkin_ws/src/pcl/common/include/pcl/ros/register_point_struct.h:B121O:O33S:T _note: PePx_pSaEnQd_eFdO Rf_rEoAmC Hm_aMc_rIo'
'POINT_CLOUD_REGISTER_FIELD_OFFSET'
# define BOOST_PP_SEQ_FOR_EACH_M_I(r, macro, data, seq) macro(r, data, BOOST_PP_SEQ_HEAD(seq))
^
static const size_t value = offsetof(name, BOOST_PP_TUPLE_ELEM(3, 1, elem)); \
^
/Users/alex/ros_catkin_ws/src/pcl/common/include/pcl/ros/register_point_struct.h:121:33: note: expand/usr/bin/../lib/clang/4.2/include/stddef.h:62POINT_CLOUD_REGISTER_POINT_STRUCT (pcl::PointXYZL,
^
:24: note: expanded from macro 'offsetof'
/Users/alex/ros_catkin_ws/src/pcl/common/include/pcl/ros/register_point_struct.h:58:3: #define offsetof(t, d) __builtin_offsetof(t, d)
^
enote: expanded from macro 'POINT_CLOUD_REGISTER_POINT_STRUCT'
POINT_CLOUD_REGISTER_POINT_STRUCT_I(name, \
^
/Users/alex/ros_catkin_ws/src/pcl/common/include/pcl/ros/register_point_struct.h:93:29: note: expanded from macro 'POINT_CLOUD_REGISTER_POINT_STRUCT_I'
BOOST_PP_SEQ_FOR_EACH(POINT_CLOUD_REGISTER_FIELD_OFFSET, name, seq) \
^
/usr/local/include/boost/preprocessor/seq/for_each.hpp:26:67: note: expanded from macro 'BOOST_PP_SEQ_FOR_EACH'
# define BOOST_PP_SEQ_FOR_EACH(macro, data, seq) BOOST_PP_FOR((macro, data, seq (nil)), BOOST_PP_SEQ_FOR_EACH_P, BOOST_PP_SEQ_FOR_EACH_O, BOOST_PP_SEQ_FOR_EACH_M)
^
note: (skipping 9 expansions in backtrace; use -fmacro-backtrace-limit=0 to see all)
/usr/local/include/boost/preprocessor/seq/for_each.hpp:49:57: note: expanded from macro 'BOOST_PP_SEQ_FOR_EACH_M_I'
# define BOOST_PP_SEQ_FOR_EACH_M_I(r, macro, data, seq) macro(r, data, BOOST_PP_SEQ_HEAD(seq))
^
d f/Users/alex/ros_catkin_ws/src/pcl/common/include/pcl/ros/register_point_struct.h:121:33: note: expanded from macro 'POINT_CLOUD_REGISTER_FIELD_OFFSET'
rom static const size_t value = offsetof(name, BOOST_PP_TUPLE_ELEM(3, 1, elem)); \
^
/usr/bin/../lib/clang/4.2/include/stddef.h:62:24: note: expanded from macro 'offsetof'
#define offsetof(t, d) __builtin_offsetof(t, d)
^
macro 'POINT_CLOUD_REGISTER_FIELD_OFFSET'
static const size_t value = offsetof(name, BOOST_PP_TUPLE_ELEM(3, 1, elem)); \
^
/usr/bin/../lib/clang/4.2/include/stddef.h:62:24: note: expanded from macro 'offsetof'
#define offsetof(t, d) __builtin_offsetof(t, d)
^
In file included from /Users/alex/ros_catkin_ws/src/pcl/common/test/test_operators.cpp:40:
/Users/alex/ros_catkin_ws/src/pcl/common/include/pcl/point_types.h:371:1: warning: offset of on non-POD type 'pcl::PointXYZL' [-Winvalid-offsetof]
POINT_CLOUD_REGISTER_POINT_STRUCT (pcl::PointXYZL,
^
/Users/alex/ros_catkin_ws/src/pcl/common/include/pcl/ros/register_point_struct.h:58:3: note: expanded from macro 'POINT_CLOUD_REGISTER_POINT_STRUCT'
POINT_CLOUD_REGISTER_POINT_STRUCT_I(name, \
^
/Users/alex/ros_catkin_ws/src/pcl/common/include/pcl/ros/register_point_struct.h:93:29: note: expanded from macro 'POINT_CLOUD_REGISTER_POINT_STRUCT_I'
BOOST_PP_SEQ_FOR_EACH(POINT_CLOUD_REGISTER_FIELD_OFFSET, name, seq) \
^
/usr/local/include/boost/preprocessor/seq/for_each.hpp:26:67: note: expanded from macro 'BOOST_PP_SEQ_FOR_EACH'
# define BOOST_PP_SEQ_FOR_EACH(macro, data, seq) BOOST_PP_FOR((macro, data, seq (nil)), BOOST_PP_SEQ_FOR_EACH_P, BOOST_PP_SEQ_FOR_EACH_O, BOOST_PP_SEQ_FOR_EACH_M)
^
note: (skipping 13 expansions in backtrace; use -fmacro-backtrace-limit=0 to see all)
/usr/local/include/boost/preprocessor/seq/for_each.hpp:49:57: note: expanded from macro 'BOOST_PP_SEQ_FOR_EACH_M_I'
# define BOOST_PP_SEQ_FOR_EACH_M_I(r, macro, data, seq) macro(r, data, BOOST_PP_SEQ_HEAD(seq))
^
/Users/alex/ros_catkin_ws/src/pcl/common/include/pcl/ros/register_point_struct.h:121:33: note: expanded from macro 'POINT_CLOUD_REGISTER_FIELD_OFFSET'
static const size_t value = offsetof(name, BOOST_PP_TUPLE_ELEM(3, 1, elem)); \
^
/usr/bin/../lib/clang/4.2/include/stddef.h:62:24: note: expanded from macro 'offsetof'
#define offsetof(t, d) __builtin_offsetof(t, d)
^
In file included from /Users/alex/ros_catkin_ws/src/pcl/common/test/test_operators.cpp:40:
/Users/alex/ros_catkin_ws/src/pcl/common/include/pcl/point_types.h:371:1: warning: offset of on non-POD type 'pcl::PointXYZL' [-Winvalid-offsetof]
POINT_CLOUD_REGISTER_POINT_STRUCT (pcl::PointXYZL,
^
/Users/alex/ros_catkin_ws/src/pcl/common/include/pcl/ros/register_point_struct.h:58:3: note: expanded from macro 'POINT_CLOUD_REGISTER_POINT_STRUCT'
POINT_CLOUD_REGISTER_POINT_STRUCT_I(name, \
^
/Users/alex/ros_catkin_ws/src/pcl/common/include/pcl/ros/register_point_struct.h:93:29: note: expanded from macro 'POINT_CLOUD_REGISTER_POINT_STRUCT_I'
BOOST_PP_SEQ_FOR_EACH(POINT_CLOUD_REGISTER_FIELD_OFFSET, name, seq) \
^
/usr/local/include/boost/preprocessor/seq/for_each.hpp:26:67: note: expanded from macro 'BOOST_PP_SEQ_FOR_EACH'
# define BOOST_PP_SEQ_FOR_EACH(macro, data, seq) BOOST_PP_FOR((macro, data, seq (nil)), BOOST_PP_SEQ_FOR_EACH_P, BOOST_PP_SEQ_FOR_EACH_O, BOOST_PP_SEQ_FOR_EACH_M)
^
note: (skipping 17 expansions in backtrace; use -fmacro-backtrace-limit=0 to see all)
/usr/local/include/boost/preprocessor/seq/for_each.hpp:49:57: note: expanded from macro 'BOOST_PP_SEQ_FOR_EACH_M_I'
# define BOOST_PP_SEQ_FOR_EACH_M_I(r, macro, data, seq) macro(r, data, BOOST_PP_SEQ_HEAD(seq))
^
/Users/alex/ros_catkin_ws/src/pcl/common/include/pcl/ros/register_point_struct.h:121:33: note: expanded from macro 'POINT_CLOUD_REGISTER_FIELD_OFFSET'
static const size_t value = offsetof(name, BOOST_PP_TUPLE_ELEM(3, 1, elem)); \
^
/usr/bin/../lib/clang/4.2/include/stddef.h:62:24: note: expanded from macro 'offsetof'
#define offsetof(t, d) __builtin_offsetof(t, d)
^
In file included from /Users/alex/ros_catkin_ws/src/pcl/common/test/test_operators.cpp:40:
/Users/alex/ros_catkin_ws/src/pcl/common/include/pcl/point_types.h:397:1: warning: offset of on non-POD type 'pcl::PointNormal' [-Winvalid-offsetof]
POINT_CLOUD_REGISTER_POINT_STRUCT (pcl::PointNormal,
^
/Users/alex/ros_catkin_ws/src/pcl/common/include/pcl/ros/register_point_struct.h:58:3: note: expanded from macro 'POINT_CLOUD_REGISTER_POINT_STRUCT'
POINT_CLOUD_REGISTER_POINT_STRUCT_I(name, \
^
/Users/alex/ros_catkin_ws/src/pcl/common/include/pcl/ros/register_point_struct.h:93:29: note: expanded from macro 'POINT_CLOUD_REGISTER_POINT_STRUCT_I'
BOOST_PP_SEQ_FOR_EACH(POINT_CLOUD_REGISTER_FIELD_OFFSET, name, seq) \
^
/usr/local/include/boost/preprocessor/seq/for_each.hpp:26:67: note: expanded from macro 'BOOST_PP_SEQ_FOR_EACH'
# define BOOST_PP_SEQ_FOR_EACH(macro, data, seq) BOOST_PP_FOR((macro, data, seq (nil)), BOOST_PP_SEQ_FOR_EACH_P, BOOST_PP_SEQ_FOR_EACH_O, BOOST_PP_SEQ_FOR_EACH_M)
^
note: (skipping 5 expansions in backtrace; use -fmacro-backtrace-limit=0 to see all)
/usr/local/include/boost/preprocessor/seq/for_each.hpp:49:57: note: expanded from macro 'BOOST_PP_SEQ_FOR_EACH_M_I'
# define BOOST_PP_SEQ_FOR_EACH_M_I(r, macro, data, seq) macro(r, data, BOOST_PP_SEQ_HEAD(seq))
^
/Users/alex/ros_catkin_ws/src/pcl/common/include/pcl/ros/register_point_struct.h:121:33: note: expanded from macro 'POINT_CLOUD_REGISTER_FIELD_OFFSET'
In file included from /Users/alex/ros_catkin_ws/src/pcl/kdtree/src/kdtree_flann.cpp:39:
/Users/alex/ros_catkin_ws/src/pcl/common/include/pcl/point_types.h:397:1: static const size_t value = offsetof(name, BOOST_PP_TUPLE_ELEM(3, 1, elem)); \
^
/usr/bin/../lib/clang/4.2/include/stddef.h:62:24 warning: : note: offseexpanded from macro 'offsetof'
#define offsetof(t, d) __builtin_offsetof(t, d)
t ^
of on non-POD type 'pcl::PointNormal' [-Winvalid-offsetof]
POINT_CLOUD_REGISTER_POINT_STRUCT (pcl::PointNormal,
^
/Users/alex/ros_catkin_ws/src/pcl/common/include/pcl/ros/register_point_struct.h:58:3: note: expanded from macro 'POINT_CLOUD_REGISTER_POINT_STRUCT'
POINT_CLOUD_REGISTER_POINT_STRUCT_I(name, \
^
/Users/alex/ros_catkin_ws/src/pcl/common/include/pcl/ros/register_point_struct.h:93:29: note: expanded from macro 'POINT_CLOUD_REGISTER_POINT_STRUCT_I'
BOOST_PP_SEQ_FOR_EACH(POINT_CLOUD_REGISTER_FIELD_OFFSET, name, seq) \
^
/usr/local/include/boost/preprocessor/seq/for_each.hpp:26:67: note: expanded from macro 'BOOST_PP_SEQ_FOR_EACH'
In file included from /Users/alex/ros_catkin_ws/src/pcl/common/test/test_operators.cpp:40:
# define BOOST_PP_SEQ_FOR_EACH(macro, data, seq) BOOST_PP_FOR((macro, data, seq (nil)), BOOST_PP_SEQ_FOR_EACH_P, BOOST_PP_SEQ_FOR_EACH_O, BOOST_PP_SEQ_FOR_EACH_M)
^/Users/alex/ros_catkin_ws/src/pcl/common/include/pcl/point_types.h:
397:1: warning: offnote: (skipping 5 expansions in backtrace; use -fmacro-backtrace-limit=0 to see all)
set of on non-POD type 'pcl::PointNormal' [-Winva/usr/local/include/boost/preprocessor/seq/for_each.hpp:lid-off49:57:se tof]
note: expanded from macro 'BOOST_PP_SEQ_FOR_EACH_M_I'
# define BOOST_PP_SEQ_FOR_EACH_M_I(r, macro, data, seq) macro(r, data, BOOST_PP_SEQ_HEAD(seq))
^POINT_CLOUD_REGISTER_POINT_STRUCT (pcl::PointNormal,
^
/Users/alex/ros_catkin_ws/src/pcl/common/include/pcl/ros/register_point_struct.h:121:33: note: expanded fr/Users/alex/ros_catkin_ws/src/pcl/common/include/pcl/ros/register_point_struct.hom macro 'POI:58:3NT_C: note: expanLOdedU Df_rRoEmG ImSaTcErRo_ F'IPEOLIDN_TO_FCFLSOUDET'
_REGISTER_POINT_STRUCT'
static const size_t value = offsetof(name, BOOST_PP_TUPLE_ELEM(3, 1, elem)); \
^
POINT_CLOUD_REGISTER_POINT_STRUCT_I(name, \
^
/usr/bin/../lib/clang/4.2/include/stddef.h:62:24: note: expanded from macro 'offs/Users/alex/ros_catkin_ws/src/pcl/common/include/pcl/ros/register_point_struct.h:93etof':29: note: expanded
from macro 'POINT_CLOUD_REGISTE#define offsetof(t, d) __builtin_offsetof(t, d)
R_POIN ^
T_STRUCT_I'
BOOST_PP_SEQ_FOR_EACH(POINT_CLOUD_REGISTER_FIELD_OFFSET, name, seq) \
^
/usr/local/include/boost/preprocessor/seq/for_each.hpp:26:67: note: expanded from macro 'BOOST_PP_SEQ_FOR_EACH'
# define BOOST_PP_SEQ_FOR_EACH(macro, data, seq) BOOST_PP_FOR((macro, data, seq (nil)), BOOST_PP_SEQ_FOR_EACH_P, BOOST_PP_SEQ_FOR_EACH_O, BOOST_PP_SEQ_FOR_EACH_M)
^
note: (skipping 9 expansions in backtrace; use -fmacro-backtrace-limit=0 to see all)
/usr/local/include/boost/preprocessor/seq/for_each.hpp:49:57: note: expanded from macro 'BOOSTIn file included from /Users/alex/ros_catkin_ws/src/pcl/kdtree/src/kdtree_flann.cpp:_PP_S39:
/Users/alex/ros_catkin_ws/src/pcl/common/include/pcl/point_types.h:397:1: warning: offset of on nEQon-_FOPOD type 'pcl::PointNormal' [-Winvalid-offsetof]
In file included from /Users/alex/ros_catkin_ws/src/pcl/common/test/test_intensity.cpp:R_EA42:
POINT_CLOUD_REGISTER_POINT_STRUCT (pcl::PointNormal,/Users/alex/ros_catkin_ws/src/pcl/common/include/pcl/point_types.h
CH_^
/Users/alex/ros_catkin_ws/src/pcl/common/include/pcl/ros/register_point_struct.h:58M:3: note: ex_I'
# define BOOST_PP_SEQ_FOR_EACH_M_I(r, macro, data, seq) macro(r, data, BOOST_PP_SEQ_HEAD(seq))
^
:397:1: warning: offset of on non-POD type 'pcl::PointNormal' [-Winvalid-/Users/alex/ros_catkin_ws/src/pcl/common/include/pcl/ros/register_point_struct.h:121pandof:33: note: expanded from macro 'POINT_CLOUD_REGISTER_FIELD_OFFSET'
edfs f static const size_t value = offsetof(name, BOOST_PP_TUPLE_ELEM(3, 1, elem)); \r
om macro 'POINT_CLOUD_REGISTER_POINT_STRUCT'
POINT_CLOUD_REGISTER_POINT_STRUCT_I(name, \
et ^
^
/Users/alex/ros_catkin_ws/src/pcl/common/include/pcl/ros/register_point_struct.h:93:/usr/bin/../lib/clang/4.2/include/stddef.h29::62 :note: 24e:x pnote: aenxdpeadn dferdo mf rmoamc rmoa c'rPoO I'NoTf_fCsLeOtUoDf_'R
EGISTER_POINT_STRUCT_I'
#define offsetof(t, d) __builtin_offsetof(t, d)
^
BOOST_PP_SEQ_FOR_EACH(POINT_CLOUD_REGISTER_FIELD_OFFSET, name, seq) \
^
/usr/local/include/boost/preprocessor/seq/for_each.hpp:26:67: note: expanded from macro 'BOOST_PP_SEQ_FOR_EACH'
# define BOOST_PP_SEQ_FOR_EACH(macro, data, seq) BOOST_PP_FOR((macro, data, seq (nil)), BOOST_PP_SEQ_FOR_EACH_P, BOOST_PP_SEQ_FOR_EACH_O, BOOST_PP_SEQ_FOR_EACH_M)
^
note: (skipping 9 expansions in backtrace; use -fmacro-backtrace-limit=0 to see all)
/usr/local/include/boost/preprocessor/seq/for_each.hpp:49:57: note: expanded from macro 'BOOST_PP_SEQ_FOR_EACH_M_I'
# define BOOST_PP_SEQ_FOR_EACH_M_I(r, macro, data, seq) macro(r, data, BOOST_PP_SEQ_HEAD(seq))
^
/Users/alex/ros_catkin_ws/src/pcl/common/include/pcl/ros/register_point_struct.h:121In file included from /Users/alex/ros_catkin_ws/src/pcl/common/test/test_operators.cpp:40:33:
/Users/alex/ros_catkin_ws/src/pcl/common/include/pcl/point_types.h:397:1: warning: offset o: of]note:
expanded from macro 'POINT_CLOUD_REGISTER_FIELD_OFFSET'
POINT_CLOUD_REGISTER_POINT_STRUCT (pcl::PointNormal,
^
static const size_t value = offsetof(name, BOOST_PP_TUPLE_ELEM(3, 1, elem)); \
^
/Users/alex/ros_catkin_ws/src/pcl/common/include/pcl/ros/register_point_struct.h:58:3: note: expanded from macro 'POINT_CLOUD_REGISTER_POINT_STRUCT'
POINT_CLOUD_REGISTER_POINT_STRUCT_I(name, \
^
/Users/alex/ros_catkin_ws/src/pcl/common/include/pcl/ros/register_point_struct.h:93:29: note: expanded from macro 'POINT_CLOUD_REGISTER_POINT_STRUCT_I'
BOOST_PP_SEQ_FOR_EACH(POINT_CLOUD_REGISTER_FIELD_OFFSET, name, seq) \
^
/usr/local/include/boost/preprocessor/seq/for_each.hpp:26:67: note: expanded from macro 'BOOST_PP_SEQ_FOR_EACH'
# define BOOST_PP_SEQ_FOR_EACH(macro, data, seq) BOOST_PP_FOR((macro, data, seq (nil)), BOOST_PP_SEQ_FOR_EACH_P, BOOST_PP_SEQ_FOR_EACH_O, BOOST_PP_SEQ_FOR_EACH_M)
^
note: (skipping 5 expansions in backtrace; use -fmacro-backtrace-limit=0 to see all)
/usr/local/include/boost/preprocessor/seq/for_each.hpp:49:57: note: expanded from macro 'BOOST_PP_SEQ_FOR_EACH_M_I'
# define BOOST_PP_SEQ_FOR_EACH_M_I(r, macro, data, seq) macro(r, data, BOOST_PP_SEQ_HEAD(seq))
^
/Users/alex/ros_catkin_ws/src/pcl/common/include/pcl/ros/register_point_struct.h:121:33: note: expanded from macro 'POINT_CLOUD_REGISTER_FIELD_OFFSET'
static const size_t value = offsetof(name, BOOST_PP_TUPLE_ELEM(3, 1, elem)); \
^
/usr/bin/../lib/clang/4.2/include/stddef.h:62:24: note: expanded from m/usr/bin/../lib/clang/4.2/include/stddef.h:a62:24: note: expanded from macro 'offsetof'
#define offsetof(t, d) __builtin_offsetof(t, d)
^
fc roon 'noofnf-sPeOtDo ft'y
pe 'pcl::PointNormal' [-Winval#define offsetof(t, d) __builtin_offsetof(t, d)
^id-offsetof]
In file included from /Users/alex/ros_catkin_ws/src/pcl/kdtree/src/kdtree_flann.cpp:39:
/Users/alex/ros_catkin_ws/src/pcl/common/include/pcl/point_types.h:397:1: warning: offset of on non-POD type 'pcl::PointNoPOINT_CLOUD_REGISTER_POINT_STRUCT (pcl::PointNormal,
^
/Users/alex/ros_catkin_ws/src/pcl/common/include/pcl/ros/register_point_struct.h:58:3: note: expanded from macrrmal' [-Winvalid-offsetof]
POINT_CLOUD_REGISTER_POINT_STRUCT (pcl::PointNormal,
^
In file included from /Users/alex/ros_catkin_ws/src/pcl/common/test/test_intensity.cpp:42:
/Users/alex/ros_catkin_ws/src/pcl/common/include/pcl/point_types.h:397:1/Users/alex/ros_catkin_ws/src/pcl/common/include/pcl/ros/register_point_struct.h:: 58warning: :o3f:f snote: eetx poafn doend nforno-mP Omacro 'POINT_CLOUD_REGISTER_POINT_STRUCT'
POINT_CLOUD_REGISTER_POINT_STRUCT_I(name, \
^
/Users/alex/ros_catkin_ws/src/pcl/common/include/pcl/ros/register_point_struct.h:93:29: note: expanded from macro 'POINT_CLOUDD _REGISTER_POINT_STRUCT_I'
BOOST_PP_SEQ_FOR_EACH(POINT_CLOUD_REGISTER_FIELD_OFFSET, name, seq) \
^
/usr/local/include/boost/preprocessor/seq/for_each.hpp:26:67: note: expanded from macro 'BOOST_PP_SEQ_FOR_Etype 'pcl::PointNormal' [-Winvalid-offsetof]
POINT_CLOUD_REGISTER_POINT_STRUCT (pcl::PointNormal,
^
/Users/alex/ros_catkin_ws/src/pcl/common/include/pcl/ros/register_point_struct.h:58:3: note: expanded from macro 'POINT_CLOUD_REGISTER_POINT_STRUCT'
POINT_CLOUD_REGISTER_POINT_STRUCT_I(name, \
^
/Users/alex/ros_catkin_ws/src/pcl/common/include/pcl/ros/register_point_struct.h:93:29: note: expanded from macro 'POINT_CLOUD_REGISTER_POINT_STRUCT_I'
o BOOST_PP_SEQ_FOR_EACH(POINT_CLOUD_REGISTER_FIELD_OFFSET, name, seq) \
^
/usr/local/include/boost/preprocessor/seq/for_each.hpp:26:67: note: expanded from macro 'BOOST_PP_SEQ_FOR_EACH'
# define BOOST_PP_SEQ_FOR_EACH(macro, data, seq) BOOST_PP_FOR((macro, data, seq (nil)), BOOST_PP_SEQ_FOR_EACH_P, BOOST_PP_SEQ_FOR_EACH_O, BOOST_PP_SEQ_FOR_EACH_M)
^
note: (skipping 9 expansions in backtrace; use -fmacro-backtrace-limit=0 to see all)
/usr/local/include/boost/preprocessor/seq/for_each.hpp:49:57: note: expanded from macro 'BOOST_PP_SEQ_FOR_EACH_M_I'
# define BOOST_PP_SEQ_FOR_EACH_M_I(r, macro, data, seq) macro(r, data, BOOST_PP_SEQ_HEAD(seq))
^
/Users/alex/ros_catkin_ws/src/pcl/common/include/pcl/ros/register_point_struct.h:121:33: note: expanded from macro 'POINT_CLOUD_REGISTER_FIELD_OFFSET'
static const size_t value = offsetof(name, BOOST_PP_TUPLE_ELEM(3, 1, elem)); \
^
/usr/bin/../lib/clang/4.2/include/stddef.h:62:24: note: expanded from macACHro''
'offsetof'
#define offsetof(t, d) __builtin_offsetof(t, d)
^
# define BOOST_PP_SEQ_FOR_EACH(macro, data, seq) BOOST_PP_FOR((macro, data, seq (nil)), BOOST_PP_SEQ_FOR_EACH_P, BOOST_PP_SEQ_FOR_EACH_O, BOOST_PP_SEQ_FOR_EACH_M)
^
note: (skipping 13 expansions in backtrace; use -fmacro-backtrace-limit=0 to see all)
/usr/local/include/boost/preprocessor/seq/for_each.hpp:49:57: note: expanded from macro 'BOOST_PP_SEQ_FOR_EACH_M_I'
# define BOOST_PP_SEQ_FOR_EACH_M_I(r, macro, data, seq) macro(r, data, BOOST_PP_SEQ_HEAD(seq))
^
/Users/alex/ros_catkin_ws/src/pcl/common/include/pcl/ros/register_point_struct.h:121:33: note: expanded from macroP 'POINT_CLOUD_REGISTER_FIELD_OFFSET'
static const size_t value = offsetof(name, BOOST_PP_TUPLE_ELEM(3, 1, elem)); \
^
OINT_CLOUD_/usr/bin/../lib/clang/4.2/include/stddef.h:62:24: note: expanded from macro 'offREsetof'In file included from G/Users/alex/ros_catkin_ws/src/pcl/common/test/test_intensity.cppI:S42T:
E/Users/alex/ros_catkin_ws/src/pcl/common/include/pcl/point_types.h:397:1: warning: offset of on non-POD type 'pcl::PointNormal' [R-_WPiOnIvNaTl_iSdT-RoUfCfTs'e
tof]
POINT_CLOUD_REGISTER_POINT_STRUCT_I(name, \
^
POINT_CLOUD_REGISTER_POINT_STRUCT (pcl::PointNormal,
^
/Users/alex/ros_catkin_ws/src/pcl/common/include/pcl/ros/register_point_struct.h:93:29: note: expanded from macro 'POINT_CLOUD_REGISTER_POINT_STRUCT/Users/alex/ros_catkin_ws/src/pcl/common/include/pcl/ros/register_point_struct.h_:I58':
3: note: expanded from macro 'POINT_CLOUD_REGISTER_P BOOST_PP_SEQ_FOR_EACH(POINT_CLOUD_REGISTER_FIELD_OFFSET, name, seq) \O
I ^N
T_STRUCT'
POINT_CLOUD_REGISTER_POINT_STRUCT_I(name, \
^
/usr/local/include/boost/preprocessor/seq/for_each.hpp:26:67: note: expanded from macro 'BOOST_PP_SEQ_FOR_EACH/Users/alex/ros_catkin_ws/src/pcl/common/include/pcl/ros/register_point_struct.h:93'
:29: note: expanded from macro 'POINT_CLOUD_# define BOOST_PP_SEQ_FOR_EACH(macro, data, seq) BOOST_PP_FOR((macro, data, seq (nil)), BOOST_PP_SEQ_FOR_EACH_P, BOOST_PP_SEQ_FOR_EACH_O, BOOST_PP_SEQ_FOR_EACH_M)
^
note: (skipping 13 expansions in backtrace; use -fmacro-backtrace-limit=0 to see all)
REGISTER_POINT_STRUCT_I'
BOOST_PP_SEQ_FOR_EACH(POINT_CLOUD_REGISTER_FIELD_OFFSET, name, seq) \
^
/usr/local/include/boost/preprocessor/seq/for_each.hpp:26:67: note: expanded from macro 'BOOST_PP_SEQ_FOR_EACH'
# define BOOST_PP_SEQ_FOR_EACH(macro, data, seq) BOOST_PP_FOR((macro, data, seq (nil)), BOOST_PP_SEQ_FOR_EACH_P, BOOST_PP_SEQ_FOR_EACH_O, BOOST_PP_SEQ_FOR_EACH_M)
^
note: (skipping 13 expansions in backtrace; use -fmacro-backtrace-limit=0 to see all)
/usr/local/include/boost/preprocessor/seq/for_each.hpp:49:57: note: expanded from macro 'BOOST_PP_SEQ_FOR_EACH_M_I'
# define BOOST_PP_SEQ_FOR_EACH_M_I(r, macro, data, seq) macro(r, data, BOOST_PP_SEQ_HEAD(seq))
^
/Users/alex/ros_catkin_ws/src/pcl/common/include/pcl/ros/register_point_struct.h:121:33: note: expanded from /usr/local/include/boost/preprocessor/seq/for_each.hpp:
49m:a57c:r onote: expand#define offsetof(t, d) __builtin_offsetof(t, d)
^ '
ed from macro 'BOOST_PP_SEQ_FOR_EACH_M_I'
# define BOOST_PP_SEQ_FOR_EACH_M_I(r, macro, data, seq) macro(r, data, BOOST_PP_SEQ_HEAD(seq))
^
/Users/alex/ros_catkin_ws/src/pcl/common/include/pcl/ros/register_point_struct.h:121:33: note: expanded from macro 'POINT_CLOUD_REGISTER_FIELD_OFFSET'
static const size_t value = offsetof(name, BOOST_PP_TUPLE_ELEM(3, 1, elem)); \
^
/usr/bin/../lib/clang/4.2/include/stddef.h:62:24: note: expanded from macro 'offsetof'
#define offsetof(t, d) __builtin_offsetof(t, d)
^
POINT_CLOUD_REGISTER_FIELD_OFFSET'
In file included from /Users/alex/ros_catkin_ws/src/pcl/kdtree/src/kdtree_flann.cppIn file included from /Users/alex/ros_catkin_ws/src/pcl/common/test/test_operators.cpp:40:
/Users/alex/ros_catkin_ws/src/pcl/common/include/pcl/point_types.h:397::39:
/Users/alex/ros_catkin_ws/src/pcl/common/include/pcl/point_types.h:397:1: warning: offset of on non-POD type 'pcl::PointNormal' [-Winvalid-offsetof]
POINT_CLOUD_REGISTER_POINT_STRUCT (pcl::PointNormal,
^
1:/Users/alex/ros_catkin_ws/src/pcl/common/include/pcl/ros/register_point_struct.h:58:3: note: expanded from static const size_t value = offsetof(name, BOOST_PP_TUPLE_ELEM(3, 1, elem)); \
^
/usr/bin/../lib/clang/4.2/include/stddef.h:62:24: note: expandmac warning: offsed ero f't of oPOINT_CLOUD_REGISTER_rom macro 'offsetof'
#define offsetof(t, d) __builtin_offsetof(t, d)
^
POINT_STRUCT'
POINT_CLOUD_REGISTER_POINT_STRUCT_I(name, \
^
n non-POD type /Users/alex/ros_catkin_ws/src/pcl/common/include/pcl/ros/register_point_struct.h:93:29: note: expanded from macro 'POINT_CLOUD_REGISTER_POINT_STRUCT_I'
BOOST_PP_SEQ_FOR_EACH(POINT_CLOUD_REGISTER_FIELD_OFFSET, name, seq) \
^
In file included from /Users/alex/ros_catkin_ws/src/pcl/common/test/test_intensity.cpp:42:
/Users/alex/ros_catkin_ws/src/pcl/common/include/pcl/point_types.h:397:1: warning: offset of on non-POD type 'pcl::Poin/usr/local/include/boost/preprocessor/seq/for_each.hppt:N26o:r67m:a lnote: 'e x[p-aWnidnevda lfirdo-mo fmfascertoo f']B
OOST_PP_SEQ_FOR_EACH'
# define BOOST_PP_SEQ_FOR_EACH(macro, data, seq) BOOST_PP_FOR((macro, data, seq (nil)), BOOST_PP_SEQ_FOR_EACH_P, BOOST_PP_SEQ_FOR_EACH_O, BOOST_PP_SEQ_FOR_EACH_M)
^
POINT_CLOUD_REGISTER_POINT_STRUCT (pcl::PointNormal,
^
note: (skipping 17 expansions in backtrace; use -fmacro-backtrace-limit=0 to see all)
/Users/alex/ros_catkin_ws/src/pcl/common/include/pcl/ros/register_point_struct.h:58/usr/local/include/boost/preprocessor/seq/for_each.hpp:49:57'pcl:: note: :3::Pexpaoin note: enxded ftrNormaplandom macro 'BOOST_PP_SEQ_FOR_EACH_M_I'
# define BOOST_PP_SEQ_FOR_EACH_M_I(r, macro, data, seq) macro(r, data, BOOST_PP_SEQ_HEAD(seq))
^
/Users/alex/ros_catkin_ws/src/pcl/common/include/pcl/ros/register_point_struct.h:121:33: note: expanded from macro 'POINT_CLOUD_REGISTER_FIELD_OFFSET'
static const size_t value = offsetof(name, BOOST_PP_TUPLE_ELEM(3, 1, elem)); \
^
/usr/bin/../lib/clang/4.2/include/stddef.h:62:24: note: expanded from macro 'offsetof'
ed from macro 'POINT_CLOU#define offsetof(t, d) __builtin_offsetof(t, d)D
_ ^
' [-Winvalid-offsetof]
In file included from /Users/alex/ros_catkin_ws/src/pcl/kdtree/src/kdtree_flann.cpp:39:
/Users/alex/ros_catkin_ws/src/pcl/common/include/pcl/point_types.h:397:1: warning: offset ofPOINT_CLOUD_REGISTER_POINT_STRUCT (pcl::PointNormal,
^REGISTER
on non-POD type 'pcl::PointNormal' [-Winvalid-/Users/alex/ros_catkin_ws/src/pcl/common/include/pcl/ros/register_point_struct.h:58:3: note: expanded from macro 'POINT_CLOUD_offsetoREfGIST_PER_]
OINT_STRUCT'
POINT_CLOUD_REGISTER_POINT_STRUCT_I(name, \
^
POINT_CLOUD_REGISTER_POINT_STRUCT (pcl::PointNormal,
^
/Users/alex/ros_catkin_ws/src/pcl/common/include/pcl/ros/register_point_struct.h:58:3: note: /Users/alex/ros_catkin_ws/src/pcl/common/include/pcl/ros/register_point_struct.h:93exPpOINandedT:_29S:T R UfCronote: meT'
POINT_CLOUD_REGISTER_POINT_STRUCT_I(name, \
^
/Users/alex/ros_catkin_ws/src/pcl/common/include/pcl/ros/register_point_struct.h:93: 29macro 'POINT_CLOUD: note: e_REGxpanded from macro IST'POINT_CLOUD_REGISTxER_POER_POIINT_SNT_STRUCT_I'
TRUCT'
BOOST_PP_SEQ_FOR_EACH(POINT_CLOUD_REGISTER_FIELD_OFFSET, name, seq) \
^
POINT_CLOUD_REGISTER_POINT_STRUCT_I(name, \
^
/usr/local/include/boost/preprocessor/seq/for_each.hpp:26:67: note: expanded from macro 'BOOST_/Users/alex/ros_catkin_ws/src/pcl/common/include/pcl/ros/register_point_struct.h:93:29P:P _note: SeExQp_aFnOdRe_dE AfCrHo'm
macro 'POINT_CLOUD_REGISTER_POINT_STRUCT_I'
BOOST_PP_SEQ_FOR_EACH(POINT_CLOUD_REGISTER_FIELD_OFFSET, name, seq) \
^
# define BOOST_PP_SEQ_FOR_EACH(macro, data, seq) BOOST_PP_FOR((macro, data, seq (nil)), BOOST_PP_SEQ_FOR_EACH_P, BOOST_PP_SEQ_FOR_EACH_O, BOOST_PP_SEQ_FOR_EACH_M)
^
note: (skipping 17 expansions in backtrace; use -fmacro-backtrace-limit=0 to see all)/usr/local/include/boost/preprocessor/seq/for_each.hpp:
pand/usr/local/include/boost/preprocessor/seq/for_each.hpp:49ed26:: 67f:r onote: e57:m xmpaacnrdoe d' PfOrIoNmT _mCaLcOU note: erxo D_REG'BOIOSTER_SpanPOIT_PP_NdSeTEQ_FOR__STd fEACHRUCT_'I
'
rom macro 'BOOST_PP_SEQ_FOR_EACH_M_I'
BOOST_PP_SEQ_FOR_EACH(POINT_CLOUD_REGISTER_FIELD_OFFSET, name, seq) \
^
# define BOOST_PP_SEQ_FOR_EACH(macro, data, seq) BOOST_PP_FOR((macro, data, seq (nil)), BOOST_PP_SEQ_FOR_EACH_P, BOOST_PP_SEQ_FOR_EACH_O, BOOST_PP_SEQ_FOR_EACH_M)
^
note: (skipping 21 expansions in backtrace; use -fmacro-backtrace-limit=0 to see all)
# define BOOST_PP_SEQ_FOR_EACH_M_I(r, macro, data, seq) macro(r, data, BOOST_PP_SEQ_HEAD(seq))
^
/usr/local/include/boost/preprocessor/seq/for_each.hpp:26:67: note: expanded from macro 'BOOST_PP_SEQ_FOR_EACH'
/usr/local/include/boost/preprocessor/seq/for_each.hpp:49:57: note: expanded/Users/alex/ros_catkin_ws/src/pcl/common/include/pcl/ros/register_point_struct.h: fr121:om33 m: note: expanded# define BOOST_PP_SEQ_FOR_EACH(macro, data, seq) BOOST_PP_FOR((macro, data, seq (nil)), BOOST_PP_SEQ_FOR_EACH_P, BOOST_PP_SEQ_FOR_EACH_O, BOOST_PP_SEQ_FOR_EACH_M)a
c ^r
o 'BOOST_PP_SEQ_Fnote: (skipping 17 expansions in backtrace; use -fmacro-backtrace-limit=0 to see all) fr
Oom mR_acEACrHo_ M'_PIO'I
NT_CLOUD_REGISTER_FIELD_OFFSET'
/usr/local/include/boost/preprocessor/seq/for_each.hpp:49:57: note: expanded fr# define BOOST_PP_SEQ_FOR_EACH_M_I(r, macro, data, seq) macro(r, data, BOOST_PP_SEQ_HEAD(seq))
om ^
mac static const size_t value = offsetof(name, BOOST_PP_TUPLE_ELEM(3, 1, elem)); \
r ^o 'B
OOST_PP_SEQ_FOR_EACH_M_I'
/Users/alex/ros_catkin_ws/src/pcl/common/include/pcl/ros/register_point_struct.h:121:33: note: ex# define BOOST_PP_SEQ_FOR_EACH_M_I(r, macro, data, seq) macro(r, data, BOOST_PP_SEQ_HEAD(seq))/usr/bin/../lib/clang/4.2/include/stddef.h
pand:62: ^
24: note: eedx pfarnom mdeacrod 'PfrOIom macro 'offse/Users/alex/ros_catkin_ws/src/pcl/common/include/pcl/ros/register_point_struct.hto:f121':
NT_CLO33: Unote: De_#define offsetof(t, d) __builtin_offsetof(t, d)xpaRndEGIe
S ^T
ER_FIELD_OFFSET'
static const size_t value = offsetof(name, BOOST_PP_TUPLE_ELEM(3, 1, elem)); \d from m
acr ^
/usr/bin/../lib/clang/4.2/include/stddef.h:62o ':24POINT_CLOUD_REGISTER_FIELD_OFFSET'
static const size_t value = offsetof(name, BOOST_PP_TUPLE_ELEM(3, 1, elem)); \
: ^
/usr/bin/../lib/clang/4.2/include/stddef.h:62note: expanded from macro 'offsetof'
#define offsetof(t, d) __builtin_offsetof(t, d)
: ^24:
In file included from /Users/alex/ros_catkin_ws/src/pcl/common/test/test_operators.cpp:40note: ex:
/Users/alex/ros_catkin_ws/src/pcl/common/include/pcl/point_types.h:397:1: warning: offset of on nopanded from macro 'offsetof'
#define offsetof(t, d) __builtin_offsetof(t, d)
^
n-POD type 'pcl::PointNormal' [-Winvalid-offsetof]
In file included from /Users/alex/ros_catkin_ws/src/pcl/kdtree/src/kdtree_flann.cpp:39POINT_CLOUD_REGISTER_POINT_STRUCT (pcl::PointNormal,
:
^
/Users/alex/ros_catkin_ws/src/pcl/common/include/pcl/ros/register_point_struct.h:58:3: note: exp/Users/alex/ros_catkin_ws/src/pcl/common/include/pcl/point_types.h:397aIn file included from n/Users/alex/ros_catkin_ws/src/pcl/common/test/test_intensity.cppd::142::
/Users/alex/ros_catkin_ws/src/pcl/common/include/pcl/point_types.h:397:1edwarning: : warning: oofffffsroms met oef oacron n'to of on nn-oPnO-INPOD PODt Tyty_CLOpe UD_REGISTp'EpRe _'PcOlpcl:IN:TP_oSTR:Ui:PontinCNTortNmorma'l'
[a-lW'i n[v-aWliindv-ofalidf-setofoffs POINT_CLOUD_REGISTER_POINT_STRUCT_I(name, \
e ^t
]
/Users/alex/ros_catkin_ws/src/pcl/common/include/pcl/ros/register_point_struct.h:93o:f]
POINT_CLOUD_REGISTER_POINT_STRUCT (pcl::PointNormal,
29: note: e^x
panded from macro 'POINT_CLOUD_REGISTER_POINT_STRUCT_I'
POINT_CLOUD_REGISTER_POINT_STRUCT (pcl::PointNormal,
^
/Users/alex/ros_catkin_ws/src/pcl/common/include/pcl/ros/register_point_struct.h:58:3: note: e BOOST_PP_SEQ_FOR_EACH(POINT_CLOUD_REGISTER_FIELD_OFFSET, name, seq) \
^
/Users/alex/ros_catkin_ws/src/pcl/common/include/pcl/ros/register_point_struct.h:58:3: note: expanded from macro 'POIxpa/usr/local/include/boost/preprocessor/seq/for_each.hpp:NTn26_:C67L:ded OfU D_REGrom macnote: ISrTeER_o 'PPOOINTxpINT_C_LSaOUD_nREGTRdISTERUCT'e
d from _PmacOrIoN T'_BSOTORSUTC_TP'P
_SEQ_ POINT_CLOUD_REGISTER_POINT_STRUCT_I(name, \F
O ^R
_EACH'
POINT_CLOUD_REGISTER_POINT_STRUCT_I(name, \
^
/Users/alex/ros_catkin_ws/src/pcl/common/include/pcl/ros/register_point_struct.h:93:29: note: expanded # define BOOST_PP_SEQ_FOR_EACH(macro, data, seq) BOOST_PP_FOR((macro, data, seq (nil)), BOOST_PP_SEQ_FOR_EACH_P, BOOST_PP_SEQ_FOR_EACH_O, BOOST_PP_SEQ_FOR_EACH_M)
^
note: /Users/alex/ros_catkin_ws/src/pcl/common/include/pcl/ros/register_point_struct.h(skipping 21 expansions in backtrace; use -fmacro-backtrace-limit=0 to see all):f
93rom macro 'POINT_CLOUD_:29:R note: expanded from macro 'POINT_CLOUD_R/usr/local/include/boost/preprocessor/seq/for_each.hpp:49:EGIEGISTER_P57OINT_S:T Snote: TexpER_RUCaPnOdT_II'N
T_eSd fTRUrCoTm_ Im'a
cro 'BOOST_PP_SEQ_FOR_EACH_ BOOST_PP_SEQ_FOR_EACH(POINT_CLOUD_REGISTER_FIELD_OFFSET, name, seq) \
^
M_I BOOST_PP_SEQ_FOR_EACH(POINT_CLOUD_REGISTER_FIELD_OFFSET, name, seq) \'
^
# define BOOST_PP_SEQ_FOR_EACH_M_I(r, macro, data, seq) macro(r, data, BOOST_PP_SEQ_HEAD(seq))
^
/usr/local/include/boost/preprocessor/seq/for_each.hpp:26:67: note: expanded from macro 'BOOST_PP_SEQ_FOR_EACH'
/usr/local/include/boost/preprocessor/seq/for_each.hpp/Users/alex/ros_catkin_ws/src/pcl/common/include/pcl/ros/register_point_struct.h::26121::6733:: note: note: eexxppaannddeedd ffrroomm mmaaccrroo ''BPOOOISNTT__PCPL_OSUEDQ__RFEOGRI_SETAECRH_'F
IELD_OF# define BOOST_PP_SEQ_FOR_EACH(macro, data, seq) BOOST_PP_FOR((macro, data, seq (nil)), BOOST_PP_SEQ_FOR_EACH_P, BOOST_PP_SEQ_FOR_EACH_O, BOOST_PP_SEQ_FOR_EACH_M)
^
FSET'
note: (skipping 21 expansions in backtrace; use -fmacro-backtrace-limit=0 to see all)
static const size_t value = offsetof(name, BOOST_PP_TUPLE_ELEM(3, 1, elem)); \
^
# define BOOST_PP_SEQ_FOR_EACH(macro, data, seq) BOOST_PP_FOR((macro, data, seq (nil)), BOOST_PP_SEQ_FOR_EACH_P, BOOST_PP_SEQ_FOR_EACH_O, BOOST_PP_SEQ_FOR_EACH_M)
^
note: (skipping 25 expansions in backtrace; use -fmacro-backtrace-limit=0 to see all)
/usr/local/include/boost/preprocessor/seq/for_each.hpp:49:57: note: expanded from macro 'BOOS/usr/bin/../lib/clang/4.2/include/stddef.hT:_62P:P24_:S Enote: Qe_xFOR_EACH_M_pan/usr/local/include/boost/preprocessor/seq/for_each.hppI:'49
:de57: note: expanded from macro 'BOOST_# define BOOST_PP_SEQ_FOR_EACH_M_I(r, macro, data, seq) macro(r, data, BOOST_PP_SEQ_HEAD(seq))P
P ^_
SEQ_FOR_Ed from ACHmacro_M_I'
/Users/alex/ros_catkin_ws/src/pcl/common/include/pcl/ros/register_point_struct.h:# define BOOST_PP_SEQ_FOR_EACH_M_I(r, macro, data, seq) macro(r, data, BOOST_PP_SEQ_HEAD(seq))
121':o33f:f s ^
enote: extopfa'n
ded from macro 'POINT_CLOUD_REGI#define offsetof(t, d) __builtin_offsetof(t, d)
^
/Users/alex/ros_catkin_ws/src/pcl/common/include/pcl/ros/register_point_struct.h:S121TER_FIELD_OFFSET'
static const size_t value = offsetof(name, BOOST_PP_TUPLE_ELEM(3, 1, elem)); \
^
:33: note: /usr/bin/../lib/clang/4.2/include/stddef.h:62:24: note: expanded expfandedrom macro 'offsetof'
#define offsetof(t, d) __builtin_offsetof(t, d)
fr ^
om macro 'POINT_CLOUD_REGISTER_FIELD_OFFSET'
static const size_t value = offsetof(name, BOOST_PP_TUPLE_ELEM(3, 1, elem)); \
^
/usr/bin/../lib/clang/4.2/include/stddef.h:62:24: note: expanded from macro 'offsetof'
In file included from #define offsetof(t, d) __builtin_offsetof(t, d)/Users/alex/ros_catkin_ws/src/pcl/common/test/test_operators.cpp
: ^
40:
/Users/alex/ros_catkin_ws/src/pcl/common/include/pcl/point_types.hIn file included from /Users/alex/ros_catkin_ws/src/pcl/common/test/test_intensity.cpp:42:
/Users/alex/ros_catkin_ws/src/pcl/common/include/pcl/point_types.h:397:1: warning: offset of on non-POD ty:397pe:1 :'pcl::PointNormal' warning: offset of on non-POD type 'pcl::PointNormal' [-Winvalid-offsetof]
[-Winvalid-offsetof]
In file included from /Users/alex/ros_catkin_ws/src/pcl/kdtree/src/kdtree_flann.cpp:39:
/Users/alex/ros_catkin_ws/src/pcl/common/include/pcl/point_types.h:397:1: warning: offset of on non-POD type 'pcl::PointNormal' [-Winvalid-offsetof]
POINT_CLOUD_REGISTER_POINT_STRUCT (pcl::PointNormal,
^
POINT_CLOUD_REGISTER_POINT_STRUCT (pcl::PointNormal,
^
/Users/alex/ros_catkin_ws/src/pcl/common/include/pcl/ros/register_point_struct.h:58:3: note: expanded from macrPOINT_CLOUD_REGISTER_POINT_STRUCT (pcl::PointNormal,/Users/alex/ros_catkin_ws/src/pcl/common/include/pcl/ros/register_point_struct.h:
^
o 'P58:3:O Inote: NeTx_pCaLnOdUeDd_REG fromIS macro 'POTEINT_CRLO_UPDO_/Users/alex/ros_catkin_ws/src/pcl/common/include/pcl/ros/register_point_struct.hRE:G58ISTE:3: note: IR_PONTexINT_ST_RUSpTCRaUCT'
nded T'from
POINT_CLOUD_REGISTER_POINT_STRUCT_I(name, \
m ^
acro 'POINT_CLOUD_REGISTER POINT_CLOUD_REGISTER_POINT_STRUCT_I(name, \
^
_POINT_STRUCT'
POINT_CLOUD_REGISTER_POINT_STRUCT_I(name, \
^
/Users/alex/ros_catkin_ws/src/pcl/common/include/pcl/ros/register_point_struct.h:93:29/Users/alex/ros_catkin_ws/src/pcl/common/include/pcl/ros/register_point_struct.h:93:: 29note: :e xnote: peaxnpdaend frdoemd mfarcormo m'aPcOrIoN T'_PCOL/Users/alex/ros_catkin_ws/src/pcl/common/include/pcl/ros/register_point_struct.hOUINDT__RC:93:29: LOEGISTnote: UD_expaREGISTERndedE _POINfRT_Pr_OSIoNT_TSTm maRURcUrCoT _'CT_IP'O
INTI'_CLOUD
BOOST_PP_SEQ_FOR_EACH(POINT_CLOUD_REGISTER_FIELD_OFFSET, name, seq) \
_ ^REG
BOOST_PP_SEQ_FOR_EACH(POINT_CLOUD_REGISTER_FIELD_OFFSET, name, seq) \
I ^STE
/usr/local/include/boost/preprocessor/seq/for_each.hpp:26R_:67P:O/usr/local/include/boost/preprocessor/seq/for_each.hppI:26:67:N T_STRUCT note: enote: expx_andpIa'ende
d fd frorom m BOOST_PP_SEQ_FOR_EACH(POINT_CLOUD_REGISTER_FIELD_OFFSET, name, seq) \
^
macro ma'BOOST_PP_SEQ_FOR_/usr/local/include/boost/preprocessor/seq/for_each.hpp:26croE:67ACH'
: note: expanded from macro 'BO 'BOOST_PP_SEQ_FOR_EACH'
# define BOOST_PP_SEQ_FOR_EACH(macro, data, seq) BOOST_PP_FOR((macro, data, seq (nil)), BOOST_PP_SEQ_FOR_EACH_P, BOOST_PP_SEQ_FOR_EACH_O, BOOST_PP_SEQ_FOR_EACH_M)
^
note: (skipping 25 expansions in backtrace; use -fmacro-backtrace-limit=0 to see all)
# define BOOST_PP_SEQ_FOR_EACH(macro, data, seq) BOOST_PP_FOR((macro, data, seq (nil)), BOOST_PP_SEQ_FOR_EACH_P, BOOST_PP_SEQ_FOR_EACH_O, BOOST_PP_SEQ_FOR_EACH_M)
^
note: (skipping 25 expansions in backtrace; use -fmacro-backtrace-limit=0 to see all)
/usr/local/include/boost/preprocessor/seq/for_each.hpp:OST_P49:57P:_SEQ_ FOR_EAnote: expanded /usr/local/include/boost/preprocessor/seq/for_each.hppCH'
from :49m:57:acro 'BOOST_PP_SEQ_FOR_EACH_M_I'
# define BOOST_PP_SEQ_FOR_EACH(macro, data, seq) BOOST_PP_FOR((macro, data, seq (nil)), BOOST_PP_SEQ_FOR_EACH_P, BOOST_PP_SEQ_FOR_EACH_O, BOOST_PP_SEQ_FOR_EACH_M)
^
# define BOOST_PP_SEQ_FOR_EACH_M_I(r, macro, data, seq) macro(r, data, BOOST_PP_SEQ_HEAD(seq))
note: ^(skipping 29 expansions in backtrace; use -fmacro-backtrace-limit=0 to see all)
/Users/alex/ros_catkin_ws/src/pcl/common/include/pcl/ros/register_point_struct.h:/usr/local/include/boost/preprocessor/seq/for_each.hpp121::4933::57 :note: enote: xepxapnadnedde df rfrom note: expandemacromd from mmaaccrroo ''BPOOOISNTT__PCPL_OSUEDQ__RFEOGRI_SETAECRH__FMI_EI'
LD_OFFSET'
# define BOOST_PP_SEQ_FOR_EACH_M_I(r, macro, data, seq) macro(r, data, BOOST_PP_SEQ_HEAD(seq))
o ^
static const size_t value = offsetof(name, BOOST_PP_TUPLE_ELEM(3, 1, elem)); \
'BOOS ^
T_PP_SEQ_FOR_EACH_M_I'
# define BOOST_PP_SEQ_FOR_EACH_M_I(r, macro, data, seq) macro(r, data, BOOST_PP_SEQ_HEAD(seq))/Users/alex/ros_catkin_ws/src/pcl/common/include/pcl/ros/register_point_struct.h:
121/usr/bin/../lib/clang/4.2/include/stddef.h:62:24 ^
:33: note: ex:p note: anded frexpanded from macro 'offsetof'
/Users/alex/ros_catkin_ws/src/pcl/common/include/pcl/ros/register_point_struct.h:121:33om #define offsetof(t, d) __builtin_offsetof(t, d)
: ^ m
acro 'POInote: eNxpT_anded frCLOUD_REGISom macro 'POINT_CLOUD_REGISTER_FIELD_OFFSET'
TER_FIELD_OFFSET'
static const size_t value = offsetof(name, BOOST_PP_TUPLE_ELEM(3, 1, elem)); \
^
static const size_t value = offsetof(name, BOOST_PP_TUPLE_ELEM(3, 1, elem)); \
^
In file included from /Users/alex/ros_catkin_ws/src/pcl/common/test/test_operators.cpp:40:
/Users/alex/ros_catkin_ws/src/pcl/common/include/pcl/point_types.h:397/usr/bin/../lib/clang/4.2/include/stddef.h:62::1: warning: offset of on non-POD type 'pcl::PointNormal' [-W24: /usr/bin/../lib/clang/4.2/include/stddef.hinv:62note: :e24x:p anote: ealndxepda nfdeidrom macro 'offsetof'
d#define offsetof(t, d) __builtin_offsetof(t, d)
from -offsetof]m ^
acr
POINT_CLOUD_REGISTER_POINT_STRUCT (pcl::PointNormal,
^
/Users/alex/ros_catkin_ws/src/pcl/common/include/pcl/ros/register_point_struct.h:58o :3'of: fsetof'
note: expanded from macro 'POINT_CL#define offsetof(t, d) __builtin_offsetof(t, d)
^
OUD_RIn file included from /Users/alex/ros_catkin_ws/src/pcl/common/test/test_intensity.cpp:42:
E/Users/alex/ros_catkin_ws/src/pcl/common/include/pcl/point_types.h:G397I:S1TER_POINT: _STRUCT'
POINT_CLOUD_REGISTER_POINT_STRUCT_I(name, \
^
/Users/alex/ros_catkin_ws/src/pcl/common/include/pcl/ros/register_point_struct.h:93:29: note: expanded from macro 'POINT_CLOUD_REGISTER_POINT_STRUCT_I'
BOOST_PP_SEQ_FOR_EACH(POINT_CLOUD_REGISTER_FIELD_OFFSET, name, seq) \
^
/usr/local/include/boost/preprocessor/seq/for_each.hpp:26:67: note: expanded frowarning: ofmf macro 'BOOST_PP_SEQ_FOR_EACH'
# define BOOST_PP_SEQ_FOR_EACH(macro, data, seq) BOOST_PP_FOR((macro, data, seq (nil)), BOOST_PP_SEQ_FOR_EACH_P, BOOST_PP_SEQ_FOR_EACH_O, BOOST_PP_SEQ_FOR_EACH_M)
set of on non-POD type 'pcl::PointNormal' [-Winvalid-offsetof]
POINT_CLOUD_REGISTER_POINT_STRUCT (pcl::PointNormal,
^ ^
note: (skipping 29 expansions in backtrace; use -fmacro-backtrace-limit=0 to see all)
/usr/local/include/boost/preprocessor/seq/for_each.hpp:49:57:
note: expanded from macro 'BOOST_PP_SEQ_FOR_EACH_M_I'
# define BOOST_PP_SEQ_FOR_EACH_M_I(r, macro, data, seq) macro(r, data, BOOST_PP_SEQ_HEAD(seq))
^
/Users/alex/ros_catkin_ws/src/pcl/common/include/pcl/ros/register_point_struct.h:58:3: note: expanded from macro 'POINT_CLOUD_REGISTER_POINT_STRUCT'
POINT_CLOUD_REGISTER_POINT_STRUCT_I(name, \
^
/Users/alex/ros_catkin_ws/src/pcl/common/include/pcl/ros/register_point_struct.h:121:33: note: expanded from macro 'POINT_C/Users/alex/ros_catkin_ws/src/pcl/common/include/pcl/ros/register_point_struct.h:93:29: note: LOUD_REGISTER_FIELD_OFFexpanded from macrSET'
static const size_t value = offsetof(name, BOOST_PP_TUPLE_ELEM(3, 1, elem)); \
^
/usr/bin/../lib/clang/4.2/include/stddef.h:62o 'PO:24: note: expanded from macro 'offsetof'
#define offsetof(t, d) __builtin_offsetof(t, d)
^
INT_CLOUD_REGISTER_POINT_STRUCT_I'
BOOST_PP_SEQ_FOR_EACH(POINT_CLOUD_REGISTER_FIELD_OFFSET, name, seq) \
^
/usr/local/include/boost/preprocessor/seq/for_each.hpp:26:67: note: expanded from macro 'BOOST_PP_SEQ_FOR_EACH'
# define BOOST_PP_SEQ_FOR_EACH(macro, data, seq) BOOST_PP_FOR((macro, data, seq (nil)), BOOST_PP_SEQ_FOR_EACH_P, BOOST_PP_SEQ_FOR_EACH_O, BOOST_PP_SEQ_FOR_EACH_M)
^
note: (skipping 29 expansions in backtrace; use -fmacro-backtrace-limit=0 to see all)
/usr/local/include/boost/preprocessor/seq/for_each.hpp:49:57: note: expanded from macro 'BOOST_PP_SEQ_FOR_EACH_M_I'
# define BOOST_PP_SEQ_FOR_EACH_M_I(r, macro, data, seq) macro(r, data, BOOST_PP_SEQ_HEAD(seq))
^
/Users/alex/ros_catkin_ws/src/pcl/common/include/pcl/ros/register_point_struct.h:121:33: note: expanded from macro 'POINT_CLOUD_REGISTER_FIELD_OFFSET'
static const size_t value = offsetof(name, BOOST_PP_TUPLE_ELEM(3, 1, elem)); \
^
/usr/bin/../lib/clang/4.2/include/stddef.h:62:24: note: expanded from macro 'offsetof'
#define offsetof(t, d) __builtin_offsetof(t, d)
^
In file included from /Users/alex/ros_catkin_ws/src/pcl/kdtree/src/kdtree_flann.cpp:39:
/Users/alex/ros_catkin_ws/src/pcl/common/include/pcl/point_types.h:417:1: warning: offset of on non-POD type 'pcl::PointXYZINormal' [-Winvalid-offsetof]
POINT_CLOUD_REGISTER_POINT_STRUCT (pcl::PointXYZINormal,
^
/Users/alex/ros_catkin_ws/src/pcl/common/include/pcl/ros/register_point_struct.h:58:3: note: expanded from macro 'POINT_CLOUD_REGISTER_POINT_STRUCT'
POINT_CLOUD_REGISTER_POINT_STRUCT_I(name, \
^
/Users/alex/ros_catkin_ws/src/pcl/common/include/pcl/ros/register_point_struct.h:93:29: note: expanded from macro 'POINT_CLOUD_REGISTER_POINT_STRUCT_I'
BOOST_PP_SEQ_FOR_EACH(POINT_CLOUD_REGISTER_FIELD_OFFSET, name, seq) \
^
/usr/local/include/boost/preprocessor/seq/for_each.hpp:26:67: note: expanded from macro 'BOOST_PP_SEQ_FOR_EACH'
# define BOOST_PP_SEQ_FOR_EACH(macro, data, seq) BOOST_PP_FOR((macro, data, seq (nil)), BOOST_PP_SEQ_FOR_EACH_P, BOOST_PP_SEQ_FOR_EACH_O, BOOST_PP_SEQ_FOR_EACH_M)
^
note: (skipping 5 expansions in backtrace; use -fmacro-backtrace-limit=0 to see all)
/usr/local/include/boost/preprocessor/seq/for_each.hpp:49:57: note: expanded from macro 'BOOST_PP_SEQ_FOR_EACH_M_I'
# define BOOST_PP_SEQ_FOR_EACH_M_I(r, macro, data, seq) macro(r, data, BOOST_PP_SEQ_HEAD(seq))
^
/Users/alex/ros_catkin_ws/src/pcl/common/include/pcl/ros/register_point_struct.h:121:33: note: expanded from macro 'POINT_CLOUD_REGISTER_FIELD_OFFSET'
static const size_t value = offsetof(name, BOOST_PP_TUPLE_ELEM(3, 1, elem)); \
^
/usr/bin/../lib/clang/4.2/include/stddef.h:62:24: note: expanded from macro 'offsetof'
#define offsetof(t, d) __builtin_offsetof(t, d)
^
In file included from /Users/alex/ros_catkin_ws/src/pcl/kdtree/src/kdtree_flann.cpp:39:
/Users/alex/ros_catkin_ws/src/pcl/common/include/pcl/point_types.h:417:1: warning: offset of on non-POD type 'pcl::PointXYZINormal' [-Winvalid-offsetof]
POINT_CLOUD_REGISTER_POINT_STRUCT (pcl::PointXYZINormal,
^
/Users/alex/ros_catkin_ws/src/pcl/common/include/pcl/ros/register_point_struct.h:58:3: note: expanded from macro 'POINT_CLOUD_REGISTER_POINT_STRUCT'
POINT_CLOUD_REGISTER_POINT_STRUCT_I(name, \
^
/Users/alex/ros_catkin_ws/src/pcl/common/include/pcl/ros/register_point_struct.h:93:29: note: expanded from macro 'POINT_CLOUD_REGISTER_POINT_STRUCT_I'
BOOST_PP_SEQ_FOR_EACH(POINT_CLOUD_REGISTER_FIELD_OFFSET, name, seq) \
^
/usr/local/include/boost/preprocessor/seq/for_each.hpp:26:67: note: expanded from macro 'BOOST_PP_SEQ_FOR_EACH'
# define BOOST_PP_SEQ_FOR_EACH(macro, data, seq) BOOST_PP_FOR((macro, data, seq (nil)), BOOST_PP_SEQ_FOR_EACH_P, BOOST_PP_SEQ_FOR_EACH_O, BOOST_PP_SEQ_FOR_EACH_M)
^
note: (skipping 9 expansions in backtrace; use -fmacro-backtrace-limit=0 to see all)
/usr/local/include/boost/preprocessor/seq/for_each.hpp:49:57: note: expanded from macro 'BOOST_PP_SEQ_FOR_EACH_M_I'
# define BOOST_PP_SEQ_FOR_EACH_M_I(r, macro, data, seq) macro(r, data, BOOST_PP_SEQ_HEAD(seq))
^
/Users/alex/ros_catkin_ws/src/pcl/common/include/pcl/ros/register_point_struct.h:121:33: note: expanded from macro 'POINT_CLOUD_REGISTER_FIELD_OFFSET'
static const size_t value = offsetof(name, BOOST_PP_TUPLE_ELEM(3, 1, elem)); \
^
/usr/bin/../lib/clang/4.2/include/stddef.h:62:24: note: expanded from macro 'offsetof'
#define offsetof(t, d) __builtin_offsetof(t, d)
^
In file included from /Users/alex/ros_catkin_ws/src/pcl/kdtree/src/kdtree_flann.cpp:39:
/Users/alex/ros_catkin_ws/src/pcl/common/include/pcl/point_types.h:417:1: warning: offset of on non-POD type 'pcl::PointXYZINormal' [-Winvalid-offsetof]
POINT_CLOUD_REGISTER_POINT_STRUCT (pcl::PointXYZINormal,
^
/Users/alex/ros_catkin_ws/src/pcl/common/include/pcl/ros/register_point_struct.h:58:3: note: expanded from macro 'POINT_CLOUD_REGISTER_POINT_STRUCT'
POINT_CLOUD_REGISTER_POINT_STRUCT_I(name, \
^
/Users/alex/ros_catkin_ws/src/pcl/common/include/pcl/ros/register_point_struct.h:93:29: note: expanded from macro 'POINT_CLOUD_REGISTER_POINT_STRUCT_I'
BOOST_PP_SEQ_FOR_EACH(POINT_CLOUD_REGISTER_FIELD_OFFSET, name, seq) \
^
In file included from /Users/alex/ros_catkin_ws/src/pcl/common/test/test_operators.cpp:40:
/Users/alex/ros_catkin_ws/src/pcl/common/include/pcl/point_types.h:417:1: warning: offset of on non-POD type 'pcl::PointXY/usr/local/include/boost/preprocessor/seq/for_each.hpp:26:67: note: expanded from macro 'BOOST_PP_SEQ_FOR_EACH'
ZINormal' [-Winvalid-offsetof]
POINT_CLOUD_REGISTER_POINT_STRUCT (pcl::PointXYZINormal,
^
/Users/alex/ros_catkin_ws/src/pcl/common/include/pcl/ros/register_point_struct.h:58:3: note: expanded from macro 'POINT_CLOUD_REGISTER_POINT_STRUCT'
POINT_CLOUD_REGISTER_POINT_STRUCT_I(name, \
^
/Users/alex/ros_catkin_ws/src/pcl/common/include/pcl/ros/register_point_struct.h:93:29: note: expanded from macro 'POINT_CLOUD_REGISTER_POINT_STRUCT_I'
BOOST_PP_SEQ_FOR_EACH(POINT_CLOUD_REGISTER_FIELD_OFFSET, name, seq) \
^
/usr/local/include/boost/preprocessor/seq/for_each.hpp:26:67: note: expanded from macro 'BOOST_PP_SEQ_FOR_EACH'
# define BOOST_PP_SEQ_FOR_EACH(macro, data, seq) BOOST_PP_FOR((macro, data, seq (nil)), BOOST_PP_SEQ_FOR_EACH_P, BOOST_PP_SEQ_FOR_EACH_O, BOOST_PP_SEQ_FOR_EACH_M)
^
note: (skipping 5 expansions in backtrace; use -fmacro-backtrace-limit=0 to see all)
/usr/local/include/boost/preprocessor/seq/for_each.hpp:49:57: note: expanded from macro 'BOOST_PP_SEQ_FOR_EACH_M_I'
# define BOOST_PP_SEQ_FOR_EACH_M_I(r, macro, data, seq) macro(r, data, BOOST_PP_SEQ_HEAD(seq))
^
# define BOOST_PP_SEQ_FOR_EACH(macro, data, seq) BOOST_PP_FOR((macro, data, seq (nil)), BOOST_PP_SEQ_FOR_EACH_P, BOOST_PP_SEQ_FOR_EACH_O, BOOST_PP_SEQ_FOR_EACH_M)
^
note: (skipping 13 expansions in backtrace; use -fmacro-backtrace-limit=0 to see all)
/usr/local/include/boost/preprocessor/seq/for_each.hpp:49:57: note: expanded from macro 'BOOST_PP_SEQ_FOR_EACH_M_I'
# define BOOST_PP_SEQ_FOR_EACH_M_I(r, macro, data, seq) macro(r, data, BOOST_PP_SEQ_HEAD(seq))
^
/Users/alex/ros_catkin_ws/src/pcl/common/include/pcl/ros/register_point_struct.h:121:33: note: expanded from macro 'POINT_CLOUD_REGISTER_FIELD_OFFSET'
static const size_t value = offsetof(name, BOOST_PP_TUPLE_ELEM(3, 1, elem)); \
^
/usr/bin/../lib/clang/4.2/include/stddef.h:62:24: note: expanded from macro 'offsetof'
#define offsetof(t, d) __builtin_offsetof(t, d)
^
In file included from /Users/alex/ros_catkin_ws/src/pcl/kdtree/src/kdtree_flann.cpp:39:
/Users/alex/ros_catkin_ws/src/pcl/common/include/pcl/point_types.h:417:1: warning: offset of on non-POD type 'pcl::PointXYZINormal' [-Winvalid/Users/alex/ros_catkin_ws/src/pcl/common/include/pcl/ros/register_point_struct.h:121:33: note: expand-offsetof]
POINT_CLOUD_REGISTER_POINT_STRUCT (pcl::PointXYZINormal,
^
/Users/alex/ros_catkin_ws/src/pcl/common/include/pcl/ros/register_point_struct.h:58:3: note: expanded from macro 'POINT_CLOUD_REGISTER_POINT_ed from macro 'POINT_CLOUD_REGISTER_FIELD_OFFSET'
static const size_t value = offsetof(name, BOOST_PP_TUPLE_ELEM(3, 1, elem)); \
^
/usr/bin/../lib/clang/4.2/include/stddef.h:62:24: note: expanded from macro 'offsetof'
#define offsetof(t, d) __builtin_offsetof(t, d)
^
In file included from /Users/alex/ros_catkin_ws/src/pcl/common/test/test_operators.cpp:40:
/Users/alex/ros_catkin_ws/src/pcl/common/include/pcl/point_types.h:417:1: warning: offset of on non-POD type 'pcl::PointXYZINormal' [-Winvalid-offsetof]
POINT_CLOUD_REGISTER_POINT_STRUCT (pcl::PointXYZINormal,
^
/Users/alex/ros_catkin_ws/src/pcl/common/include/pcl/ros/register_point_struct.h:58:3: note: expanded fSTRrUCT'
POINT_CLOUD_REGISTER_POINT_STRUCT_I(name, \
^
om macro 'POINT_CLOUD_REGISTER_POINT_STRUCT'
/Users/alex/ros_catkin_ws/src/pcl/common/include/pcl/ros/register_point_struct.h:93:29: note: e POINT_CLOUD_REGISTER_POINT_STRUCT_I(name, \
^
xpanded from macro 'POINT_CLOUD_REGISTER_POINT_STRUCT_I'
/Users/alex/ros_catkin_ws/src/pcl/common/include/pcl/ros/register_point_struct.h:93:29: note: expanded from macro 'POINT_CLOUD_ BOOST_PP_SEQ_FOR_EACH(POINT_CLOUD_REGISTER_FIELD_OFFSET, name, seq) \
^
REGISTER_POINT_STRUCT_I'
BOOST_PP_SEQ_FOR_EACH(POINT_CLOUD_REGISTER_FIELD_OFFSET, name, seq) \
^
/usr/local/include/boost/preprocessor/seq/for_each.hpp:26:67: note: expanded from macro 'BOOST_PP_SEQ_FOR_EACH'
/usr/local/include/boost/preprocessor/seq/for_each.hpp:26:67: note: expanded from macro 'BOOST_PP_SEQ_FOR_EACH'
# define BOOST_PP_SEQ_FOR_EACH(macro, data, seq) BOOST_PP_FOR((macro, data, seq (nil)), BOOST_PP_SEQ_FOR_EACH_P, BOOST_PP_SEQ_FOR_EACH_O, BOOST_PP_SEQ_FOR_EACH_M)
^
note: (skipping 17 expansions in backtrace; use -fmacro-backtrace-limit=0 to see all)
# define BOOST_PP_SEQ_FOR_EACH(macro, data, seq) BOOST_PP_FOR((macro, data, seq (nil)), BOOST_PP_SEQ_FOR_EACH_P, BOOST_PP_SEQ_FOR_EACH_O, BOOST_PP_SEQ_FOR_EACH_M)
^
note: (skipping 9 expansions in backtrace; use -fmacro-backtrace-limit=0 to see all)
/usr/local/include/boost/preprocessor/seq/for_each.hpp:49:57: note: expanded from macro 'BOOST_PP_SEQ_F/usr/local/include/boost/preprocessor/seq/for_each.hpp:49:57: note: expanded from macro 'BOOST_PP_SEQ_FOR_EACH_M_I'
# define BOOST_PP_SEQ_FOR_EACH_M_I(r, macro, data, seq) macro(r, data, BOOST_PP_SEQ_HEAD(seq))
^
/Users/alex/ros_catkin_ws/src/pcl/common/include/pcl/ros/register_point_struct.h:121OR_E:33: note: expanded from macro 'POINT_CLOUD_REGISTER_FIEACH_LD_OFFSET'
static const size_t value = offsetof(name, BOOST_PP_TUPLE_ELEM(3, 1, elem)); \
M_ ^
In file included from /Users/alex/ros_catkin_ws/src/pcl/common/test/test_intensity.cpp:42:
/Users/alex/ros_catkin_ws/src/pcl/common/include/pcl/point_types.h:I'
417:1: warning: offset of on non-POD type /usr/bin/../lib/clang/4.2/include/stddef.h:62'pc:24: note: le:x:pPaonidnetd# define BOOST_PP_SEQ_FOR_EACH_M_I(r, macro, data, seq) macro(r, data, BOOST_PP_SEQ_HEAD(seq))
^
XYZ IfNroormm amla'c r[o- W'ionfvfasleitdo-fo'f
fsetof]
#define offsetof(t, d) __builtin_offsetof(t, d)
^
/Users/alex/ros_catkin_ws/src/pcl/common/include/pcl/ros/register_point_struct.h:121:33: note: expanded from macro 'POINT_CLOUD_REGIPOINT_CLOUD_REGISTER_POINT_STRUCT (pcl::PointXYZINormal,
^
STER_FIELD_OFFSET'
/Users/alex/ros_catkin_ws/src/pcl/common/include/pcl/ros/register_point_struct.h:58:3: note: expanded fro static const size_t value = offsetof(name, BOOST_PP_TUPLE_ELEM(3, 1, elem)); \
^
m macro 'POINT_CLOUD_REGISTER_POINT_STRUCT'
/usr/bin/../lib/clang/4.2/include/stddef.h:62:24: note: POINT_CLOUD_REGISTER_POINT_STRUCT_I(name, \
^
/Users/alex/ros_catkin_ws/src/pcl/common/include/pcl/ros/register_point_struct.h:93:e29:xpan note: expanded from macro 'POINT_CLOUD_REGISTER_POINT_STRUCdT_I'
ed f BOOST_PP_SEQ_FOR_EACH(POINT_CLOUD_REGISTER_FIELD_OFFSET, name, seq) \
^
/usr/local/include/boost/preprocessor/seq/for_each.hpp:26ro:m macro 'offsetof'
In file included from /Users/alex/ros_catkin_ws/src/pcl/common/test/test_operators.cpp:67#define offsetof(t, d) __builtin_offsetof(t, d):40:
/Users/alex/ros_catkin_ws/src/pcl/common/include/pcl/point_types.hnote: e
xp ^a
nded:417 :1fro: m mawarning: offset of on non-PcrODo 'BOOST_PP_SEQ_FOR_EACH'
# define BOOST_PP_SEQ_FOR_EACH(macro, data, seq) BOOST_PP_FOR((macro, data, seq (nil)), BOOST_PP_SEQ_FOR_EACH_P, BOOST_PP_SEQ_FOR_EACH_O, BOOST_PP_SEQ_FOR_EACH_M)
^ ty
note: (skipping 5 expansions in backtrace; use -fmacro-backtrace-limit=0 to see all)
/usr/local/include/boost/preprocessor/seq/for_each.hpp:49:57:pe 'p clnote: expan::PointXYZINormal' [-Winvalid-offsetodedf from m]
In file included from /Users/alex/ros_catkin_ws/src/pcl/kdtree/src/kdtree_flann.cpp:acr39:
/Users/alex/ros_catkin_ws/src/pcl/common/include/pcl/point_types.h:417:1: warning: offset of on non-POD typPOINT_CLOUD_REGISTER_POINT_STRUCT (pcl::PointXYZINormal,
^
e 'pcl::PointXYZINormal' [-Winvalid-offsetof]
/Users/alex/ros_catkin_ws/src/pcl/common/include/pcl/ros/register_point_struct.h:58:3: note: expanded from macro 'POINT_CLOUD_REGISTER_POINT_STRUCT'
POINT_CLOUD_REGISTER_POINT_STRUCT (pcl::PointXYZINormal,
POINT_CLOUD_REGISTER_POINT_STRUCT_I(name, \
o ' ^
BOOST_PP_SEQ_FOR_EACH_M_I'
/Users/alex/ros_catkin_ws/src/pcl/common/include/pcl/ros/register_point_struct.h:93:29: note: expanded# define BOOST_PP_SEQ_FOR_EACH_M_I(r, macro, data, seq) macro(r, data, BOOST_PP_SEQ_HEAD(seq))
^
/Users/alex/ros_catkin_ws/src/pcl/common/include/pcl/ros/register_point_struct.h:58:3 f: note: erxopma nmdaecdr o ' ^
from macro 'POINT_CLOUD_REGISTER_POINT_STRUCT'
/Users/alex/ros_catkin_ws/src/pcl/common/include/pcl/ros/register_point_struct.h:121:33: note: expanded from m POINT_CLOUD_REGISTER_POINT_STRUCT_I(name, \
^
/Users/alex/ros_catkin_ws/src/pcl/common/include/pcl/ros/register_point_struct.h:93:29: POacrnote: expanded from macro 'POINT_CLOUD_REGISTER_POINT_STRUCT_I'
BOOST_PP_SEQ_FOR_EACH(POINT_CLOUD_REGISTER_FIELD_OFFSET, name, seq) \
^
/usr/local/include/boost/preprocessor/seq/for_each.hpp:26:67: note: expanded from macro 'BOOST_PP_SEQ_FOR_EACH'
# define BOOST_PP_SEQ_FOR_EACH(macro, data, seq) BOOST_PP_FOR((macro, data, seq (nil)), BOOST_PP_SEQ_FOR_EACH_P, BOOST_PP_SEQ_FOR_EACH_O, BOOST_PP_SEQ_FOR_EACH_M)
^
note: (skipping 21 expansions in backtrace; use -fmacro-backtrace-limit=0 to see all)
/usr/local/include/boost/preprocessor/seq/for_each.hpp:49:57: note: expanded from mo 'PacIroN T'_BCOLOOSUTD__PRPE_GSIESQT_EFRO_RP_OEIANCTH__SMT_RIU'C
T_I'
# define BOOST_PP_SEQ_FOR_EACH_M_I(r, macro, data, seq) macro(r, data, BOOST_PP_SEQ_HEAD(seq))
BOOST_PP_SEQ_FOR_EACH(POINT_CLOUD_REGISTER_FIELD_OFFSET, name, seq) \
^
/usr/local/include/boost/preprocessor/seq/for_each.hpp:26:67:O note: e ^I
NT_CLOUD_REGISTER_FIELD_OFFSET'
static const size_t value = offsetof(name, BOOST_PP_TUPLE_ELEM(3, 1, elem)); \
^
/Users/alex/ros_catkin_ws/src/pcl/common/include/pcl/ros/register_point_struct.h:121:33: note: expanded from macro 'POINT_C/usr/bin/../lib/clang/4.2/include/stddef.h:62:xpaLO24U:D _note: ReExGpIaSnTdEeRd_ FfIEndromed LD_fr mOFFaScErTo'
'offsetof'
#define offsetof(t, d) __builtin_offsetof(t, d)
^
static const size_t value = offsetof(name, BOOST_PP_TUPLE_ELEM(3, 1, elem)); \
^
/usr/bin/../lib/clang/4.2/include/stddef.h:62:24: note: expanded from macro 'offsetof'
#define offsetof(t, d) __builtin_offsetof(t, d)
^
om macro 'BOOST_PP_SEQ_FOR_EACH'
# define BOOST_PP_SEQ_FOR_EACH(macro, data, seq) BOOST_PP_FOR((macro, data, seq (nil)), BOOST_PP_SEQ_FOR_EACH_P, BOOST_PP_SEQ_FOR_EACH_O, BOOST_PP_SEQ_FOR_EACH_M)
^
note: (skipping 13 expansions in backtrace; use -fmacro-backtrace-limit=0 to see all)
/usr/local/include/boost/preprocessor/seq/for_each.hpp:49:57: note: expanded from macro 'BOOST_PP_SEQ_FOR_EACH_M_I'
# define BOOST_PP_SEQ_FOR_EACH_M_I(r, macro, data, seq) macro(r, data, BOOST_PP_SEQ_HEAD(seq))
^
In file included from /Users/alex/ros_catkin_ws/src/pcl/common/test/test_intensity.cpp:42:
/Users/alex/ros_catkin_ws/src/pcl/common/include/pcl/point_types.h:417:1: warning: offset of on non-POD type 'pcl::PointXYZINormal' [-Winvalid-offsetof]
/Users/alex/ros_catkin_ws/src/pcl/common/include/pcl/ros/register_point_struct.h:121:33: note: expanded from macro 'POINT_CLOUD_REGISTER_FIELD_OFFSET'
POINT_CLOUD_REGISTER_POINT_STRUCT (pcl::PointXYZINormal,
^
static const size_t value = offsetof(name, BOOST_PP_TUPLE_ELEM(3, 1, elem)); \
In file included from ^
/Users/alex/ros_catkin_ws/src/pcl/kdtree/src/kdtree_flann.cpp:39:
/Users/alex/ros_catkin_ws/src/pcl/common/include/pcl/point_types.h:417:1: warning: offset of on non-POD type '/Users/alex/ros_catkin_ws/src/pcl/common/include/pcl/ros/register_point_struct.h:58:3: note: expanded from macro/usr/bin/../lib/clang/4.2/include/stddef.h:62:pcl:24::Poi 'PnOtIXNYTZ_ICNLoOrUmDa_lR'E G[I-SWTiEnRv_aPlOiIdN-To_fSfTsReUtCoTf']
POINT_CLOUD_REGISTER_POINT_STRUCT_I(name, \
^
/Users/alex/ros_catkin_ws/src/pcl/common/include/pcl/ros/register_point_struct.h:93:29: note: expanded from macro 'POINT_CLOUD_REGISTER_POINPOINT_CLOUD_REGISTER_POINT_STRUCT (pcl::PointXYZINormal,
^
/Users/alex/ros_catkin_ws/src/pcl/common/include/pcl/ros/register_point_struct.h: note: T_Sexpanded from macro 'offsetofTRUCT_I'
'
#define offsetof(t, d) __builtin_offsetof(t, d)
58 ^
:3: note: expanded from macro 'POINT_CLOUD_REGISTER_POINT BOOST_PP_SEQ_FOR_EACH(POINT_CLOUD_REGISTER_FIELD_OFFSET, name, seq) \
_S ^
TRUCT'
POINT_CLOUD_REGISTER_POINT_STRUCT_I(name, \
^
/usr/local/include/boost/preprocessor/seq/for_each.hpp:26:67: note: expanded from macro 'BOOST_PP_SEQ_FOR_EACH'
/Users/alex/ros_catkin_ws/src/pcl/common/include/pcl/ros/register_point_struct.h:93:29: note: expanded from macro 'POINT_CLOUD_REGISTER_POINT_STRUCT# define BOOST_PP_SEQ_FOR_EACH(macro, data, seq) BOOST_PP_FOR((macro, data, seq (nil)), BOOST_PP_SEQ_FOR_EACH_P, BOOST_PP_SEQ_FOR_EACH_O, BOOST_PP_SEQ_FOR_EACH_M)
_I'
^In file included from
/Users/alex/ros_catkin_ws/src/pcl/common/test/test_operators.cpp: BOOST_PP_SEQ_FOR_EACH(POINT_CLOUD_REGISTER_FIELD_OFFSET, name, seq) \note:
(skipping 9 expansions in backtrace; use -fmacro-backtrace-limit=0 to see all) ^
40:
/Users/alex/ros_catkin_ws/src/pcl/common/include/pcl/point_types.h:417
:1: warning: offset of on non-POD type 'pcl::Point/usr/local/include/boost/preprocessor/seq/for_each.hpp:49X:Y57Z:I Nnote: oerxmpaaln'd e[d- Wfirnovma lmiadc-rooffse/usr/local/include/boost/preprocessor/seq/for_each.hpp:26:67t:o fnote: ]e
xp 'BOanOSTded from macro 'BOOST_PP_SEQ__PFOR_P_EASEQCH'
POINT_CLOUD_REGISTER_POINT_STRUCT (pcl::PointXYZINormal,
_FOR^
_EACH_M_I'
# define BOOST_PP_SEQ_FOR_EACH(macro, data, seq) BOOST_PP_FOR((macro, data, seq (nil)), BOOST_PP_SEQ_FOR_EACH_P, BOOST_PP_SEQ_FOR_EACH_O, BOOST_PP_SEQ_FOR_EACH_M)
^
# define BOOST_PP_SEQ_FOR_EACH_M_I(r, macro, data, seq) macro(r, data, BOOST_PP_SEQ_HEAD(seq))
^
/Users/alex/ros_catkin_ws/src/pcl/common/include/pcl/ros/register_point_struct.hnote: :(skipping 25 expansions in backtrace; use -fmacro-backtrace-limit=0 to see all)
/Users/alex/ros_catkin_ws/src/pcl/common/include/pcl/ros/register_point_struct.h:58121::333:: note: note: eexxppaanndded fedrom fmraocmr o/usr/local/include/boost/preprocessor/seq/for_each.hpp :m49a'POIc:N57T:_ CLOUD_REGISTErnote: o eRx_pPaOINTn_'STRUded fCT'
POINT_CLOUD_REGISTER_FIELD_OFFSro POINT_CLOUD_REGISTER_POINT_STRUCT_I(name, \mET
^m
acro 'BOOST_PP_SEQ_F'
static const size_t value = offsetof(name, BOOST_PP_TUPLE_ELEM(3, 1, elem)); \
^O/Users/alex/ros_catkin_ws/src/pcl/common/include/pcl/ros/register_point_struct.hR:_93E:
29: note: ACH_M_I'
/usr/bin/../lib/clang/4.2/include/stddef.h:62e# define BOOST_PP_SEQ_FOR_EACH_M_I(r, macro, data, seq) macro(r, data, BOOST_PP_SEQ_HEAD(seq))xpan:de24d: f
rnote: e ^
omxpa nmdaecdr of r'oPm Omacro 'offsetof'
#define offsetof(t, d) __builtin_offsetof(t, d)
I ^NT_CLOUD_/Users/alex/ros_catkin_ws/src/pcl/common/include/pcl/ros/register_point_struct.hRE
:121:GIS33T:E Rnote: _ePxOpIaNnTd_Sed from macro 'POINT_TCLOURUCT_I'D_REGIS
BOOST_PP_SEQ_FOR_EACH(POINT_CLOUD_REGISTER_FIELD_OFFSET, name, seq) \
^
/usr/local/include/boost/preprocessor/seq/for_each.hpp:26:67: note: exTERpan_dFeIdE LfDr_oOmF FmSaEcTr'o
'BOOST_PP_SEQ_FOR_EACH'
static const size_t value = offsetof(name, BOOST_PP_TUPLE_ELEM(3, 1, elem)); \
^
# define BOOST_PP_SEQ_FOR_EACH(macro, data, seq) BOOST_PP_FOR((macro, data, seq (nil)), BOOST_PP_SEQ_FOR_EACH_P, BOOST_PP_SEQ_FOR_EACH_O, BOOST_PP_SEQ_FOR_EACH_M)
^
note: (skipping 17 expansions in backtrace; use -fmacro-backtrace-limit=0 to see all)
/usr/bin/../lib/clang/4.2/include/stddef.h:62:24: note: expanded from macro 'offsetof'
/usr/local/include/boost/preprocessor/seq/for_each.hpp#define offsetof(t, d) __builtin_offsetof(t, d):
49:57: note: expanded f ^
rom macro 'BOOST_PP_SEQ_FOR_EACIn file included from H_M/Users/alex/ros_catkin_ws/src/pcl/common/test/test_intensity.cpp:42:
_/Users/alex/ros_catkin_ws/src/pcl/common/include/pcl/point_types.hI:'417
:1: warning: offset of on non-POD type 'pcl::PointXYZINormal' [-Winv# define BOOST_PP_SEQ_FOR_EACH_M_I(r, macro, data, seq) macro(r, data, BOOST_PP_SEQ_HEAD(seq))
^
/Users/alex/ros_catkin_ws/src/pcl/common/include/pcl/ros/register_point_struct.h:121:33: note: expanded from macro 'POINT_CLOUD_REGIaliSdT-EoRf_fFsIeEtLoDf_]O
FFSET'
static const size_t value = offsetof(name, BOOST_PP_TUPLE_ELEM(3, 1, elem)); \
^
POINT_CLOUD_REGISTER_POINT_STRUCT (pcl::PointXYZINormal,
^
/usr/bin/../lib/clang/4.2/include/stddef.h/Users/alex/ros_catkin_ws/src/pcl/common/include/pcl/ros/register_point_struct.h:58:In file included from /Users/alex/ros_catkin_ws/src/pcl/kdtree/src/kdtree_flann.cpp:62:3: note: expan24:39:
/Users/alex/ros_catkin_ws/src/pcl/common/include/pcl/point_types.h:417:: note: eded fxpanded from ro1mm : awarning: corfof s'eotm oafc on non-ffrPo s'etoPOINOfD t'y
T_Cpe 'pcl::PointXY#define offsetof(t, d) __builtin_offsetof(t, d)
L ^O
UDZIN_REGormal' I[S-TWEiRn_vPaOlIiNdT-_oSfTfRsUeCtTof]'
POINT_CLOUD_REGISTER_POINT_STRUCT_I(name, \
^
/Users/alex/ros_catkin_ws/src/pcl/common/include/pcl/ros/register_point_struct.h:93:29: note: expanded from macro 'POINT_POINT_CLOUD_REGISTER_POINT_STRUCT (pcl::PointXYZINormal,
^
/Users/alex/ros_catkin_ws/src/pcl/common/include/pcl/ros/register_point_struct.h:58:3: note: expanded from macro 'POINT_CLOUDCLOUD_RE_RGISTER_EGISTER_POINT_STRUCTPOINT_STRUCT'
POINT_CLOUD_REGISTER_POINT_STRUCT_I(name, \
^_I
'
BOOST_PP_SEQ_FOR_EACH(POINT_CLOUD_REGISTER_FIELD_OFFSET, name, seq) \
^
/Users/alex/ros_catkin_ws/src/pcl/common/include/pcl/ros/register_point_struct.h:93:29: note: expanded f/usr/local/include/boost/preprocessor/seq/for_each.hpp:26:67: rom macro 'POINT_note: exCLOUDpan_RIn file included from d/Users/alex/ros_catkin_ws/src/pcl/common/test/test_operators.cppeEdG: 40f:
r/Users/alex/ros_catkin_ws/src/pcl/common/include/pcl/point_types.hom macIroS :'417TBER_POIOONT_STRUST_:1:CT_P Pwarning: Io'
ffs_SetEQ_ FoOfR _oEnA CnHo'n
-POD t BOOST_PP_SEQ_FOR_EACH(POINT_CLOUD_REGISTER_FIELD_OFFSET, name, seq) \
^
ype 'pcl::PointXYZINormal' [-Winvalid-offsetof]
# define BOOST_PP_SEQ_FOR_EACH(macro, data, seq) BOOST_PP_FOR((macro, data, seq (nil)), BOOST_PP_SEQ_FOR_EACH_P, BOOST_PP_SEQ_FOR_EACH_O, BOOST_PP_SEQ_FOR_EACH_M)
^
note: (skipping 13 expansions in backtrace; use -fmacro-backtrace-limit=0 to see all)
/usr/local/include/boost/preprocessor/seq/for_each.hpp:26:67: note: expanded from macro 'BOOST_PP_SEQ_FOR_EACH'
/usr/local/include/boost/preprocessor/seq/for_each.hpp:49:57: note: expanded from maPOINT_CLOUD_REGISTER_POINT_STRUCT (pcl::PointXYZINormal,
^
cro 'BOOST_PP_SEQ_FOR_EACH_M_I'
# define BOOST_PP_SEQ_FOR_EACH(macro, data, seq) BOOST_PP_FOR((macro, data, seq (nil)), BOOST_PP_SEQ_FOR_EACH_P, BOOST_PP_SEQ_FOR_EACH_O, BOOST_PP_SEQ_FOR_EACH_M)
^
note: (skipping 29 expansions in backtrace; use -fmacro-backtrace-limit=0 to see all)
# define BOOST_PP_SEQ_FOR_EACH_M_I(r, macro, data, seq) macro(r, data, BOOST_PP_SEQ_HEAD(seq))
^/Users/alex/ros_catkin_ws/src/pcl/common/include/pcl/ros/register_point_struct.h:58:
/Users/alex/ros_catkin_ws/src/pcl/common/include/pcl/ros/register_point_struct.h3:/usr/local/include/boost/preprocessor/seq/for_each.hpp: note: 49exp:121:33an:d57:: note: note: eexed from macro 'POINT_CLOUD_REGpxpaanndISdTede df rfrom macro 'POINTER_POINT_STRUCT'
POINT_CLOUD_REGISTER_POINT_STRUCT_I(name, \
om ^
/Users/alex/ros_catkin_ws/src/pcl/common/include/pcl/ros/register_point_struct.h:93:29: note: e_CLOmaxpanded from macro 'POINT_CLOUD_REGISTER_POINT_STcRro UDUC'BO_REOSTT__IP'P
_SEQ_FOR_EACH_M_I'
BOOST_PP_SEQ_FOR_EACH(POINT_CLOUD_REGISTER_FIELD_OFFSET, name, seq) \
^
# define BOOST_PP_SEQ_FOR_EACH_M_I(r, macro, data, seq) macro(r, data, BOOST_PP_SEQ_HEAD(seq))
^
/usr/local/include/boost/preprocessor/seq/for_each.hpp:26:67: note: expanded from macro 'BOOST_PP_SEQ_FOR_EACH'
/Users/alex/ros_catkin_ws/src/pcl/common/include/pcl/ros/register_point_struct.h:121:33: note: expanded from macro 'POINT_CLOUD_REGISTER_FIELD_OFFSET'
# define BOOST_PP_SEQ_FOR_EACH(macro, data, seq) BOOST_PP_FOR((macro, data, seq (nil)), BOOST_PP_SEQ_FOR_EACH_P, BOOST_PP_SEQ_FOR_EACH_O, BOOST_PP_SEQ_FOR_EACH_M)
^
note: (skipping 21 expansions in backtrace; use -fmacro-backtrace-limit=0 to see all)
static const size_t value = offsetof(name, BOOST_PP_TUPLE_ELEM(3, 1, elem)); \
^
/usr/local/include/boost/preprocessor/seq/for_each.hpp:49:57: note: expanded from macro 'B/usr/bin/../lib/clang/4.2/include/stddef.h:62:24: OGnote: expaOST_PP_SEQ_FOR_EACH_MndISTE_Ied'
from macro 'offsetof'
R_FIELD_OFFS# define BOOST_PP_SEQ_FOR_EACH_M_I(r, macro, data, seq) macro(r, data, BOOST_PP_SEQ_HEAD(seq))
#define offsetof(t, d) __builtin_offsetof(t, d) ^
^
/Users/alex/ros_catkin_ws/src/pcl/common/include/pcl/ros/register_point_struct.h:121:33: note: expanded from macro 'POINT_CLOUD_REGISTER_FIELD_OFFSET'
static const size_t value = offsetof(name, BOOST_PP_TUPLE_ELEM(3, 1, elem)); \
^
/usr/bin/../lib/clang/4.2/include/stddef.h:62:24: note: expanded from macro 'offsetof'
#define offsetof(t, d) __builtin_offsetof(t, d)
^
In file included from /Users/alex/ros_catkin_ws/src/pcl/kdtree/src/kdtree_flann.cpp:39:
/Users/alex/ros_catkin_ws/src/pcl/common/include/pcl/point_types.h:417:1: warning: offset of on non-POD type 'pcl::PointXYZINormal' [-Winvalid-offsetof]
POINT_CLOUD_REGISTER_POINT_STRUCT (pcl::PointXYZINormal,
^
/Users/alex/ros_catkin_ws/src/pcl/common/include/pcl/ros/register_point_struct.h:58:3: note: expanded from macro 'POINT_CLOUDETIn file included from _R/Users/alex/ros_catkin_ws/src/pcl/common/test/test_operators.cppEG'I
:40:
S/Users/alex/ros_catkin_ws/src/pcl/common/include/pcl/point_types.hT:E417R:_1P:O Iwarning: NoTf_fSsTeRtU CoTf'
on non-POD typ static const size_t value = offsetof(name, BOOST_PP_TUPLE_ELEM(3, 1, elem)); \e
^
'pcl::PointXYZINormal' [-Winvalid-offs/usr/bin/../lib/clang/4.2/include/stddef.h:62 POINT_CLOUD_REGISTER_POINT_STRUCT_I(name, \e
t:of24 ^: note: ex]p
/Users/alex/ros_catkin_ws/src/pcl/common/include/pcl/ros/register_point_struct.h:93:29: note: expanded fanded from mroPOINT_CLOUD_REGISTER_POINT_STRUCT (pcl::PointXYZINormal,m
a^cro ma'
ofcfro s'ePtOoIfN'T
_CLOUD_REGISTER_POINT_STRUCT_I'
#define offsetof(t, d) __builtin_offsetof(t, d)
^
/Users/alex/ros_catkin_ws/src/pcl/common/include/pcl/ros/register_point_struct.h:58:3: note: expanded fr BOOST_PP_SEQ_FOR_EACH(POINT_CLOUD_REGISTER_FIELD_OFFSET, name, seq) \
^
/usr/local/include/boost/preprocessor/seq/for_each.hpp:om26: 67macro 'PO: note: expandeINdT fr_Com LmOaUcDr_oR E'BGISTER_POINT_STRUCT'
POINT_CLOUD_REGISTER_POINT_STRUCT_I(name, \
^
/Users/alex/ros_catkin_ws/src/pcl/common/include/pcl/ros/register_point_struct.h:93OO:29S:T_ note: ePxP_SpaEnQ_dedF ORfrom macro 'POINT_CLOUD_REGISTER_POINT_STRUCT_I'
In file included from /Users/alex/ros_catkin_ws/src/pcl/common/test/test_intensity.cpp:42:
/Users/alex/ros_catkin_ws/src/pcl/common/include/pcl/point_types.h:417:_1EACH':
warning: offset of on non-POD typ BOOST_PP_SEQ_FOR_EACH(POINT_CLOUD_REGISTER_FIELD_OFFSET, name, seq) \e 'pcl::PointXYZINormal' [-Winvalid-offseto# define BOOST_PP_SEQ_FOR_EACH(macro, data, seq) BOOST_PP_FOR((macro, data, seq (nil)), BOOST_PP_SEQ_FOR_EACH_P, BOOST_PP_SEQ_FOR_EACH_O, BOOST_PP_SEQ_FOR_EACH_M)
^f] ^
note: (skipping 33 expansions in backtrace; use -fmacro-backtrace-limit=0 to see all)
/usr/local/include/boost/preprocessor/seq/for_each.hpp:
/usr/local/include/boost/preprocessor/seq/for_each.hpp:49:57: note: expanded from macro 'BO26:67: note: expanded from macro 'BOOST_PP_SEQ_FOR_EACHPOINT_CLOUD_REGISTER_POINT_STRUCT (pcl::PointXYZINormal,'OST_P
P
_^S
EQ_FOR_EACH_M_I'
# define BOOST_PP_SEQ_FOR_EACH(macro, data, seq) BOOST_PP_FOR((macro, data, seq (nil)), BOOST_PP_SEQ_FOR_EACH_P, BOOST_PP_SEQ_FOR_EACH_O, BOOST_PP_SEQ_FOR_EACH_M)
^
# define BOOST_PP_SEQ_FOR_EACH_M_I(r, macro, data, seq) macro(r, data, BOOST_PP_SEQ_HEAD(seq))
^
/Users/alex/ros_catkin_ws/src/pcl/common/include/pcl/ros/register_point_struct.h:58:3: note: note: e(skipping 25 expansions in backtrace; use -fmacro-backtrace-limit=0 to see all)x
panded from macro 'POINT_CLOUD_REGISTER_POINT_STRUCT'
POINT_CLOUD_REGISTER_POINT_STRUCT_I(name, \
/usr/local/include/boost/preprocessor/seq/for_each.hpp ^:
49:57: note: /Users/alex/ros_catkin_ws/src/pcl/common/include/pcl/ros/register_point_struct.h:121expanded from macro 'BOOST_PP_SEQ_FOR_EACH_M_I'
/Users/alex/ros_catkin_ws/src/pcl/common/include/pcl/ros/register_point_struct.h:93:29: note: expanded from macro 'POI# define BOOST_PP_SEQ_FOR_EACH_M_I(r, macro, data, seq) macro(r, data, BOOST_PP_SEQ_HEAD(seq))
^:33NT
_: note: exCpLaOnUdDe_dR EfGrIoSmT EmRa_cPrOoI N'TP_OSITNRTU_CCTL_OIU'D
_REGISTER_FIELD_OFFSET'
BOOST_PP_SEQ_FOR_EACH(POINT_CLOUD_REGISTER_FIELD_OFFSET, name, seq) \
^
/Users/alex/ros_catkin_ws/src/pcl/common/include/pcl/ros/register_point_struct.h:121:33: static const size_t value = offsetof(name, BOOST_PP_TUPLE_ELEM(3, 1, elem)); \
^ note:
expanded from macro 'POINT_CLOUD_REGISTER_FIEL/usr/local/include/boost/preprocessor/seq/for_each.hppD:_26O:F67F:S Enote: Te'x
panded from macro 'BOOST_PP_SEQ_FOR_EACH'
static const size_t value = offsetof(name, BOOST_PP_TUPLE_ELEM(3, 1, elem)); \
^
/usr/bin/../lib/clang/4.2/include/stddef.h:62:24: note: expanded from macro 'offsetof'
#define offsetof(t, d) __builtin_offsetof(t, d)
^
/usr/bin/../lib/clang/4.2/include/stddef.h:62:24: note: expanded from macro 'offsetof'
#define offsetof(t, d) __builtin_offsetof(t, d)
# define BOOST_PP_SEQ_FOR_EACH(macro, data, seq) BOOST_PP_FOR((macro, data, seq (nil)), BOOST_PP_SEQ_FOR_EACH_P, BOOST_PP_SEQ_FOR_EACH_O, BOOST_PP_SEQ_FOR_EACH_M)
^
note: (skipping 17 expansions in backtrace; use -fmacro-backtrace-limit=0 to see all)
/usr/local/include/boost/preprocessor/seq/for_each.hpp:49:57: note: expanded f ^ro
m In file included from ma/Users/alex/ros_catkin_ws/src/pcl/common/test/test_operators.cppc:40ro 'BOOST_PP_SEQ_FOR_EACH_M_I'
# define BOOST_PP_SEQ_FOR_EACH_M_I(r, macro, data, seq) macro(r, data, BOOST_PP_SEQ_HEAD(seq))
^
:
/Users/alex/ros_catkin_ws/src/pcl/common/include/pcl/point_types.h:417:1: warning: offset of on non-POD type 'pcl::PointXYZINormal' [-Winvalid-offsetof]
/Users/alex/ros_catkin_ws/src/pcl/common/include/pcl/ros/register_point_struct.h:121:33: note: expanded from macro 'POINT_CLOUD_REGISTER_FIELD_OFFSET'
static const size_t value = offsetof(name, BOOST_PP_TUPLE_ELEM(3, 1, elem)); \
^
POINT_CLOUD_REGISTER_POINT_STRUCT (pcl::PointXYZINormal,
^
/usr/bin/../lib/clang/4.2/include/stddef.h:62:24: note: expanded from macro 'offsetof'
#define offsetof(t, d) __builtin_offsetof(t, d)
^
/Users/alex/ros_catkin_ws/src/pcl/common/include/pcl/ros/register_point_struct.h:58:3: note: expanded from macro 'POINT_CLOUD_REGISTER_POINT_STRUCT'
POINT_CLOUD_REGISTER_POINT_STRUCT_I(name, \
^
/Users/alex/ros_catkin_ws/src/pcl/common/include/pcl/ros/register_point_struct.h:93:29: note: expanded from macro 'POINT_CLOUD_REGISTER_POINT_STRUCT_I'
BOOST_PP_SEQ_FOR_EACH(POINT_CLOUD_REGISTER_FIELD_OFFSET, name, seq) \
^
/usr/local/include/boost/preprocessor/seq/for_each.hpp:26:67: note: expanIn file included from /Users/alex/ros_catkin_ws/src/pcl/common/test/test_intensity.cpp:42:
/Users/alex/ros_catkin_ws/src/pcl/common/include/pcl/point_types.h:de417d fr:1:o mwarning: omfafcsreot 'oBfO OoSnT _nPoPn_-SPEOQD_ FtOyRp_eE A'CpHc'l
::PointXYZINormal' [-Winvalid-offse# define BOOST_PP_SEQ_FOR_EACH(macro, data, seq) BOOST_PP_FOR((macro, data, seq (nil)), BOOST_PP_SEQ_FOR_EACH_P, BOOST_PP_SEQ_FOR_EACH_O, BOOST_PP_SEQ_FOR_EACH_M)
^
note: (skipping 29 expansions in backtrace; use -fmacro-backtrace-limit=0 to see all)
tof]
/usr/local/include/boost/preprocessor/seq/for_each.hpp:49:57: note: expanded from macro 'BOOST_PP_SEQ_FOR_EACH_M_I'
POINT_CLOUD_REGISTER_POINT_STRUCT (pcl::PointXYZINormal,
^
# define BOOST_PP_SEQ_FOR_EACH_M_I(r, macro, data, seq) macro(r, data, BOOST_PP_SEQ_HEAD(seq))
^
/Users/alex/ros_catkin_ws/src/pcl/common/include/pcl/ros/register_point_struct.h:58:3: note: expanded fr/Users/alex/ros_catkin_ws/src/pcl/common/include/pcl/ros/register_point_struct.h:om121 ma:33:cro note: 'ePxOpanded fromI macro 'POINT_CLONTUD__RCELGOIUSDT_ERER_FIELD_OFFSET'
static const size_t value = offsetof(name, BOOST_PP_TUPLE_ELEM(3, 1, elem)); \
GI ^
/usr/bin/../lib/clang/4.2/include/stddef.h:62ST:24: note: expanded from macrER_POINT_STRUCT'
o ' POINT_CLOUD_REGISTER_POINT_STRUCT_I(name, \o
^
/Users/alex/ros_catkin_ws/src/pcl/common/include/pcl/ros/register_point_struct.h:93ffs:e29t:o fnote: 'e
xpanded from macro #define offsetof(t, d) __builtin_offsetof(t, d)
'PO ^I
NT_CLOUD_REGISTER_POINT_STRUCT_I'
BOOST_PP_SEQ_FOR_EACH(POINT_CLOUD_REGISTER_FIELD_OFFSET, name, seq) \
^
/usr/local/include/boost/preprocessor/seq/for_each.hpp:26:67: note: expanded from macro 'BOOST_PP_SEQ_FOR_EACH'
# define BOOST_PP_SEQ_FOR_EACH(macro, data, seq) BOOST_PP_FOR((macro, data, seq (nil)), BOOST_PP_SEQ_FOR_EACH_P, BOOST_PP_SEQ_FOR_EACH_O, BOOST_PP_SEQ_FOR_EACH_M)
^
note: (skipping 21 expansions in backtrace; use -fmacro-backtrace-limit=0 to see all)
/usr/local/include/boost/preprocessor/seq/for_each.hpp:49:57: note: expanded from macro 'BOOST_PP_SEQ_FOR_EACH_M_I'
# define BOOST_PP_SEQ_FOR_EACH_M_I(r, macro, data, seq) macro(r, data, BOOST_PP_SEQ_HEAD(seq))
^
In file included from /Users/alex/ros_catkin_ws/src/pcl/common/test/test_operators.cpp:40:
/Users/alex/ros_catkin_ws/src/pcl/common/include/pcl/point_types.h:417:1: warning: offset of on non-POD type 'pcl::PointXYZINormal' [-Winvalid-offsetof]
/Users/alex/ros_catkin_ws/src/pcl/common/include/pcl/ros/register_point_struct.h:121:33: note: expanded from macro 'POINT_CLOUD_REGISTER_FIELD_OFFSET'
static const size_t value = offsetof(name, BOOST_PP_TUPLE_ELEM(3, 1, elem)); \
^
/usr/bin/../lib/clang/4.2/include/stddef.hPOINT_CLOUD_REGISTER_POINT_STRUCT (pcl::PointXYZINormal,:
62^:24: note: expanded from macro 'offsetof'
#define offsetof(t, d) __builtin_offsetof(t, d)
^
/Users/alex/ros_catkin_ws/src/pcl/common/include/pcl/ros/register_point_struct.h:58:3: note: expanded from macro 'POINT_CLOUD_REGISTER_POINT_STRUCT'
POINT_CLOUD_REGISTER_POINT_STRUCT_I(name, \
^
/Users/alex/ros_catkin_ws/src/pcl/common/include/pcl/ros/register_point_struct.h:93:29: note: expanded from macro 'POINT_CLOUD_REGISTER_POINT_STRUCT_I'
BOOST_PP_SEQ_FOR_EACH(POINT_CLOUD_REGISTER_FIELD_OFFSET, name, seq) \
^
/usr/local/include/boost/preprocessor/seq/for_each.hpp:26:67: note: expanded from macro 'BOOST_PP_SEQ_FOR_EACH'
# define BOOST_PP_SEQ_FOR_EACH(macro, data, seq) BOOST_PP_FOR((macro, data, seq (nil)), BOOST_PP_SEQ_FOR_EACH_P, BOOST_PP_SEQ_FOR_EACH_O, BOOST_PP_SEQ_FOR_EACH_M)
^
note: (skipping 33 expansions in backtrace; use -fmacro-backtrace-limit=0 to see all)
/usr/local/include/boost/preprocessor/seq/for_each.hpp:49:57: note: expanded from macro 'BOOST_PP_SEQ_FOR_EACH_M_I'
In file included from /Users/alex/ros_catkin_ws/src/pcl/common/test/test_intensity.cpp:42:
/Users/alex/ros_catkin_ws/src/pcl/common/include/pcl/point_types.h:417# define BOOST_PP_SEQ_FOR_EACH_M_I(r, macro, data, seq) macro(r, data, BOOST_PP_SEQ_HEAD(seq)):
1 ^
/Users/alex/ros_catkin_ws/src/pcl/common/include/pcl/ros/register_point_struct.h:121:33: note: expanded from macro 'POINT_CLOUD_REGISTER_FIELD_OFFSET'
static const size_t value = offsetof(name, BOOST_PP_TUPLE_ELEM(3, 1, elem)); \
^
: warning: offset of/usr/bin/../lib/clang/4.2/include/stddef.h:62:24: note: expanded from macro 'offsetof'
#define offsetof(t, d) __builtin_offsetof(t, d)
^
on non-POD type 'pcl::PointXYZINormal' [-Winvalid-offsetof]
POINT_CLOUD_REGISTER_POINT_STRUCT (pcl::PointXYZINormal,
^
/Users/alex/ros_catkin_ws/src/pcl/common/include/pcl/ros/register_point_struct.h:58:3: note: expanded from macro 'POINT_CLOUD_REGISTER_POINT_STRUCT'
POINT_CLOUD_REGISTER_POINT_STRUCT_I(name, \
^
/Users/alex/ros_catkin_ws/src/pcl/common/include/pcl/ros/register_point_struct.h:93:29: note: expanded from macro 'POINT_CLOUD_REGISTER_POINT_STRUCT_I'
BOOST_PP_SEQ_FOR_EACH(POINT_CLOUD_REGISTER_FIELD_OFFSET, name, seq) \
^
/usr/local/include/boost/preprocessor/seq/for_each.hpp:26:67: note: expanded from macro 'BOOST_PP_SEQ_FOR_EACH'
# define BOOST_PP_SEQ_FOR_EACH(macro, data, seq) BOOST_PP_FOR((macro, data, seq (nil)), BOOST_PP_SEQ_FOR_EACH_P, BOOST_PP_SEQ_FOR_EACH_O, BOOST_PP_SEQ_FOR_EACH_M)
^
note: (skipping 25 expansions in backtrace; use -fmacro-backtrace-limit=0 to see all)
/usr/local/include/boost/preprocessor/seq/for_each.hpp:49:57: note: expanded from macro 'BOOST_PP_SEQ_FOR_EACH_M_I'
# define BOOST_PP_SEQ_FOR_EACH_M_I(r, macro, data, seq) macro(r, data, BOOST_PP_SEQ_HEAD(seq))
^
/Users/alex/ros_catkin_ws/src/pcl/common/include/pcl/ros/register_point_struct.h:121:33: note: expanded from macro 'POINT_CLOUD_REGISTER_FIELD_OFFSET'
static const size_t value = offsetof(name, BOOST_PP_TUPLE_ELEM(3, 1, elem)); \
^
/usr/bin/../lib/clang/4.2/include/stddef.h:62:24: note: expanded from macro 'offsetof'
#define offsetof(t, d) __builtin_offsetof(t, d)
^
In file included from /Users/alex/ros_catkin_ws/src/pcl/common/test/test_intensity.cpp:42:
/Users/alex/ros_catkin_ws/src/pcl/common/include/pcl/point_types.h:417:1: warning: offset of on non-POD type 'pcl::PointXYZINormal' [-Winvalid-offsetof]
POINT_CLOUD_REGISTER_POINT_STRUCT (pcl::PointXYZINormal,
^
/Users/alex/ros_catkin_ws/src/pcl/common/include/pcl/ros/register_point_struct.h:58:3: note: expanded from macro 'POINT_CLOUD_REGISTER_POINT_STRUCT'
POINT_CLOUD_REGISTER_POINT_STRUCT_I(name, \
^
/Users/alex/ros_catkin_ws/src/pcl/common/include/pcl/ros/register_point_struct.h:93:29: note: expanded from macro 'POINT_CLOUD_REGISTER_POINT_STRUCT_I'
BOOST_PP_SEQ_FOR_EACH(POINT_CLOUD_REGISTER_FIELD_OFFSET, name, seq) \
^
In file included from /Users/alex/ros_catkin_ws/src/pcl/kdtree/src/kdtree_flann.cpp:39:
/usr/local/include/boost/preprocessor/seq/for_each.hpp:/Users/alex/ros_catkin_ws/src/pcl/common/include/pcl/point_types.h:26:427:1: warning: offset of on non-PO67: note: expanded from macro 'BOOD tSTyp_PPe_ S'EpQ_clFOR::_EACH'
# define BOOST_PP_SEQ_FOR_EACH(macro, data, seq) BOOST_PP_FOR((macro, data, seq (nil)), BOOST_PP_SEQ_FOR_EACH_P, BOOST_PP_SEQ_FOR_EACH_O, BOOST_PP_SEQ_FOR_EACH_M)
^
note: (skipping 29 expansions in backtrace; use -fmacro-backtrace-limit=0 to see all)
/usr/local/include/boost/preprocessor/seq/for_each.hpp:49:57: note: expanded from macro 'BOOST_PP_SEQ_FOR_EACH_M_I'
# define BOOST_PP_SEQ_FOR_EACH_M_I(r, macro, data, seq) macro(r, data, BOOST_PP_SEQ_HEAD(seq))
^
/Users/alex/ros_catkin_ws/src/pcl/common/include/pcl/ros/register_point_struct.h:121:33: note: expanded from macro 'POINT_CLOUD_REGISTER_FIELD_OFFSET'
static const size_t value = offsetof(name, BOOST_PP_TUPLE_ELEM(3, 1, elem)); \
^
/usr/bin/../lib/clang/4.2/include/stddef.h:62:24: note: expanded from macro 'offsetof'
#define offsetof(t, d) __builtin_offsetof(t, d)
^
In file included from /Users/alex/ros_catkin_ws/src/pcl/common/test/test_intensity.cpp:42:
/Users/alex/ros_catkin_ws/src/pcl/common/include/pcl/point_types.h:417:1: warning: offset of on non-POD type 'pcl::PointXYZINormal' [-Winvalid-offsetof]
POINT_CLOUD_REGISTER_POINT_STRUCT (pcl::PointXYZINormal,
^
/Users/alex/ros_catkin_ws/src/pcl/common/include/pcl/ros/register_point_struct.h:58:3: note: expanded from macro 'POINT_CLOUD_REGISTER_POINT_STRUCT'
POINT_CLOUD_REGISTER_POINT_STRUCT_I(name, \
^
/Users/alex/ros_catkin_ws/src/pcl/common/include/pcl/ros/register_point_struct.h:93:29: note: expandedPointWithRange' [-Winvalid-offsetof]
POINT_CLOUD_REGISTER_POINT_STRUCT (pcl::PointWithRange,
^
/Users/alex/ros_catkin_ws/src/pcl/common/include/pcl/ros/register_point_struct.h:58 fr:3om macro 'POINT_CLOUD_REGISTER_POINT_STRUCT_I'
BOOST_PP_SEQ_FOR_EACH(POINT_CLOUD_REGISTER_FIELD_OFFSET, name, seq) \
^
/usr/local/include/boost/preprocessor/seq/for_each.hpp:26:67: note: expanded from macro 'BOOST_PP_SEQ_FOR_EACH'
: note: expanded from macro 'POINT_CLOUD_REGISTER_POINT_STR# define BOOST_PP_SEQ_FOR_EACH(macro, data, seq) BOOST_PP_FOR((macro, data, seq (nil)), BOOST_PP_SEQ_FOR_EACH_P, BOOST_PP_SEQ_FOR_EACH_O, BOOST_PP_SEQ_FOR_EACH_M)
^UC
note: (skipping 33 expansions in backtrace; use -fmacro-backtrace-limit=0 to see all)T
'
POINT_CLOUD_REGISTER_POINT_STRUCT_I(name, \
^
/Users/alex/ros_catkin_ws/src/pcl/common/include/pcl/ros/register_point_struct.h:93:29: note: expanded from macro 'POINT_CLOUD_REGISTER_POINT_STRUCT_I'
BOOST_PP_SEQ_FOR_EACH(POINT_CLOUD_REGISTER_FIELD_OFFSET, name, seq) \
^
/usr/local/include/boost/preprocessor/seq/for_each.hpp:26:67: note: expanded from macro 'BOOST_PP_SEQ_FOR_EACH'
# define BOOST_PP_SEQ_FOR_EACH(macro, data, seq) BOOST_PP_FOR((macro, data, seq (nil)), BOOST_PP_SEQ_FOR_EACH_P, BOOST_PP_SEQ_FOR_EACH_O, BOOST_PP_SEQ_FOR_EACH_M)
^
note: (skipping 5 expansions in backtrace; use -fmacro-backtrace-limit=0 to see all)
/usr/local/include/boost/preprocessor/seq/for_each.hpp:/usr/local/include/boost/preprocessor/seq/for_each.hpp:49:49:57:57: note: expanded from macro 'BOOST_PP_SEQ_FOR_ note: exEpanACH_M_I'
# define BOOST_PP_SEQ_FOR_EACH_M_I(r, macro, data, seq) macro(r, data, BOOST_PP_SEQ_HEAD(seq))
de ^
d from macro 'BOOST_PP_SEQ_FOR_EACH_M_I'
# define BOOST_PP_SEQ_FOR_EACH_M_I(r, macro, data, seq) macro(r, data, BOOST_PP_SEQ_HEAD(seq))
^
/Users/alex/ros_catkin_ws/src/pcl/common/include/pcl/ros/register_point_struct.h:121:33: note: expanded fr/Users/alex/ros_catkin_ws/src/pcl/common/include/pcl/ros/register_point_struct.ho:m121 :m33a:c rnote: oe x'pPaOnIdNeTd_ CfLrOoUmD _mRaEcGrIoS T'EPRO_IFNITE_LCDL_OOUFDF_SREETG'I
STER_FIELD_OFFSET'
static const size_t value = offsetof(name, BOOST_PP_TUPLE_ELEM(3, 1, elem)); \
^
static const size_t value = offsetof(name, BOOST_PP_TUPLE_ELEM(3, 1, elem)); \
^
/usr/bin/../lib/clang/4.2/include/stddef.h:62:24: note: expanded from macro 'offsetof'
/usr/bin/../lib/clang/4.2/include/stddef.h:62:24: note: expanded f#define offsetof(t, d) __builtin_offsetof(t, d)rom macro 'offsetof'
#define offsetof(t, d) __builtin_offsetof(t, d)
^
In file included from /Users/alex/ros_catkin_ws/src/pcl/common/test/test_operators.cpp:
^
40:
/Users/alex/ros_catkin_ws/src/pcl/common/include/pcl/point_types.h:427:1: warning: offset of on non-POD type 'pcl::PointWithRange' [-Winvalid-offsetof]
POINT_CLOUD_REGISTER_POINT_STRUCT (pcl::PointWithRange,
^
/Users/alex/ros_catkin_ws/src/pcl/common/include/pcl/ros/register_point_struct.h:58:3: note: expanded from macro 'POINT_CLOUD_REGISTER_POINT_STRUCT'
POINT_CLOUD_REGISTER_POINT_STRUCT_I(name, \
^
/Users/alex/ros_catkin_ws/src/pcl/common/include/pcl/ros/register_point_struct.h:93:29: note: expanded from macro 'POINT_CLOUD_REGISTER_POINT_STRUCT_I'
BOOST_PP_SEQ_FOR_EACH(POINT_CLOUD_REGISTER_FIELD_OFFSET, name, seq) \
^
In file included from /Users/alex/ros_catkin_ws/src/pcl/kdtree/src/kdtree_flann.cpp:39:
/Users/alex/ros_catkin_ws/src/pcl/common/include/pcl/point_types.h:427:1: /usr/local/include/boost/preprocessor/seq/for_each.hpp:26:67warning: of: note: expanded from macro 'BOOST_PP_SEQ_FOR_EACH'fset of on non-POD type 'pcl:
:PointWithRange' [-Winvalid-offsetof]
# define BOOST_PP_SEQ_FOR_EACH(macro, data, seq) BOOST_PP_FOR((macro, data, seq (nil)), BOOST_PP_SEQ_FOR_EACH_P, BOOST_PP_SEQ_FOR_EACH_O, BOOST_PP_SEQ_FOR_EACH_M)
^
note: (skipping 5 expansions in backtrace; use -fmacro-backtrace-limit=0 to see all)
POINT_CLOUD_REGISTER_POINT_STRUCT (pcl::PointWithRange,
^
/usr/local/include/boost/preprocessor/seq/for_each.hpp:49:57: note: expanded from macro 'BOOST_PP_SEQ_FOR_EAC/Users/alex/ros_catkin_ws/src/pcl/common/include/pcl/ros/register_point_struct.h:58H_:3: note: expanded from macro 'POINT_CLOUD_REGISTER_POINT_STRUCT'
POINT_CLOUD_REGISTER_POINT_STRUCT_I(name, \
^
M_/Users/alex/ros_catkin_ws/src/pcl/common/include/pcl/ros/register_point_struct.h:93I':29: note: e
# define BOOST_PP_SEQ_FOR_EACH_M_I(r, macro, data, seq) macro(r, data, BOOST_PP_SEQ_HEAD(seq))
^
/Users/alex/ros_catkin_ws/src/pcl/common/include/pcl/ros/register_point_struct.h:121:33: note: exxppandandeedd ffrroomm mmaaccrroo ''PPOOIINNTT__CCLLOOUUDD__RREEGGIISSTTEERR__FPIOEILNDT__OSFTFRSUECTT'_
I'
BOOST_PP_SEQ_FOR_EACH(POINT_CLOUD_REGISTER_FIELD_OFFSET, name, seq) \ static const size_t value = offsetof(name, BOOST_PP_TUPLE_ELEM(3, 1, elem)); \
^
^
/usr/local/include/boost/preprocessor/seq/for_each.hpp:26:67: note: expanded from macro 'BOOST_PP_SEQ_/usr/bin/../lib/clang/4.2/include/stddef.h:62:24FOR_EACH'
# define BOOST_PP_SEQ_FOR_EACH(macro, data, seq) BOOST_PP_FOR((macro, data, seq (nil)), BOOST_PP_SEQ_FOR_EACH_P, BOOST_PP_SEQ_FOR_EACH_O, BOOST_PP_SEQ_FOR_EACH_M)
^
note: (skipping 9 expansions in backtrace; use -fmacro-backtrace-limit=0 to see all)
/usr/local/include/boost/preprocessor/seq/for_each.hpp:49:: note: e57: note: exxpanded from mpaacrnod e'do fffrsoemt omfa'c
ro 'BOOST_PP_SEQ_FOR_EACH_M_I'
#define offsetof(t, d) __builtin_offsetof(t, d)
^
# define BOOST_PP_SEQ_FOR_EACH_M_I(r, macro, data, seq) macro(r, data, BOOST_PP_SEQ_HEAD(seq))
^
/Users/alex/ros_catkin_ws/src/pcl/common/include/pcl/ros/register_point_struct.h:121:33: note: expanded from macro 'POINT_CLOUD_REGISTER_FIELD_OFFSET'
static const size_t value = offsetof(name, BOOST_PP_TUPLE_ELEM(3, 1, elem)); \
^
/usr/bin/../lib/clang/4.2/include/stddef.h:62:24: note: expanded from macro 'offsetof'
#define offsetof(t, d) __builtin_offsetof(t, d)
^
In file included from /Users/alex/ros_catkin_ws/src/pcl/common/test/test_operators.cpp:40:
/Users/alex/ros_catkin_ws/src/pcl/common/include/pcl/point_types.h:427:1: warning: offset of on non-POD type 'pcl::PointWithRange' [-Winvalid-offsetof]
POINT_CLOUD_REGISTER_POINT_STRUCT (pcl::PointWithRange,
^
/Users/alex/ros_catkin_ws/src/pcl/common/include/pcl/ros/register_point_struct.h:58:3: note: expanded from macro 'POINT_CLOUD_REGISTER_POINT_STRUCT'
In file included from /Users/alex/ros_catkin_ws/src/pcl/kdtree/src/kdtree_flann.cpp:39:
/Users/alex/ros_catkin_ws/src/pcl/common/include/pcl/point_types.h:427:1: warning: offset o POINT_CLOUD_REGISTER_POINT_STRUCT_I(name, \
^
/Users/alex/ros_catkin_ws/src/pcl/common/include/pcl/ros/register_point_struct.h:93:29: note: expanded from macro 'POINT_CLOUD_REGISTER_POINT_STRUCT_I'
BOOST_PP_SEQ_FOR_EACH(POINT_CLOUD_REGISTER_FIELD_OFFSET, name, seq) \
^
/usr/local/include/boost/preprocessor/seq/for_each.hpp:26f :67: note: expanded from macro 'BOOSon nT_on-POD type 'pcl::PointWithRange' [-Winvalid-offsetof]
POINT_CLOUD_REGISTER_POINT_STRUCT (pcl::PointWithRange,
^
PP_SEQ_FOR_EACH'
/Users/alex/ros_catkin_ws/src/pcl/common/include/pcl/ros/register_point_struct.h:58:3: note: expanded from macro 'POINT_CLOUD_REGISTER_PO# define BOOST_PP_SEQ_FOR_EACH(macro, data, seq) BOOST_PP_FOR((macro, data, seq (nil)), BOOST_PP_SEQ_FOR_EACH_P, BOOST_PP_SEQ_FOR_EACH_O, BOOST_PP_SEQ_FOR_EACH_M)I
N ^
note: (skipping 9 expansions in backtrace; use -fmacro-backtrace-limit=0 to see all)
T_STRUCT'
/usr/local/include/boost/preprocessor/seq/for_each.hpp:49:57: note: expanded from macro 'BOOST_PP_ POINT_CLOUD_REGISTER_POINT_STRUCT_I(name, \
^
SEQ_FOR_EACH_M_I'
/Users/alex/ros_catkin_ws/src/pcl/common/include/pcl/ros/register_point_struct.h:93:# define BOOST_PP_SEQ_FOR_EACH_M_I(r, macro, data, seq) macro(r, data, BOOST_PP_SEQ_HEAD(seq))
^29: note: expanded
/Users/alex/ros_catkin_ws/src/pcl/common/include/pcl/ros/register_point_struct.h:121:33: note: expanded from macro 'POINT_CLOUD_REGISTER_FIELD_OFFSET'
static const size_t value = offsetof(name, BOOST_PP_TUPLE_ELEM(3, 1, elem)); \
^fr
om macro 'POINT_CLOUD_REGISTER_POINT_STRUCT_I'
/usr/bin/../lib/clang/4.2/include/stddef.h:62:24: note: expanded from mac BOOST_PP_SEQ_FOR_EACH(POINT_CLOUD_REGISTER_FIELD_OFFSET, name, seq) \
^
ro 'offsetof'
#define offsetof(t, d) __builtin_offsetof(t, d)
^
/usr/local/include/boost/preprocessor/seq/for_each.hpp:26:67: note: expanded from macro 'BOOST_PP_SEQ_FOR_EACH'
# define BOOST_PP_SEQ_FOR_EACH(macro, data, seq) BOOST_PP_FOR((macro, data, seq (nil)), BOOST_PP_SEQ_FOR_EACH_P, BOOST_PP_SEQ_FOR_EACH_O, BOOST_PP_SEQ_FOR_EACH_M)
^
note: (skipping 13 expansions in backtrace; use -fmacro-backtrace-limit=0 to see all)
/usr/local/include/boost/preprocessor/seq/for_each.hpp:49:57: note: expanded from macro 'BOOST_PP_SEQ_FOR_EACH_M_I'
In file included from /Users/alex/ros_catkin_ws/src/pcl/common/test/test_operators.cpp:40:
/Users/alex/ros_catkin_ws/src/pcl/common/include/pcl/point_types.h:427:1: warning: offset of on non-POD type 'pcl::PointWithRange' [-Winvalid-offsetof]
# define BOOST_PP_SEQ_FOR_EACH_M_I(r, macro, data, seq) macro(r, data, BOOST_PP_SEQ_HEAD(seq))
^
/Users/alex/ros_catkin_ws/src/pcl/common/include/pcl/ros/register_point_struct.h:121:33: note: expaPOINT_CLOUD_REGISTER_POINT_STRUCT (pcl::PointWithRange,
^
nded from macro 'POINT_CLOUD_REGISTER_FIELD_OFFSET'
/Users/alex/ros_catkin_ws/src/pcl/common/include/pcl/ros/register_point_struct.h:58:3: note: expanded from macro 'PO static const size_t value = offsetof(name, BOOST_PP_TUPLE_ELEM(3, 1, elem)); \
^
/usr/bin/../lib/clang/4.2/include/stddef.h:62IN:24T_CLOUD: note: _expREGISanded from macro 'ofTEfsetR_Pof'
#define offsetof(t, d) __builtin_offsetof(t, d)
^
OINT_STRUCT'
POINT_CLOUD_REGISTER_POINT_STRUCT_I(name, \
^
/Users/alex/ros_catkin_ws/src/pcl/common/include/pcl/ros/register_point_struct.h:93:29: note: expanded from macro 'POINT_CLOUD_REGISTER_POINT_STRUCT_I'
BOOST_PP_SEQ_FOR_EACH(POINT_CLOUD_REGISTER_FIELD_OFFSET, name, seq) \
^
/usr/local/include/boost/preprocessor/seq/for_each.hpp:26:67: note: expanded from macro 'BOOST_PP_SEQ_FOR_EACH'
In file included from /Users/alex/ros_catkin_ws/src/pcl/kdtree/src/kdtree_flann.cpp:39:
/Users/alex/ros_catkin_ws/src/pcl/common/include/pcl/point_types.h:427:1: warning: offset of on non-POD type 'pcl::PointWithRange' [-# define BOOST_PP_SEQ_FOR_EACH(macro, data, seq) BOOST_PP_FOR((macro, data, seq (nil)), BOOST_PP_SEQ_FOR_EACH_P, BOOST_PP_SEQ_FOR_EACH_O, BOOST_PP_SEQ_FOR_EACH_M)
^
Winvalid-offnote: (skipping 13 expansions in backtrace; use -fmacro-backtrace-limit=0 to see all)set
/usr/local/include/boost/preprocessor/seq/for_each.hpp:49:of57: ]
note: expanded from macro 'BOOST_PP_SEQ_FOR_EACH_M_I'
# define BOOST_PP_SEQ_FOR_EACH_M_I(r, macro, data, seq) macro(r, data, BOOST_PP_SEQ_HEAD(seq))
^
POINT_CLOUD_REGISTER_POINT_STRUCT (pcl::PointWithRange,
^
/Users/alex/ros_catkin_ws/src/pcl/common/include/pcl/ros/register_point_struct.h:121:33: note: expanded from macro/Users/alex/ros_catkin_ws/src/pcl/common/include/pcl/ros/register_point_struct.h :'58P:O3INT: note: expanded from macro 'POIN_CLOUD_REGISTER_FIELD_OFFSET'
static const size_t value = offsetof(name, BOOST_PP_TUPLE_ELEM(3, 1, elem)); \
^
/usr/bin/../lib/clang/4.2/include/stddef.h:62T_C:24LOUD: note: _REexpanded from macro 'offsetof'
#define offsetof(t, d) __builtin_offsetof(t, d)
GI ^
In file included from /Users/alex/ros_catkin_ws/src/pcl/common/test/test_operators.cpp:40:
S/Users/alex/ros_catkin_ws/src/pcl/common/include/pcl/point_types.hTER_:427:PO1:INT_STRUCT'
POINT_CLOUD_REGISTER_POINT_STRUCT_I(name, \
^ warning: of
/Users/alex/ros_catkin_ws/src/pcl/common/include/pcl/ros/register_point_struct.h:93fse:29: note: expandetd from macro 'POINT_CLOUD_REGISTER_POINT_ SofTR onUCT_I'
BOOST_PP_SEQ_FOR_EACH(POINT_CLOUD_REGISTER_FIELD_OFFSET, name, seq) \
^n
on-POD type 'pcl::PointWithRange' [-Winvalid-offsetof]
/usr/local/include/boost/preprocessor/seq/for_each.hpp:26:67: note: expanded from macro 'BOOST_PP_SEQ_FOR_EACH'
POINT_CLOUD_REGISTER_POINT_STRUCT (pcl::PointWithRange,
^
# define BOOST_PP_SEQ_FOR_EACH(macro, data, seq) BOOST_PP_FOR((macro, data, seq (nil)), BOOST_PP_SEQ_FOR_EACH_P, BOOST_PP_SEQ_FOR_EACH_O, BOOST_PP_SEQ_FOR_EACH_M)
^
note: (skipping 17 expansions in backtrace; use -fmacro-backtrace-limit=0 to see all)
/Users/alex/ros_catkin_ws/src/pcl/common/include/pcl/ros/register_point_struct.h:58:3: note: expanded from macro 'POINT_CLOUD_REGISTE/usr/local/include/boost/preprocessor/seq/for_each.hpp:49:57R_POINT: _STnote: exRUpCT'an
ded from macro 'BOOST_PP_SEQ_FOR_EACH_M_I'
POINT_CLOUD_REGISTER_POINT_STRUCT_I(name, \
^
# define BOOST_PP_SEQ_FOR_EACH_M_I(r, macro, data, seq) macro(r, data, BOOST_PP_SEQ_HEAD(seq))
^
/Users/alex/ros_catkin_ws/src/pcl/common/include/pcl/ros/register_point_struct.h:93:29: note: expanded from macro 'POINT_CLOUD_REGISTER_POINT_STRUCT/Users/alex/ros_catkin_ws/src/pcl/common/include/pcl/ros/register_point_struct.h:121:_33I'
BOOST_PP_SEQ_FOR_EACH(POINT_CLOUD_REGISTER_FIELD_OFFSET, name, seq) \
^:
note: expanded from macro 'POINT_CLOUD_REGISTER_FIELD_OFFSET'
/usr/local/include/boost/preprocessor/seq/for_each.hpp:26:67: note: expanded from m static const size_t value = offsetof(name, BOOST_PP_TUPLE_ELEM(3, 1, elem)); \
acro 'BOOST_PP_SEQ_FOR_EACH'
^
# define BOOST_PP_SEQ_FOR_EACH(macro, data, seq) BOOST_PP_FOR((macro, data, seq (nil)), BOOST_PP_SEQ_FOR_EACH_P, BOOST_PP_SEQ_FOR_EACH_O, BOOST_PP_SEQ_FOR_EACH_M)
^
note: (skipping 17 expansions in backtrace; use -fmacro-backtrace-limit=0 to see all)
/usr/bin/../lib/clang/4.2/include/stddef.h:62:24: note: expanded from macro 'offsetof'
/usr/local/include/boost/preprocessor/seq/for_each.hpp:49:57: note: expanded from m#define offsetof(t, d) __builtin_offsetof(t, d)
ac ^
ro 'BOOST_PP_SEQ_FOR_EACH_M_I'
# define BOOST_PP_SEQ_FOR_EACH_M_I(r, macro, data, seq) macro(r, data, BOOST_PP_SEQ_HEAD(seq))
^
/Users/alex/ros_catkin_ws/src/pcl/common/include/pcl/ros/register_point_struct.h:121:33: note: expanded from macro 'POINT_CLOUD_REGISTER_FIELD_OFFSET'
static const size_t value = offsetof(name, BOOST_PP_TUPLE_ELEM(3, 1, elem)); \
^
/usr/bin/../lib/clang/4.2/include/stddef.h:62:24: note: expanded from macro 'offsetof'
#define offsetof(t, d) __builtin_offsetof(t, d)
^
In file included from /Users/alex/ros_catkin_ws/src/pcl/common/test/test_intensity.cpp:42:
/Users/alex/ros_catkin_ws/src/pcl/common/include/pcl/point_types.h:427:1: warning: offset of on non-POD type 'pcl::PointWithRange' [-Winvalid-offsetof]
POINT_CLOUD_REGISTER_POINT_STRUCT (pcl::PointWithRange,
^
/Users/alex/ros_catkin_ws/src/pcl/common/include/pcl/ros/register_point_struct.h:58:3: note: expanded from macro 'POINT_CLOUD_REGISTER_POINT_STRUCT'
POINT_CLOUD_REGISTER_POINT_STRUCT_I(name, \
^
/Users/alex/ros_catkin_ws/src/pcl/common/include/pcl/ros/register_point_struct.h:93:29: note: expanded from macro 'POINT_CLOUD_REGISTER_POINT_STRUCT_I'
BOOST_PP_SEQ_FOR_EACH(POINT_CLOUD_REGISTER_FIELD_OFFSET, name, seq) \
^
/usr/local/include/boost/preprocessor/seq/for_each.hpp:26:67: note: expanded from macro 'BOOST_PP_SEQ_FOR_EACH'
# define BOOST_PP_SEQ_FOR_EACH(macro, data, seq) BOOST_PP_FOR((macro, data, seq (nil)), BOOST_PP_SEQ_FOR_EACH_P, BOOST_PP_SEQ_FOR_EACH_O, BOOST_PP_SEQ_FOR_EACH_M)
^
note: (skipping 5 expansions in backtrace; use -fmacro-backtrace-limit=0 to see all)
/usr/local/include/boost/preprocessor/seq/for_each.hpp:49:57: note: expanded from macro 'BOOST_PP_SEQ_FOR_EACH_M_I'
# define BOOST_PP_SEQ_FOR_EACH_M_I(r, macro, data, seq) macro(r, data, BOOST_PP_SEQ_HEAD(seq))
^
/Users/alex/ros_catkin_ws/src/pcl/common/include/pcl/ros/register_point_struct.h:121:33: note: expanded from macro 'POINT_CLOUD_REGISTER_FIELD_OFFSET'
static const size_t value = offsetof(name, BOOST_PP_TUPLE_ELEM(3, 1, elem)); \
^
/usr/bin/../lib/clang/4.2/include/stddef.h:62:24: note: expanded from macro 'offsetof'
#define offsetof(t, d) __builtin_offsetof(t, d)
^
In file included from /Users/alex/ros_catkin_ws/src/pcl/common/test/test_intensity.cpp:42:
/Users/alex/ros_catkin_ws/src/pcl/common/include/pcl/point_types.h:427:1: warning: offset of on non-POD type 'pcl::PointWithRange' [-Winvalid-offsetof]
POINT_CLOUD_REGISTER_POINT_STRUCT (pcl::PointWithRange,
^
/Users/alex/ros_catkin_ws/src/pcl/common/include/pcl/ros/register_point_struct.h:58:3: note: expanded from macro 'POINT_CLOUD_REGISTER_POINT_STRUCT'
POINT_CLOUD_REGISTER_POINT_STRUCT_I(name, \
^
/Users/alex/ros_catkin_ws/src/pcl/common/include/pcl/ros/register_point_struct.h:93:29: note: expanded from macro 'POINT_CLOUD_REGISTER_POINT_STRUCT_I'
BOOST_PP_SEQ_FOR_EACH(POINT_CLOUD_REGISTER_FIELD_OFFSET, name, seq) \
^
/usr/local/include/boost/preprocessor/seq/for_each.hpp:26:67: note: expanded from macro 'BOOST_PP_SEQ_FOR_EACH'
# define BOOST_PP_SEQ_FOR_EACH(macro, data, seq) BOOST_PP_FOR((macro, data, seq (nil)), BOOST_PP_SEQ_FOR_EACH_P, BOOST_PP_SEQ_FOR_EACH_O, BOOST_PP_SEQ_FOR_EACH_M)
^
note: (skipping 9 expansions in backtrace; use -fmacro-backtrace-limit=0 to see all)
/usr/local/include/boost/preprocessor/seq/for_each.hpp:49:57: note: expanded from macro 'BOOST_PP_SEQ_FOR_EACH_M_I'
# define BOOST_PP_SEQ_FOR_EACH_M_I(r, macro, data, seq) macro(r, data, BOOST_PP_SEQ_HEAD(seq))
^
/Users/alex/ros_catkin_ws/src/pcl/common/include/pcl/ros/register_point_struct.h:121:33: note: expanded from macro 'POINT_CLOUD_REGISTER_FIELD_OFFSET'
static const size_t value = offsetof(name, BOOST_PP_TUPLE_ELEM(3, 1, elem)); \
^
/usr/bin/../lib/clang/4.2/include/stddef.h:62:24: note: expanded from macro 'offsetof'
#define offsetof(t, d) __builtin_offsetof(t, d)
^
In file included from /Users/alex/ros_catkin_ws/src/pcl/common/test/test_intensity.cpp:42:
/Users/alex/ros_catkin_ws/src/pcl/common/include/pcl/point_types.h:427:1: warning: offset of on non-POD type 'pcl::PointWithRange' [-Winvalid-offsetof]
POINT_CLOUD_REGISTER_POINT_STRUCT (pcl::PointWithRange,
^
/Users/alex/ros_catkin_ws/src/pcl/common/include/pcl/ros/register_point_struct.h:58:3: note: expanded from macro 'POINT_CLOUD_REGISTER_POINT_STRUCT'
POINT_CLOUD_REGISTER_POINT_STRUCT_I(name, \
^
/Users/alex/ros_catkin_ws/src/pcl/common/include/pcl/ros/register_point_struct.h:93:29: note: expanded from macro 'POINT_CLOUD_REGISTER_POINT_STRUCT_I'
BOOST_PP_SEQ_FOR_EACH(POINT_CLOUD_REGISTER_FIELD_OFFSET, name, seq) \
^
/usr/local/include/boost/preprocessor/seq/for_each.hpp:26:67: note: expanded from macro 'BOOST_PP_SEQ_FOR_EACH'
# define BOOST_PP_SEQ_FOR_EACH(macro, data, seq) BOOST_PP_FOR((macro, data, seq (nil)), BOOST_PP_SEQ_FOR_EACH_P, BOOST_PP_SEQ_FOR_EACH_O, BOOST_PP_SEQ_FOR_EACH_M)
^
note: (skipping 13 expansions in backtrace; use -fmacro-backtrace-limit=0 to see all)
/usr/local/include/boost/preprocessor/seq/for_each.hpp:49:57: note: expanded from macro 'BOOST_PP_SEQ_FOR_EACH_M_I'
# define BOOST_PP_SEQ_FOR_EACH_M_I(r, macro, data, seq) macro(r, data, BOOST_PP_SEQ_HEAD(seq))
^
/Users/alex/ros_catkin_ws/src/pcl/common/include/pcl/ros/register_point_struct.h:121:33: note: expanded from macro 'POINT_CLOUD_REGISTER_FIELD_OFFSET'
static const size_t value = offsetof(name, BOOST_PP_TUPLE_ELEM(3, 1, elem)); \
^
/usr/bin/../lib/clang/4.2/include/stddef.h:62:24: note: expanded from macro 'offsetof'
#define offsetof(t, d) __builtin_offsetof(t, d)
^
In file included from /Users/alex/ros_catkin_ws/src/pcl/common/test/test_intensity.cpp:42:
/Users/alex/ros_catkin_ws/src/pcl/common/include/pcl/point_types.h:427:1: warning: offset of on non-POD type 'pcl::PointWithRange' [-Winvalid-offsetof]
POINT_CLOUD_REGISTER_POINT_STRUCT (pcl::PointWithRange,
^
/Users/alex/ros_catkin_ws/src/pcl/common/include/pcl/ros/register_point_struct.h:58:3: note: expanded from macro 'POINT_CLOUD_REGISTER_POINT_STRUCT'
POINT_CLOUD_REGISTER_POINT_STRUCT_I(name, \
^
/Users/alex/ros_catkin_ws/src/pcl/common/include/pcl/ros/register_point_struct.h:93:29: note: expanded from macro 'POINT_CLOUD_REGISTER_POINT_STRUCT_I'
BOOST_PP_SEQ_FOR_EACH(POINT_CLOUD_REGISTER_FIELD_OFFSET, name, seq) \
^
/usr/local/include/boost/preprocessor/seq/for_each.hpp:26:67: note: expanded from macro 'BOOST_PP_SEQ_FOR_EACH'
# define BOOST_PP_SEQ_FOR_EACH(macro, data, seq) BOOST_PP_FOR((macro, data, seq (nil)), BOOST_PP_SEQ_FOR_EACH_P, BOOST_PP_SEQ_FOR_EACH_O, BOOST_PP_SEQ_FOR_EACH_M)
^
note: (skipping 17 expansions in backtrace; use -fmacro-backtrace-limit=0 to see all)
/usr/local/include/boost/preprocessor/seq/for_each.hpp:49:57: note: expanded from macro 'BOOST_PP_SEQ_FOR_EACH_M_I'
# define BOOST_PP_SEQ_FOR_EACH_M_I(r, macro, data, seq) macro(r, data, BOOST_PP_SEQ_HEAD(seq))
^
/Users/alex/ros_catkin_ws/src/pcl/common/include/pcl/ros/register_point_struct.h:121:33: note: expanded from macro 'POINT_CLOUD_REGISTER_FIELD_OFFSET'
static const size_t value = offsetof(name, BOOST_PP_TUPLE_ELEM(3, 1, elem)); \
^
/usr/bin/../lib/clang/4.2/include/stddef.h:62:24: note: expanded from macro 'offsetof'
#define offsetof(t, d) __builtin_offsetof(t, d)
^
In file included from /Users/alex/ros_catkin_ws/src/pcl/kdtree/src/kdtree_flann.cpp:39:
/Users/alex/ros_catkin_ws/src/pcl/common/include/pcl/point_types.h:532:1: warning: offset of on non-POD type 'pcl::PointWithScale' [-Winvalid-offsetof]
POINT_CLOUD_REGISTER_POINT_STRUCT (pcl::PointWithScale,
^
/Users/alex/ros_catkin_ws/src/pcl/common/include/pcl/ros/register_point_struct.h:58:3: note: expanded from macro 'POINT_CLOUD_REGISTER_POINT_STRUCT'
POINT_CLOUD_REGISTER_POINT_STRUCT_I(name, \
^
/Users/alex/ros_catkin_ws/src/pcl/common/include/pcl/ros/register_point_struct.h:93:29: note: expanded from macro 'POINT_CLOUD_REGISTER_POINT_STRUCT_I'
BOOST_PP_SEQ_FOR_EACH(POINT_CLOUD_REGISTER_FIELD_OFFSET, name, seq) \
^
/usr/local/include/boost/preprocessor/seq/for_each.hpp:26:67: note: expanded from macro 'BOOST_PP_SEQ_FOR_EACH'
# define BOOST_PP_SEQ_FOR_EACH(macro, data, seq) BOOST_PP_FOR((macro, data, seq (nil)), BOOST_PP_SEQ_FOR_EACH_P, BOOST_PP_SEQ_FOR_EACH_O, BOOST_PP_SEQ_FOR_EACH_M)
^
note: (skipping 5 expansions in backtrace; use -fmacro-backtrace-limit=0 to see all)
/usr/local/include/boost/preprocessor/seq/for_each.hpp:49:57: note: expanded from macro 'BOOST_PP_SEQ_FOR_EACH_M_I'
# define BOOST_PP_SEQ_FOR_EACH_M_I(r, macro, data, seq) macro(r, data, BOOST_PP_SEQ_HEAD(seq))
^
In file included from /Users/alex/ros_catkin_ws/src/pcl/common/test/test_operators.cpp:40/Users/alex/ros_catkin_ws/src/pcl/common/include/pcl/ros/register_point_struct.h:121:33:
/Users/alex/ros_catkin_ws/src/pcl/common/include/pcl/point_types.h:532:1: warning: offset of on non-POD type 'pcl::PointWithScale' [-Winvalid-offsetof]
POINT_CLOUD_REGISTER_POINT_STRUCT (pcl::PointWithScale,
^: note: expanded from macro 'POINT_CLOUD_REGISTER_FIELD_OFFSET'
static const size_t value = offsetof(name, BOOST_PP_TUPLE_ELEM(3, 1, elem)); \
^
/usr/bin/../lib/clang/4.2/include/stddef.h:62:24: note: expanded from macro 'offsetof'
#define offsetof(t, d) __builtin_offsetof(t, d)
^
In file included from /Users/alex/ros_catkin_ws/src/pcl/kdtree/src/kdtree_flann.cpp:
/Users/alex/ros_catkin_ws/src/pcl/common/include/pcl/ros/register_point_struct.h:58:3: note: expanded from m39:
a/Users/alex/ros_catkin_ws/src/pcl/common/include/pcl/point_types.hc:r532o: 1':P Owarning: IoNfTf_sCeLOUt of on non-POD type 'pcl::D_PoRintEGWiItSTERh_SPcOaIlNeT'_ S[T-RWUiCnTv'a
lid-offsetof]
POINT_CLOUD_REGISTER_POINT_STRUCT_I(name, \
^
POINT_CLOUD_REGISTER_POINT_STRUCT (pcl::PointWithScale,
^
/Users/alex/ros_catkin_ws/src/pcl/common/include/pcl/ros/register_point_struct.h:93:29: note: expanded from mac/Users/alex/ros_catkin_ws/src/pcl/common/include/pcl/ros/register_point_struct.h:58:3r:o ' note: exPOIpNaTn_dCeLdO UfDr_oRmE GmIaScTrEoR _'PPOOIINNTT_S_CTLROUUCDT__RIE'G
ISTER_POINT_STRUCT'
BOOST_PP_SEQ_FOR_EACH(POINT_CLOUD_REGISTER_FIELD_OFFSET, name, seq) \
^
POINT_CLOUD_REGISTER_POINT_STRUCT_I(name, \
^
/usr/local/include/boost/preprocessor/seq/for_each.hpp:26:67: note: expa/Users/alex/ros_catkin_ws/src/pcl/common/include/pcl/ros/register_point_struct.h:93nded from macro 'BOOST_PP_SEQ_FOR_EACH'
# define BOOST_PP_SEQ_FOR_EACH(macro, data, seq) BOOST_PP_FOR((macro, data, seq (nil)), BOOST_PP_SEQ_FOR_EACH_P, BOOST_PP_SEQ_FOR_EACH_O, BOOST_PP_SEQ_FOR_EACH_M)
^
note: :29(skipping 5 expansions in backtrace; use -fmacro-backtrace-limit=0 to see all)
: note: expanded from macro 'POIN/usr/local/include/boost/preprocessor/seq/for_each.hpp:49:57: note: expanded from macro 'BOOST_PP_SEQ_FOR_EACH_M_I'
# define BOOST_PP_SEQ_FOR_EACH_M_I(r, macro, data, seq) macro(r, data, BOOST_PP_SEQ_HEAD(seq))
T_CLOUD_REGISTER_POINT_STRUCT_I'
^
BOOST_PP_SEQ_FOR_EACH(POINT_CLOUD_REGISTER_FIELD_OFFSET, name, seq) \
^
/Users/alex/ros_catkin_ws/src/pcl/common/include/pcl/ros/register_point_struct.h/usr/local/include/boost/preprocessor/seq/for_each.hpp:121::3326:67: note: expanded from macro 'BOOST_PP_SEQ_FOR_EACH'
: note: expanded from macro 'POINT_CLOUD_REGISTER_FIELD_OFFSET'
# define BOOST_PP_SEQ_FOR_EACH(macro, data, seq) BOOST_PP_FOR((macro, data, seq (nil)), BOOST_PP_SEQ_FOR_EACH_P, BOOST_PP_SEQ_FOR_EACH_O, BOOST_PP_SEQ_FOR_EACH_M)
^
note: (skipping 9 expansions in backtrace; use -fmacro-backtrace-limit=0 to see all)
static const size_t value = offsetof(name, BOOST_PP_TUPLE_ELEM(3, 1, elem)); \
^
/usr/local/include/boost/preprocessor/seq/for_each.hpp:49:57: note: expanded from macro 'B/usr/bin/../lib/clang/4.2/include/stddef.h:62:24: note: expanded from macro 'offseOOST_PP_SEQ_FOR_EACH_M_I'
# define BOOST_PP_SEQ_FOR_EACH_M_I(r, macro, data, seq) macro(r, data, BOOST_PP_SEQ_HEAD(seq))
^tof'
#define offsetof(t, d) __builtin_offsetof(t, d)
^
/Users/alex/ros_catkin_ws/src/pcl/common/include/pcl/ros/register_point_struct.h:121:33: note: expanded from macro 'POINT_CLOUD_REGISTER_FIELD_OFFSET'
static const size_t value = offsetof(name, BOOST_PP_TUPLE_ELEM(3, 1, elem)); \
^
/usr/bin/../lib/clang/4.2/include/stddef.h:62:24: note: expanded from macro 'offsetof'
#define offsetof(t, d) __builtin_offsetof(t, d)
^
In file included from /Users/alex/ros_catkin_ws/src/pcl/common/test/test_operators.cpp:40:
/Users/alex/ros_catkin_ws/src/pcl/common/include/pcl/point_types.h:532:1: warning: offset of on non-POD type 'pcl::PointWithScale' [-Winvalid-offsetof]
POINT_CLOUD_REGISTER_POINT_STRUCT (pcl::PointWithScale,
^
/Users/alex/ros_catkin_ws/src/pcl/common/include/pcl/ros/register_point_struct.h:58:3: note: expanded fromIn file included from /Users/alex/ros_catkin_ws/src/pcl/kdtree/src/kdtree_flann.cpp:39 :
/Users/alex/ros_catkin_ws/src/pcl/common/include/pcl/point_types.h:532:1: warning: offset of on non-POD type 'pcl::PointWithScale' [-Winvalid-offsetof]
POINT_CLOUD_REGISTER_POINT_STRUCT (pcl::PointWithScale,
^
/Users/alex/ros_catkin_ws/src/pcl/common/include/pcl/ros/register_point_struct.h:58:3: note: expanded from macro 'POINT_CLOUD_REGISTER_POINT_STRUCT'
POINT_CLOUD_REGISTER_POINT_STRUCT_I(name, \
^
/Users/alex/ros_catkin_ws/src/pcl/common/include/pcl/ros/register_point_struct.h:93:29: note: expanded from macro 'POINT_CLOUD_REGISTER_POINT_STRUCT_I'
BOOST_PP_SEQ_FOR_EACH(POINT_CLOUD_REGISTER_FIELD_OFFSET, name, seq) \
^
macro 'POINT_CLOUD_REGISTER_POINT_STRUCT'
/usr/local/include/boost/preprocessor/seq/for_each.hpp:26:67: note: expanded from macro 'BOOST_PP_ POINT_CLOUD_REGISTER_POINT_STRUCT_I(name, \S
E ^
Q_FOR_EACH'
/Users/alex/ros_catkin_ws/src/pcl/common/include/pcl/ros/register_point_struct.h:93:29: note: expanded from macro 'POINT_CLOUD_REGISTER# define BOOST_PP_SEQ_FOR_EACH(macro, data, seq) BOOST_PP_FOR((macro, data, seq (nil)), BOOST_PP_SEQ_FOR_EACH_P, BOOST_PP_SEQ_FOR_EACH_O, BOOST_PP_SEQ_FOR_EACH_M)_
P ^
note: (skipping 13 expansions in backtrace; use -fmacro-backtrace-limit=0 to see all)
/usr/local/include/boost/preprocessor/seq/for_each.hpp:49:57: note: expanded from macro 'BOOST_PP_SEQ_FOR_EACH_M_I'
# define BOOST_PP_SEQ_FOR_EACH_M_I(r, macro, data, seq) macro(r, data, BOOST_PP_SEQ_HEAD(seq))
^
/Users/alex/ros_catkin_ws/src/pcl/common/include/pcl/ros/register_point_struct.h:121:33: note: expanded from macro 'POINT_CLOUD_REGISTER_FIELD_OFFSET'
static const size_t value = offsetof(name, BOOST_PP_TUPLE_ELEM(3, 1, elem)); \
^
OIN/usr/bin/../lib/clang/4.2/include/stddef.h:62:24: note: expanded from macro 'offsetof'
#define offsetof(t, d) __builtin_offsetof(t, d)
^
In file included from /Users/alex/ros_catkin_ws/src/pcl/kdtree/src/kdtree_flann.cpp:39:
/Users/alex/ros_catkin_ws/src/pcl/common/include/pcl/point_types.h:532:1: warning: offset of on non-POD type 'pcl::PointWithScale' [-Winvalid-offsetof]
POINT_CLOUD_REGISTER_POINT_STRUCT (pcl::PointWithScale,
^
/Users/alex/ros_catkin_ws/src/pcl/common/include/pcl/ros/register_point_struct.h:58:3: note: expanded from macro 'POINT_CLOUD_REGISTER_POINT_STRUCT'
POINT_CLOUD_REGISTER_POINT_STRUCT_I(name, \
^
/Users/alex/ros_catkin_ws/src/pcl/common/include/pcl/ros/register_point_struct.h:93:29: note: expanded from macro 'POINT_CLOUD_REGISTER_POINT_STRUCT_I'
BOOST_PP_SEQ_FOR_EACH(POINT_CLOUD_REGISTER_FIELD_OFFSET, name, seq) \
^
/usr/local/include/boost/preprocessor/seq/for_each.hpp:26:67: note: expanded from macro 'BOOST_PP_SEQ_FOR_EACH'
T# define BOOST_PP_SEQ_FOR_EACH(macro, data, seq) BOOST_PP_FOR((macro, data, seq (nil)), BOOST_PP_SEQ_FOR_EACH_P, BOOST_PP_SEQ_FOR_EACH_O, BOOST_PP_SEQ_FOR_EACH_M)
^
note: (skipping 17 expansions in backtrace; use -fmacro-backtrace-limit=0 to see all)
/usr/local/include/boost/preprocessor/seq/for_each.hpp:49:57: note: expanded from macro 'BOOST_PP_SEQ_FOR_EACH_M_I'
_STRUCT_I'
BOOST_PP_SEQ_FOR_EACH(POINT_CLOUD_REGISTER_FIELD_OFFSET, name, seq) \
^
/usr/local/include/boost/preprocessor/seq/for_each.hpp:26:67: note: expanded from macro 'BOOST_PP_SEQ_FOR_EACH'
# define BOOST_PP_SEQ_FOR_EACH(macro, data, seq) BOOST_PP_FOR((macro, data, seq (nil)), BOOST_PP_SEQ_FOR_EACH_P, BOOST_PP_SEQ_FOR_EACH_O, BOOST_PP_SEQ_FOR_EACH_M)
^
note: (skipping 9 expansions in backtrace; use -fmacro-backtrace-limit=0 to see all)
/usr/local/include/boost/preprocessor/seq/for_each.hpp:49:57: note: expanded from macro 'BOOST_PP_SEQ_FOR_EACH_M_I'
# define BOOST_PP_SEQ_FOR_EACH_M_I(r, macro, data, seq) macro(r, data, BOOST_PP_SEQ_HEAD(seq))
^
/Users/alex/ros_catkin_ws/src/pcl/common/include/pcl/ros/register_point_struct.h:121:33: note: expanded from macro 'POINT_CLOUD_REGISTER_FIELD_OFFSET'
static const size_t value = offsetof(name, BOOST_PP_TUPLE_ELEM(3, 1, elem)); \
^
/usr/bin/../lib/clang/4.2/include/stddef.h:62:24: note: expanded from macro 'offsetof'
#define offsetof(t, d) __builtin_offsetof(t, d)
^
In file included from /Users/alex/ros_catkin_ws/src/pcl/common/test/test_operators.cpp:40:
/Users/alex/ros_catkin_ws/src/pcl/common/include/pcl/point_types.h:532:1: warning: offset of on non-POD type 'pcl::PointWithScale' [-Winvalid-offsetof]
POINT_CLOUD_REGISTER_POINT_STRUCT (pcl::PointWithScale,
^
/Users/alex/ros_catkin_ws/src/pcl/common/include/pcl/ros/register_point_struct.h:58:3: note: expanded from macro 'POINT_CLOUD_REGISTER_POINT_STRUCT'
POINT_CLOUD_REGISTER_POINT_STRUCT_I(name, \
^
/Users/alex/ros_catkin_ws/src/pcl/common/include/pcl/ros/register_point_struct.h:93:29: note: expanded from macro 'POINT_CLOUD_REGISTER_POINT_STRUCT_I'
BOOST_PP_SEQ_FOR_EACH(POINT_CLOUD_REGISTER_FIELD_OFFSET, name, seq) \
^
/usr/local/include/boost/preprocessor/seq/for_each.hpp:26:67: note: expanded from macro 'BOOST_PP_SEQ_FOR_EACH'
# define BOOST_PP_SEQ_FOR_EACH(macro, data, seq) BOOST_PP_FOR((macro, data, seq (nil)), BOOST_PP_SEQ_FOR_EACH_P, BOOST_PP_SEQ_FOR_EACH_O, BOOST_PP_SEQ_FOR_EACH_M)
^
note: (skipping 13 expansions in backtrace; use -fmacro-backtrace-limit=0 to see all)
/usr/local/include/boost/preprocessor/seq/for_each.hpp:49:57: note: expanded from macro 'BOOST_PP_SEQ_FOR_EACH_M_I'
# define BOOST_PP_SEQ_FOR_EACH_M_I(r, macro, data, seq) macro(r, data, BOOST_PP_SEQ_HEAD(seq))
^
/Users/alex/ros_catkin_ws/src/pcl/common/include/pcl/ros/register_point_struct.h:121:33: note: expanded from m# define BOOST_PP_SEQ_FOR_EACH_M_I(r, macro, data, seq) macro(r, data, BOOST_PP_SEQ_HEAD(seq))
^
/Users/alex/ros_catkin_ws/src/pcl/common/include/pcl/ros/register_point_struct.h:121:33: note: expanded from macro 'POINT_CLOUD_REGISTER_FIELD_OFFSET'
static const size_t value = offsetof(name, BOOST_PP_TUPLE_ELEM(3, 1, elem)); \
^
acro 'POINT_CL/usr/bin/../lib/clang/4.2/include/stddef.h:62:24: note: expanded from macro 'offsetof'
#define offsetof(t, d) __builtin_offsetof(t, d)
^
OUD_REGISTER_FIELD_OFFSET'
static const size_t value = offsetof(name, BOOST_PP_TUPLE_ELEM(3, 1, elem)); \
^
/usr/bin/../lib/clang/4.2/include/stddef.h:62:24: note: expanded from macro 'offsetof'
#define offsetof(t, d) __builtin_offsetof(t, d)
^
In file included from /Users/alex/ros_catkin_ws/src/pcl/common/test/test_operators.cpp:40:
/Users/alex/ros_catkin_ws/src/pcl/common/include/pcl/point_types.h:532:1: warning: offset of on non-POD type 'pcl::PointWithScale' [-Winvalid-offsetof]
POINT_CLOUD_REGISTER_POINT_STRUCT (pcl::PointWithScale,
^
/Users/alex/ros_catkin_ws/src/pcl/common/include/pcl/ros/register_point_struct.h:58:3: note: expanded from macro 'POINT_CLOUD_REGISTER_POINT_STRUCT'
POINT_CLOUD_REGISTER_POINT_STRUCT_I(name, \
^
/Users/alex/ros_catkin_ws/src/pcl/common/include/pcl/ros/register_point_struct.h:93:29: note: expanded from macro 'POINT_CLOUD_REGISTER_POINT_STRUCT_I'
BOOST_PP_SEQ_FOR_EACH(POINT_CLOUD_REGISTER_FIELD_OFFSET, name, seq) \
^
/usr/local/include/boost/preprocessor/seq/for_each.hpp:26:67: note: expanded from macro 'BOOST_PP_SEQ_FOR_EACH'
# define BOOST_PP_SEQ_FOR_EACH(macro, data, seq) BOOST_PP_FOR((macro, data, seq (nil)), BOOST_PP_SEQ_FOR_EACH_P, BOOST_PP_SEQ_FOR_EACH_O, BOOST_PP_SEQ_FOR_EACH_M)
^
note: (skipping 17 expansions in backtrace; use -fmacro-backtrace-limit=0 to see all)
/usr/local/include/boost/preprocessor/seq/for_each.hpp:49:57: note: expanded from macro 'BOOST_PP_SEQ_FOR_EACH_M_I'
# define BOOST_PP_SEQ_FOR_EACH_M_I(r, macro, data, seq) macro(r, data, BOOST_PP_SEQ_HEAD(seq))
^
/Users/alex/ros_catkin_ws/src/pcl/common/include/pcl/ros/register_point_struct.h:121:33: note: expanded from macro 'POINT_CLOUD_REGISTER_FIELD_OFFSET'
static const size_t value = offsetof(name, BOOST_PP_TUPLE_ELEM(3, 1, elem)); \
^
/usr/bin/../lib/clang/4.2/include/stddef.h:62:24: note: expanded from macro 'offsetof'
#define offsetof(t, d) __builtin_offsetof(t, d)
^
In file included from /Users/alex/ros_catkin_ws/src/pcl/common/test/test_intensity.cpp:42:
/Users/alex/ros_catkin_ws/src/pcl/common/include/pcl/point_types.h:532:1: warning: offset of on non-POD type 'pcl::PointWithScale' [-Winvalid-offsetof]
POINT_CLOUD_REGISTER_POINT_STRUCT (pcl::PointWithScale,
^
/Users/alex/ros_catkin_ws/src/pcl/common/include/pcl/ros/register_point_struct.h:58:3: note: expanded from macro 'POINT_CLOUD_REGISTER_POINT_STRUCT'
POINT_CLOUD_REGISTER_POINT_STRUCT_I(name, \
^
/Users/alex/ros_catkin_ws/src/pcl/common/include/pcl/ros/register_point_struct.h:93:29: note: expanded from macro 'POINT_CLOUD_REGISTER_POINT_STRUCT_I'
BOOST_PP_SEQ_FOR_EACH(POINT_CLOUD_REGISTER_FIELD_OFFSET, name, seq) \
^
/usr/local/include/boost/preprocessor/seq/for_each.hpp:26:67: note: expanded from macro 'BOOST_PP_SEQ_FOR_EACH'
# define BOOST_PP_SEQ_FOR_EACH(macro, data, seq) BOOST_PP_FOR((macro, data, seq (nil)), BOOST_PP_SEQ_FOR_EACH_P, BOOST_PP_SEQ_FOR_EACH_O, BOOST_PP_SEQ_FOR_EACH_M)
^
note: (skipping 5 expansions in backtrace; use -fmacro-backtrace-limit=0 to see all)
/usr/local/include/boost/preprocessor/seq/for_each.hpp:49:57: note: expanded from macro 'BOOST_PP_SEQ_FOR_EACH_M_I'
# define BOOST_PP_SEQ_FOR_EACH_M_I(r, macro, data, seq) macro(r, data, BOOST_PP_SEQ_HEAD(seq))
^
/Users/alex/ros_catkin_ws/src/pcl/common/include/pcl/ros/register_point_struct.h:121:33: note: expanded from macro 'POINT_CLOUD_REGISTER_FIELD_OFFSET'
static const size_t value = offsetof(name, BOOST_PP_TUPLE_ELEM(3, 1, elem)); \
^
/usr/bin/../lib/clang/4.2/include/stddef.h:62:24: note: expanded from macro 'offsetof'
#define offsetof(t, d) __builtin_offsetof(t, d)
^
In file included from /Users/alex/ros_catkin_ws/src/pcl/common/test/test_intensity.cpp:42:
/Users/alex/ros_catkin_ws/src/pcl/common/include/pcl/point_types.h:532:1: warning: offset of on non-POD type 'pcl::PointWithScale' [-Winvalid-offsetof]
POINT_CLOUD_REGISTER_POINT_STRUCT (pcl::PointWithScale,
^
/Users/alex/ros_catkin_ws/src/pcl/common/include/pcl/ros/register_point_struct.h:58:3: note: expanded from macro 'POINT_CLOUD_REGISTER_POINT_STRUCT'
POINT_CLOUD_REGISTER_POINT_STRUCT_I(name, \
^
/Users/alex/ros_catkin_ws/src/pcl/common/include/pcl/ros/register_point_struct.h:93:29: note: expanded from macro 'POINT_CLOUD_REGISTER_POINT_STRUCT_I'
BOOST_PP_SEQ_FOR_EACH(POINT_CLOUD_REGISTER_FIELD_OFFSET, name, seq) \
^
/usr/local/include/boost/preprocessor/seq/for_each.hpp:26:67: note: expanded from macro 'BOOST_PP_SEQ_FOR_EACH'
# define BOOST_PP_SEQ_FOR_EACH(macro, data, seq) BOOST_PP_FOR((macro, data, seq (nil)), BOOST_PP_SEQ_FOR_EACH_P, BOOST_PP_SEQ_FOR_EACH_O, BOOST_PP_SEQ_FOR_EACH_M)
^
note: (skipping 9 expansions in backtrace; use -fmacro-backtrace-limit=0 to see all)
/usr/local/include/boost/preprocessor/seq/for_each.hpp:49:57: note: expanded from macro 'BOOST_PP_SEQ_FOR_EACH_M_I'
# define BOOST_PP_SEQ_FOR_EACH_M_I(r, macro, data, seq) macro(r, data, BOOST_PP_SEQ_HEAD(seq))
^
/Users/alex/ros_catkin_ws/src/pcl/common/include/pcl/ros/register_point_struct.h:121:33: note: expanded from macro 'POINT_CLOUD_REGISTER_FIELD_OFFSET'
static const size_t value = offsetof(name, BOOST_PP_TUPLE_ELEM(3, 1, elem)); \
^
/usr/bin/../lib/clang/4.2/include/stddef.h:62:24: note: expanded from macro 'offsetof'
#define offsetof(t, d) __builtin_offsetof(t, d)
^
In file included from /Users/alex/ros_catkin_ws/src/pcl/common/test/test_intensity.cpp:42:
/Users/alex/ros_catkin_ws/src/pcl/common/include/pcl/point_types.h:532:1: warning: offset of on non-POD type 'pcl::PointWithScale' [-Winvalid-offsetof]
POINT_CLOUD_REGISTER_POINT_STRUCT (pcl::PointWithScale,
^
/Users/alex/ros_catkin_ws/src/pcl/common/include/pcl/ros/register_point_struct.h:58:3: note: expanded from macro 'POINT_CLOUD_REGISTER_POINT_STRUCT'
POINT_CLOUD_REGISTER_POINT_STRUCT_I(name, \
^
/Users/alex/ros_catkin_ws/src/pcl/common/include/pcl/ros/register_point_struct.h:93:29: note: expanded from macro 'POINT_CLOUD_REGISTER_POINT_STRUCT_I'
BOOST_PP_SEQ_FOR_EACH(POINT_CLOUD_REGISTER_FIELD_OFFSET, name, seq) \
^
/usr/local/include/boost/preprocessor/seq/for_each.hpp:26:67: note: expanded from macro 'BOOST_PP_SEQ_FOR_EACH'
# define BOOST_PP_SEQ_FOR_EACH(macro, data, seq) BOOST_PP_FOR((macro, data, seq (nil)), BOOST_PP_SEQ_FOR_EACH_P, BOOST_PP_SEQ_FOR_EACH_O, BOOST_PP_SEQ_FOR_EACH_M)
^
note: (skipping 13 expansions in backtrace; use -fmacro-backtrace-limit=0 to see all)
/usr/local/include/boost/preprocessor/seq/for_each.hpp:49:57: note: expanded from macro 'BOOST_PP_SEQ_FOR_EACH_M_I'
# define BOOST_PP_SEQ_FOR_EACH_M_I(r, macro, data, seq) macro(r, data, BOOST_PP_SEQ_HEAD(seq))
^
/Users/alex/ros_catkin_ws/src/pcl/common/include/pcl/ros/register_point_struct.h:121:33: note: expanded from macro 'POINT_CLOUD_REGISTER_FIELD_OFFSET'
static const size_t value = offsetof(name, BOOST_PP_TUPLE_ELEM(3, 1, elem)); \
^
/usr/bin/../lib/clang/4.2/include/stddef.h:62:24: note: expanded from macro 'offsetof'
#define offsetof(t, d) __builtin_offsetof(t, d)
^
In file included from /Users/alex/ros_catkin_ws/src/pcl/common/test/test_intensity.cpp:42:
/Users/alex/ros_catkin_ws/src/pcl/common/include/pcl/point_types.h:532:1: warning: offset of on non-POD type 'pcl::PointWithScale' [-Winvalid-offsetof]
POINT_CLOUD_REGISTER_POINT_STRUCT (pcl::PointWithScale,
^
/Users/alex/ros_catkin_ws/src/pcl/common/include/pcl/ros/register_point_struct.h:58:3: note: expanded from macro 'POINT_CLOUD_REGISTER_POINT_STRUCT'
POINT_CLOUD_REGISTER_POINT_STRUCT_I(name, \
^
/Users/alex/ros_catkin_ws/src/pcl/common/include/pcl/ros/register_point_struct.h:93:29: note: expanded from macro 'POINT_CLOUD_REGISTER_POINT_STRUCT_I'
BOOST_PP_SEQ_FOR_EACH(POINT_CLOUD_REGISTER_FIELD_OFFSET, name, seq) \
^
/usr/local/include/boost/preprocessor/seq/for_each.hpp:26:67: note: expanded from macro 'BOOST_PP_SEQ_FOR_EACH'
# define BOOST_PP_SEQ_FOR_EACH(macro, data, seq) BOOST_PP_FOR((macro, data, seq (nil)), BOOST_PP_SEQ_FOR_EACH_P, BOOST_PP_SEQ_FOR_EACH_O, BOOST_PP_SEQ_FOR_EACH_M)
^
note: (skipping 17 expansions in backtrace; use -fmacro-backtrace-limit=0 to see all)
/usr/local/include/boost/preprocessor/seq/for_each.hpp:49:57: note: expanded from macro 'BOOST_PP_SEQ_FOR_EACH_M_I'
# define BOOST_PP_SEQ_FOR_EACH_M_I(r, macro, data, seq) macro(r, data, BOOST_PP_SEQ_HEAD(seq))
^
/Users/alex/ros_catkin_ws/src/pcl/common/include/pcl/ros/register_point_struct.h:121:33: note: expanded from macro 'POINT_CLOUD_REGISTER_FIELD_OFFSET'
static const size_t value = offsetof(name, BOOST_PP_TUPLE_ELEM(3, 1, elem)); \
^
/usr/bin/../lib/clang/4.2/include/stddef.h:62:24: note: expanded from macro 'offsetof'
#define offsetof(t, d) __builtin_offsetof(t, d)
^
In file included from /Users/alex/ros_catkin_ws/src/pcl/kdtree/src/kdtree_flann.cpp:39:
/Users/alex/ros_catkin_ws/src/pcl/common/include/pcl/point_types.h:539:1: warning: offset of on non-POD type 'pcl::PointSurfel' [-Winvalid-offsetof]
POINT_CLOUD_REGISTER_POINT_STRUCT(pcl::PointSurfel,
^
/Users/alex/ros_catkin_ws/src/pcl/common/include/pcl/ros/register_point_struct.h:58:3: note: expanded from macro 'POINT_CLOUD_REGISTER_POINT_STRUCT'
POINT_CLOUD_REGISTER_POINT_STRUCT_I(name, \
^
/Users/alex/ros_catkin_ws/src/pcl/common/include/pcl/ros/register_point_struct.h:93:29: note: expanded from macro 'POINT_CLOUD_REGISTER_POINT_STRUCT_I'
BOOST_PP_SEQ_FOR_EACH(POINT_CLOUD_REGISTER_FIELD_OFFSET, name, seq) \
^
/usr/local/include/boost/preprocessor/seq/for_each.hpp:26:67: note: expanded from macro 'BOOST_PP_SEQ_FOR_EACH'
# define BOOST_PP_SEQ_FOR_EACH(macro, data, seq) BOOST_PP_FOR((macro, data, seq (nil)), BOOST_PP_SEQ_FOR_EACH_P, BOOST_PP_SEQ_FOR_EACH_O, BOOST_PP_SEQ_FOR_EACH_M)
^
note: (skipping 5 expansions in backtrace; use -fmacro-backtrace-limit=0 to see all)
/usr/local/include/boost/preprocessor/seq/for_each.hpp:49:57: note: expanded from macro 'BOOST_PP_SEQ_FOR_EACH_M_I'
# define BOOST_PP_SEQ_FOR_EACH_M_I(r, macro, data, seq) macro(r, data, BOOST_PP_SEQ_HEAD(seq))
^
/Users/alex/ros_catkin_ws/src/pcl/common/include/pcl/ros/register_point_struct.h:121:33: note: expanded from macro 'POINT_CLOUD_REGISTER_FIELD_OFFSET'
static const size_t value = offsetof(name, BOOST_PP_TUPLE_ELEM(3, 1, elem)); \
^
/usr/bin/../lib/clang/4.2/include/stddef.h:62:24: note: expanded from macro 'offsetof'
#define offsetof(t, d) __builtin_offsetof(t, d)
^
In file included from /Users/alex/ros_catkin_ws/src/pcl/kdtree/src/kdtree_flann.cpp:39:
/Users/alex/ros_catkin_ws/src/pcl/common/include/pcl/point_types.h:539:1: warning: offset of on non-POD type 'pcl::PointSurfel' [-Winvalid-offsetof]
POINT_CLOUD_REGISTER_POINT_STRUCT(pcl::PointSurfel,
^
/Users/alex/ros_catkin_ws/src/pcl/common/include/pcl/ros/register_point_struct.h:58:3: note: expanded from macro 'POINT_CLOUD_REGISTER_POINT_STRUCT'
POINT_CLOUD_REGISTER_POINT_STRUCT_I(name, \
^
/Users/alex/ros_catkin_ws/src/pcl/common/include/pcl/ros/register_point_struct.h:93:29: note: expanded from macro 'POINT_CLOUD_REGISTER_POINT_STRUCT_I'
BOOST_PP_SEQ_FOR_EACH(POINT_CLOUD_REGISTER_FIELD_OFFSET, name, seq) \
^
/usr/local/include/boost/preprocessor/seq/for_each.hpp:26:67: note: expanded from macro 'BOOST_PP_SEQ_FOR_EACH'
# define BOOST_PP_SEQ_FOR_EACH(macro, data, seq) BOOST_PP_FOR((macro, data, seq (nil)), BOOST_PP_SEQ_FOR_EACH_P, BOOST_PP_SEQ_FOR_EACH_O, BOOST_PP_SEQ_FOR_EACH_M)
^
note: (skipping 9 expansions in backtrace; use -fmacro-backtrace-limit=0 to see all)
/usr/local/include/boost/preprocessor/seq/for_each.hpp:49:57: note: expanded from macro 'BOOST_PP_SEQ_FOR_EACH_M_I'
# define BOOST_PP_SEQ_FOR_EACH_M_I(r, macro, data, seq) macro(r, data, BOOST_PP_SEQ_HEAD(seq))
^
/Users/alex/ros_catkin_ws/src/pcl/common/include/pcl/ros/register_point_struct.h:121:33: note: expanded from macro 'POINT_CLOUD_REGISTER_FIELD_OFFSET'
static const size_t value = offsetof(name, BOOST_PP_TUPLE_ELEM(3, 1, elem)); \
^
/usr/bin/../lib/clang/4.2/include/stddef.h:62:24: note: expanded from macro 'offsetof'
#define offsetof(t, d) __builtin_offsetof(t, d)
^
In file included from /Users/alex/ros_catkin_ws/src/pcl/kdtree/src/kdtree_flann.cpp:39:
/Users/alex/ros_catkin_ws/src/pcl/common/include/pcl/point_types.h:539:1: warning: offset of on non-POD type 'pcl::PointSurfel' [-Winvalid-offsetof]
POINT_CLOUD_REGISTER_POINT_STRUCT(pcl::PointSurfel,
^
/Users/alex/ros_catkin_ws/src/pcl/common/include/pcl/ros/register_point_struct.h:58:3: note: expanded from macro 'POINT_CLOUD_REGISTER_POINT_STRUCT'
POINT_CLOUD_REGISTER_POINT_STRUCT_I(name, \
^
/Users/alex/ros_catkin_ws/src/pcl/common/include/pcl/ros/register_point_struct.h:93:29: note: expanded from macro 'PIn file included from /Users/alex/ros_catkin_ws/src/pcl/common/test/test_operators.cpp:40:
/Users/alex/ros_catkin_ws/src/pcl/common/include/pcl/point_types.h:539:1: warning: offset of on non-POD type 'pcl::PointSurfel' [-Winvalid-oOIfNfsetof]
POINT_CLOUD_REGISTER_POINT_STRUCT(pcl::PointSurfel,
T_CL^
/Users/alex/ros_catkin_ws/src/pcl/common/include/pcl/ros/register_point_struct.h:58:3: note: expanded from macro 'POINT_CLOUD_REGISTER_POINT_STRUCT'
POINT_CLOUD_REGISTER_POINT_STRUCT_I(name, \
^
/Users/alex/ros_catkin_ws/src/pcl/common/include/pcl/ros/register_point_struct.h:93OUD:_29R:E Gnote: eISxTER_panded from macro 'POINT_CLOUDPOI_RNT_EGISSTTREURC_TP_OII'N
T_STRUCT_ BOOST_PP_SEQ_FOR_EACH(POINT_CLOUD_REGISTER_FIELD_OFFSET, name, seq) \
^
/usr/local/include/boost/preprocessor/seq/for_each.hpp:26:67: note: expanded from macro 'BOOST_PP_SEQ_FOR_EACH'
# define BOOST_PP_SEQ_FOR_EACH(macro, data, seq) BOOST_PP_FOR((macro, data, seq (nil)), BOOST_PP_SEQ_FOR_EACH_P, BOOST_PP_SEQ_FOR_EACH_O, BOOST_PP_SEQ_FOR_EACH_M)
^
note: (skipping 13 expansions in backtrace; use -fmacro-backtrace-limit=0 to see all)
I'
/usr/local/include/boost/preprocessor/seq/for_each.hpp:49:57: note: expanded from macr BOOST_PP_SEQ_FOR_EACH(POINT_CLOUD_REGISTER_FIELD_OFFSET, name, seq) \
^o 'BOOST_PP_SEQ
/usr/local/include/boost/preprocessor/seq/for_each.hpp:26:67: note: expanded from macro 'BOOST_PP_SEQ_FOR_EACH'
# define BOOST_PP_SEQ_FOR_EACH(macro, data, seq) BOOST_PP_FOR((macro, data, seq (nil)), BOOST_PP_SEQ_FOR_EACH_P, BOOST_PP_SEQ_FOR_EACH_O, BOOST_PP_SEQ_FOR_EACH_M)
^
note: (skipping 5 expansions in backtrace; use -fmacro-backtrace-limit=0 to see all)
/usr/local/include/boost/preprocessor/seq/for_each.hpp:49:57: note: expanded from macro 'BOOST_PP_SEQ_FOR_EACH_M_I'
# define BOOST_PP_SEQ_FOR_EACH_M_I(r, macro, data, seq) macro(r, data, BOOST_PP_SEQ_HEAD(seq))
^
_FOR_EACH_M/Users/alex/ros_catkin_ws/src/pcl/common/include/pcl/ros/register_point_struct.h:121:33: note: expanded fr_Iom ma'
cro 'POINT_CLOUD_REGISTER_FIELD_OFFSET'
# define BOOST_PP_SEQ_FOR_EACH_M_I(r, macro, data, seq) macro(r, data, BOOST_PP_SEQ_HEAD(seq))
^
static const size_t value = offsetof(name, BOOST_PP_TUPLE_ELEM(3, 1, elem)); \
^
/Users/alex/ros_catkin_ws/src/pcl/common/include/pcl/ros/register_point_struct.h:121:33: note: expanded from macro 'POINT_CLOUD_REGISTE/usr/bin/../lib/clang/4.2/include/stddef.h:62R_FIELD_OFFSET'
static const size_t value = offsetof(name, BOOST_PP_TUPLE_ELEM(3, 1, elem)); \
^
/usr/bin/../lib/clang/4.2/include/stddef.h:62:24: note: expanded from macro 'offsetof'
:24:#define offsetof(t, d) __builtin_offsetof(t, d)
^
In file included from /Users/alex/ros_catkin_ws/src/pcl/kdtree/src/kdtree_flann.cpp:39:
/Users/alex/ros_catkin_ws/src/pcl/common/include/pcl/point_types.h:539:1: warning: offset of on non-POD type 'pcl::PointSurfel' [-Winvalid-offsetof]
note: expanded from macro 'offsetof'
#define offsetof(t, d) __builtin_offsetof(t, d)
^POINT_CLOUD_REGISTER_POINT_STRUCT(pcl::PointSurfel,
^
/Users/alex/ros_catkin_ws/src/pcl/common/include/pcl/ros/register_point_struct.h:58:3: note: expanded from macro 'POINT_CLOUD_REGISTER_POINT_STRUCT'
POINT_CLOUD_REGISTER_POINT_STRUCT_I(name, \
^
/Users/alex/ros_catkin_ws/src/pcl/common/include/pcl/ros/register_point_struct.h:93:29: note: expanded from macro 'POINT_CLOUD_REGISTER_POINT_STRUCT_I'
BOOST_PP_SEQ_FOR_EACH(POINT_CLOUD_REGISTER_FIELD_OFFSET, name, seq) \
^
/usr/local/include/boost/preprocessor/seq/for_each.hpp:26:67: note: expanded from macro 'BOOST_PP_SEQ_FOR_EACH'
# define BOOST_PP_SEQ_FOR_EACH(macro, data, seq) BOOST_PP_FOR((macro, data, seq (nil)), BOOST_PP_SEQ_FOR_EACH_P, BOOST_PP_SEQ_FOR_EACH_O, BOOST_PP_SEQ_FOR_EACH_M)
^
note: (skipping 17 expansions in backtrace; use -fmacro-backtrace-limit=0 to see all)
/usr/local/include/boost/preprocessor/seq/for_each.hpp:49:57: note: expanded from macro 'BOOST_PP_SEQ_FOR_EACIn file included from /Users/alex/ros_catkin_ws/src/pcl/common/test/test_operators.cpp:40H_M_:
I/Users/alex/ros_catkin_ws/src/pcl/common/include/pcl/point_types.h'
# define BOOST_PP_SEQ_FOR_EACH_M_I(r, macro, data, seq) macro(r, data, BOOST_PP_SEQ_HEAD(seq))
:539:1: warning: offset of on non-POD type 'pcl::PointSurfel' [-W ^
/Users/alex/ros_catkin_ws/src/pcl/common/include/pcl/ros/register_point_struct.h:121:33: note: expanded from minvalid-oacro 'POINT_CLOUD_REGISTER_FIELD_OFFSET'
static const size_t value = offsetof(name, BOOST_PP_TUPLE_ELEM(3, 1, elem)); \
^f
/usr/bin/../lib/clang/4.2/include/stddef.h:62:24: note: expanded from macro 'offsetof'
#define offsetof(t, d) __builtin_offsetof(t, d)
^
fsetof]
POINT_CLOUD_REGISTER_POINT_STRUCT(pcl::PointSurfel,
^
/Users/alex/ros_catkin_ws/src/pcl/common/include/pcl/ros/register_point_struct.h:58:3In file included from /Users/alex/ros_catkin_ws/src/pcl/kdtree/src/kdtree_flann.cpp:39:
/Users/alex/ros_catkin_ws/src/pcl/common/include/pcl/point_types.h:539:1: warning: offset of on non-POD type 'pcl::PointSurfel' [-Winvalid-offsetof]
POINT_CLOUD_REGISTER_POINT_STRUCT(pcl::PointSurfel,
^
/Users/alex/ros_catkin_ws/src/pcl/common/include/pcl/ros/register_point_struct.h::58:3: note: expanded from macro 'POINT_CLOUD_REGISTER_POINT_STRUCT'
POINT_CLOUD_REGISTER_POINT_STRUCT_I(name, \
^
/Users/alex/ros_catkin_ws/src/pcl/common/include/pcl/ros/register_point_struct.h:93:29: note: expanded from macro 'POINT_CLOUD_REGISTER_POINT_STRUCT_I'
BOOST_PP_SEQ_FOR_EACH(POINT_CLOUD_REGISTER_FIELD_OFFSET, name, seq) \
^
/usr/local/include/boost/preprocessor/seq/for_each.hpp:26:67: note: expanded from macro 'BOOST_PP_SEQ_FOR_EACH'
# define BOOST_PP_SEQ_FOR_EACH(macro, data, seq) BOOST_PP_FOR((macro, data, seq (nil)), BOOST_PP_SEQ_FOR_EACH_P, BOOST_PP_SEQ_FOR_EACH_O, BOOST_PP_SEQ_FOR_EACH_M)
^
note: (skipping 21 expansions in backtrace; use -fmacro-backtrace-limit=0 to see all)
/usr/local/include/boost/preprocessor/seq/for_each.hpp:49:57: note: expanded from macro 'BOOST_PP_SEQ_FOR_EACH_M_I'
# define BOOST_PP_SEQ_FOR_EACH_M_I(r, macro, data, seq) macro(r, data, BOOST_PP_SEQ_HEAD(seq))
^
/Users/alex/ros_catkin_ws/src/pcl/common/include/pcl/ros/register_point_struct.h:121:33: note: expanded from macro 'POINT_CLOUD_REGISTER_FIEL note: eD_OFFSET'
static const size_t value = offsetof(name, BOOST_PP_TUPLE_ELEM(3, 1, elem)); \
^
In file included from /Users/alex/ros_catkin_ws/src/pcl/common/test/test_intensity.cpp:42:
/Users/alex/ros_catkin_ws/src/pcl/common/include/pcl/point_types.hxpande/usr/bin/../lib/clang/4.2/include/stddef.h:d:62:24: note: expanded from macro 'offsetof'
#define offsetof(t, d) __builtin_offsetof(t, d)
^
fro539m :ma1cr: warning: offset o 'Pof OoInN Tno_n-POCLOUDD typ_REGISe TER_POINT_STRU'pCTcl:':P
POINT_CLOUD_REGISTER_POINT_STRUCT_I(name, \
^
oIn file included from /Users/alex/ros_catkin_ws/src/pcl/kdtree/src/kdtree_flann.cpp:39:
/Users/alex/ros_catkin_ws/src/pcl/common/include/pcl/point_types.h:539:1: warning: offset of ionnt /Users/alex/ros_catkin_ws/src/pcl/common/include/pcl/ros/register_point_struct.hnoSurf:n-e93l' P[O-WD tyinvalid-of:fpe '29:s etof]
note: expcl::PoipnatnSduerdf eflr'o m[ -mWaicnrvoa l'iPdO-IoNfTf_sCeLtOoUfD]_
REGISTER_POINT_STRUCT_I'
POINT_CLOUD_REGISTER_POINT_STRUCT(pcl::PointSurfel,
^
BOOST_PP_SEQ_FOR_EACH(POINT_CLOUD_REGISTER_FIELD_OFFSET, name, seq) \
^
/Users/alex/ros_catkin_ws/src/pcl/common/include/pcl/ros/register_point_struct.h:58:3: note: expanded from macro 'P/usr/local/include/boost/preprocessor/seq/for_each.hpp:26:OPOINT_CLOUD_REGISTER_POINT_STRUCT(pcl::PointSurfel,I67
:^
NT_CLOUD_REGIST note: expanded from macro 'BOOST_PP_SEQ_FOR_EACH'
/Users/alex/ros_catkin_ws/src/pcl/common/include/pcl/ros/register_point_struct.h:58:3: note: expanded from macro 'POINT_CLOUD_REGISTER_POINT_STRUCT'
# define BOOST_PP_SEQ_FOR_EACH(macro, data, seq) BOOST_PP_FOR((macro, data, seq (nil)), BOOST_PP_SEQ_FOR_EACH_P, BOOST_PP_SEQ_FOR_EACH_O, BOOST_PP_SEQ_FOR_EACH_M)ER_P
^
note: O(skipping 9 expansions in backtrace; use -fmacro-backtrace-limit=0 to see all)I
N POINT_CLOUD_REGISTER_POINT_STRUCT_I(name, \T_ST
^
/usr/local/include/boost/preprocessor/seq/for_each.hpp:RU49CT'
:57/Users/alex/ros_catkin_ws/src/pcl/common/include/pcl/ros/register_point_struct.h:93:29: note: expand POINT_CLOUD_REGISTER_POINT_STRUCT_I(name, \
ed: note: ex f ^r
/Users/alex/ros_catkin_ws/src/pcl/common/include/pcl/ros/register_point_struct.h:93:po29m: mannote: exdpanacredo 'PdOeI fdN Tf_CrroomL macrom macrOUD_o 'POIR E'NGTIBOOST_PP_ST_SER_POINT_STRUCT_I'
BOOST_PP_SEQ_FOR_EACH(POINT_CLOUD_REGISTER_FIELD_OFFSET, name, seq) \
^
EQ_FOR_EACHCLOUD_M_I'
_/usr/local/include/boost/preprocessor/seq/for_each.hpp:26:67: note: expanded REfGISTrEo# define BOOST_PP_SEQ_FOR_EACH_M_I(r, macro, data, seq) macro(r, data, BOOST_PP_SEQ_HEAD(seq))Rm m_
POI ^acro
'BONT_OSTS_PP_SEQ_FOR_EACH'
/Users/alex/ros_catkin_ws/src/pcl/common/include/pcl/ros/register_point_struct.h:121TRUCT_I'
# define BOOST_PP_SEQ_FOR_EACH(macro, data, seq) BOOST_PP_FOR((macro, data, seq (nil)), BOOST_PP_SEQ_FOR_EACH_P, BOOST_PP_SEQ_FOR_EACH_O, BOOST_PP_SEQ_FOR_EACH_M)
^
:33: BOOST_PP_SEQ_FOR_EACH(POINT_CLOUD_REGISTER_FIELD_OFFSET, name, seq) \
note: ^
note: (skipping 25 expansions in backtrace; use -fmacro-backtrace-limit=0 to see all)
exp/usr/local/include/boost/preprocessor/seq/for_each.hppanded from macro ':/usr/local/include/boost/preprocessor/seq/for_each.hpp:2649:P:67:57: OIN note: expTnote: _CeaLOxUpanded fromD_RndedEGISTER mfarc_rFoI 'BOOSTomEL_ PmDP__aOcSFFrSEEQT_o 'BO'
FOOR_EACH_M_I'
static const size_t value = offsetof(name, BOOST_PP_TUPLE_ELEM(3, 1, elem)); \
^ST_PP_SEQ_FOR_EACH'
# define BOOST_PP_SEQ_FOR_EACH_M_I(r, macro, data, seq) macro(r, data, BOOST_PP_SEQ_HEAD(seq))
^
# define BOOST_PP_SEQ_FOR_EACH(macro, data, seq) BOOST_PP_FOR((macro, data, seq (nil)), BOOST_PP_SEQ_FOR_EACH_P, BOOST_PP_SEQ_FOR_EACH_O, BOOST_PP_SEQ_FOR_EACH_M)
^
/Users/alex/ros_catkin_ws/src/pcl/common/include/pcl/ros/register_point_struct.h:121:33:note: (skipping 5 expansions in backtrace; use -fmacro-backtrace-limit=0 to see all) note: e
/usr/bin/../lib/clang/4.2/include/stddef.h:x62p:a24n:d enote: de xfpraonmd emda cfrro 'Po/usr/local/include/boost/preprocessor/seq/for_each.hppm: 49m:a57cOINT_CLOUD_Rro : Enote: 'exGpIaSnTdEeoffsR_FIELD_OetoFFd f'
SEfroTm'
#define offsetof(t, d) __builtin_offsetof(t, d)
^
static const size_t value = offsetof(name, BOOST_PP_TUPLE_ELEM(3, 1, elem)); \
^
/usr/bin/../lib/clang/4.2/include/stddef.h:62:24: note: expanded from macro 'offsetof'
#define offsetof(t, d) __builtin_offsetof(t, d)
^
In file included from /Users/alex/ros_catkin_ws/src/pcl/common/test/test_operators.cpp:40:
macr/Users/alex/ros_catkin_ws/src/pcl/common/include/pcl/point_types.h:o539:1: 'warning: BOOST_PPoff_SEsQ_etFOR _Eof on non-POD type 'pcl::PointSurfel' [-Winvalid-offsetof]
In file included from /Users/alex/ros_catkin_ws/src/pcl/kdtree/src/kdtree_flann.cppACH_M_:39I:
'/Users/alex/ros_catkin_ws/src/pcl/common/include/pcl/point_types.h:539:1: warning: offset of
POINT_CLOUD_REGISTER_POINT_STRUCT(pcl::PointSurfel,
^
# define BOOST_PP_SEQ_FOR_EACH_M_I(r, macro, data, seq) macro(r, data, BOOST_PP_SEQ_HEAD(seq))
^on non-PO/Users/alex/ros_catkin_ws/src/pcl/common/include/pcl/ros/register_point_struct.hD
:58:type 'p3: cnote: elx:p/Users/alex/ros_catkin_ws/src/pcl/common/include/pcl/ros/register_point_struct.h:ande121:33::Pd ofirnotSnote: meu mrfelxpanded' [acro 'POIN-W finvarloimd -mTa_CofLOUcD_rofsetofR]E GI'SP
OITER_POINT_STRUCT'
POINT_CLOUD_REGISTER_POINT_STRUCT_I(name, \
^
POINT_CLOUD_REGISTER_POINT_STRUCT(pcl::PointSurfel,
^
/Users/alex/ros_catkin_ws/src/pcl/common/include/pcl/ros/register_point_struct.hNT_CL:93:OUD_REGIS29: note: expanded from macro 'TER_FIPOELINTD/Users/alex/ros_catkin_ws/src/pcl/common/include/pcl/ros/register_point_struct.h_:O_FCLOUFDSE_REGT'58:I
3:STER_POINT_STRUCT_I'
static const size_t value = offsetof(name, BOOST_PP_TUPLE_ELEM(3, 1, elem)); \
^note: expa
nd BOOST_PP_SEQ_FOR_EACH(POINT_CLOUD_REGISTER_FIELD_OFFSET, name, seq) \e
d /usr/bin/../lib/clang/4.2/include/stddef.h ^f
r:62:24: note: eom xmpandacro 'POINTe_CLOUD_/usr/local/include/boost/preprocessor/seq/for_each.hpp:26:67: d note: eRxfropanm macro dEeG'Iodf ffsrSoTmE R_emacPOtoroIf'
'BONT_OSSTRUCT'
#define offsetof(t, d) __builtin_offsetof(t, d)
^T
_PP_SEQ_FOR_EACH'
POINT_CLOUD_REGISTER_POINT_STRUCT_I(name, \
^
/Users/alex/ros_catkin_ws/src/pcl/common/include/pcl/ros/register_point_struct.h:93:29: note: expanded from macro 'POINT_CLOUD_REGISTER_POINT_STRUCT_I'
BOOST_PP_SEQ_FOR_EACH(POINT_CLOUD_REGISTER_FIELD_OFFSET, name, seq) \
^# define BOOST_PP_SEQ_FOR_EACH(macro, data, seq) BOOST_PP_FOR((macro, data, seq (nil)), BOOST_PP_SEQ_FOR_EACH_P, BOOST_PP_SEQ_FOR_EACH_O, BOOST_PP_SEQ_FOR_EACH_M)
^
note: (skipping 13 expansions in backtrace; use -fmacro-backtrace-limit=0 to see all)
/usr/local/include/boost/preprocessor/seq/for_each.hpp:49:57: note: expanded from m/usr/local/include/boost/preprocessor/seq/for_each.hppa:26:cro 'BOO67:ST_PP_SEQ note: _eFxpanded from macro 'BOOST_PP_SEQ_OR_FEOARC_HE_AMC_HI''
# define BOOST_PP_SEQ_FOR_EACH_M_I(r, macro, data, seq) macro(r, data, BOOST_PP_SEQ_HEAD(seq))
^
# define BOOST_PP_SEQ_FOR_EACH(macro, data, seq) BOOST_PP_FOR((macro, data, seq (nil)), BOOST_PP_SEQ_FOR_EACH_P, BOOST_PP_SEQ_FOR_EACH_O, BOOST_PP_SEQ_FOR_EACH_M)
^
/Users/alex/ros_catkin_ws/src/pcl/common/include/pcl/ros/register_point_struct.hnote: :(skipping 29 expansions in backtrace; use -fmacro-backtrace-limit=0 to see all)121
:33: note: expandIn file included from e/Users/alex/ros_catkin_ws/src/pcl/common/test/test_intensity.cppd from :42m:
ac/Users/alex/ros_catkin_ws/src/pcl/common/include/pcl/point_types.h:539r:o1 :' Pwarning: OoIfNfTs_eCtL OoUD_R/usr/local/include/boost/preprocessor/seq/for_each.hpp:49f EGIS:57onTE noR_: n-POFInote: expandDEeL dtyDp_e fOFF'prSoEmT '
cl:mac:Prooi 'BnOtOS static const size_t value = offsetof(name, BOOST_PP_TUPLE_ELEM(3, 1, elem)); \u
^
rSfTe_lP'P _[S-EWQi_nFvOaR_lid-EACHof/usr/bin/../lib/clang/4.2/include/stddef.h_M_I'
fse:62:t24:of ]note: ex
pa# define BOOST_PP_SEQ_FOR_EACH_M_I(r, macro, data, seq) macro(r, data, BOOST_PP_SEQ_HEAD(seq))
^
nded from macro 'offsetof'
#define offsetof(t, d) __builtin_offsetof(t, d)
^
POINT_CLOUD_REGISTER_POINT_STRUCT(pcl::PointSurfel,
^
/Users/alex/ros_catkin_ws/src/pcl/common/include/pcl/ros/register_point_struct.h:121:33: note: expande/Users/alex/ros_catkin_ws/src/pcl/common/include/pcl/ros/register_point_struct.h:58:3: note: expd fandroedm mac from macro ro' 'PPOOIINT_CLOUD_REGNT_CLOUD_RISTEGISTER_FIEELD_OR_POINT_STRUCT'
POINT_CLOUD_REGISTER_POINT_STRUCT_I(name, \
^FF
SET'
static const size_t value = offsetof(name, BOOST_PP_TUPLE_ELEM(3, 1, elem)); \
^/Users/alex/ros_catkin_ws/src/pcl/common/include/pcl/ros/register_point_struct.h:93:29: note: expanded from macro 'POINT_CLOUD_REGISTER_POINT_
STRUCT_I'
/usr/bin/../lib/clang/4.2/include/stddef.h:62:24: note: expanded from macro 'offsetof'
In file included from /Users/alex/ros_catkin_ws/src/pcl/common/test/test_operators.cpp:40:
/Users/alex/ros_catkin_ws/src/pcl/common/include/pcl/point_types.h:539:1: warning: offset of on non-POD type 'pcl::P#define offsetof(t, d) __builtin_offsetof(t, d)
^
ointSurfel' [-Winvalid-off BOOST_PP_SEQ_FOR_EACH(POINT_CLOUD_REGISTER_FIELD_OFFSET, name, seq) \
seto ^
/usr/local/include/boost/preprocessor/seq/for_each.hpp:26f]
:67: note: expanded from mPOINT_CLOUD_REGISTER_POINT_STRUCT(pcl::PointSurfel,
^acro 'BOOST_PP_SEQ
/Users/alex/ros_catkin_ws/src/pcl/common/include/pcl/ros/register_point_struct.h:58:3: note: expanded from macro 'POINT_CLOUD_REGISTER_POINT_STRUCT'
_FOR_EACH'
POINT_CLOUD_REGISTER_POINT_STRUCT_I(name, \
^
# define BOOST_PP_SEQ_FOR_EACH(macro, data, seq) BOOST_PP_FOR((macro, data, seq (nil)), BOOST_PP_SEQ_FOR_EACH_P, BOOST_PP_SEQ_FOR_EACH_O, BOOST_PP_SEQ_FOR_EACH_M)
^
note: (skipping 9 expansions in backtrace; use -fmacro-backtrace-limit=0 to see all)
/Users/alex/ros_catkin_ws/src/pcl/common/include/pcl/ros/register_point_struct.h:93:29: note: expanded from macro 'POINT_CLOU/usr/local/include/boost/preprocessor/seq/for_each.hpp:49:D57_R: note: EeGxIpanIn file included from S/Users/alex/ros_catkin_ws/src/pcl/kdtree/src/kdtree_flann.cpp:deTER_Pd39OI Nfrom:
/Users/alex/ros_catkin_ws/src/pcl/common/include/pcl/point_types.h:539:1: warning: offset o mafc oTro 'BOOST_P_nP_SSTREUQC_TF_OIR'_
EACH_M_I'
BOOST_PP_SEQ_FOR_EACH(POINT_CLOUD_REGISTER_FIELD_OFFSET, name, seq) \
^
# define BOOST_PP_SEQ_FOR_EACH_M_I(r, macro, data, seq) macro(r, data, BOOST_PP_SEQ_HEAD(seq))non-P
^
OD type 'pcl::PointSurfel' [-Win/usr/local/include/boost/preprocessor/seq/for_each.hpp:26:67: note: evali/Users/alex/ros_catkin_ws/src/pcl/common/include/pcl/ros/register_point_struct.h:121d-of:xpfsae33n:d enote: etxd fropanmd emda cfro of'roBmO OmaS]
T_PP_SEQ_FOR_EACH'
# define BOOST_PP_SEQ_FOR_EACH(macro, data, seq) BOOST_PP_FOR((macro, data, seq (nil)), BOOST_PP_SEQ_FOR_EACH_P, BOOST_PP_SEQ_FOR_EACH_O, BOOST_PP_SEQ_FOR_EACH_M)c
^
note: (skipping 17 expansions in backtrace; use -fmacro-backtrace-limit=0 to see all)
POINT_CLOUD_REGISTER_POINT_STRUCT(pcl::PointSurfel,
^ro 'POI
/usr/local/include/boost/preprocessor/seq/for_each.hppNT_CLOU:49:57: D_REGISTER_FIELD_OFFSET'
/Users/alex/ros_catkin_ws/src/pcl/common/include/pcl/ros/register_point_struct.h:58:3: note: expanded from manote: cro static const size_t value = offsetof(name, BOOST_PP_TUPLE_ELEM(3, 1, elem)); \
e ^x
pa'POINTnd_eCLd from ma/usr/bin/../lib/clang/4.2/include/stddef.h:cro 'BOOST62_POP:24U_S: note: D_REQ_exEpGaIndFSTOERR__EPAOCIed froNTH_M_m _IS'maTR
UCT'
POINT_CLOUD_REGISTER_POINT_STRUCT_I(name, \
cro # define BOOST_PP_SEQ_FOR_EACH_M_I(r, macro, data, seq) macro(r, data, BOOST_PP_SEQ_HEAD(seq))
^ ^
'of
/Users/alex/ros_catkin_ws/src/pcl/common/include/pcl/ros/register_point_struct.h:121fs:et33: note: expanded f/Users/alex/ros_catkin_ws/src/pcl/common/include/pcl/ros/register_point_struct.h:93:of'
rom 29mac: #define offsetof(t, d) __builtin_offsetof(t, d)
note: rexo ^'PpOaInNdT
e_d frCoLmO macro 'PUOINTD_REGISTER_FIELD_OFFSET'
static const size_t value = offsetof(name, BOOST_PP_TUPLE_ELEM(3, 1, elem)); \
^_CLOUD_REGISTER_POINT_STRUCT_I'
BOOST_PP_SEQ_FOR_EACH(POINT_CLOUD_REGISTER_FIELD_OFFSET, name, seq) \
^
/usr/bin/../lib/clang/4.2/include/stddef.h:62:24: note: expanded from macro 'offsetof'
/usr/local/include/boost/preprocessor/seq/for_each.hpp:26:67: note: expanded from #define offsetof(t, d) __builtin_offsetof(t, d)
^macro
In file included from /Users/alex/ros_catkin_ws/src/pcl/common/test/test_intensity.cpp:42:
/Users/alex/ros_catkin_ws/src/pcl/common/include/pcl/point_types.h:539'BOO:1S: warning: offTs_ePtP _oSfE Qo_nF OnRo_nE-APCOHD'
type 'pcl::PointSurfel' [-Winvalid-offsetof]
# define BOOST_PP_SEQ_FOR_EACH(macro, data, seq) BOOST_PP_FOR((macro, data, seq (nil)), BOOST_PP_SEQ_FOR_EACH_P, BOOST_PP_SEQ_FOR_EACH_O, BOOST_PP_SEQ_FOR_EACH_M)
^
note: (skipping 33 expansions in backtrace; use -fmacro-backtrace-limit=0 to see all)
POINT_CLOUD_REGISTER_POINT_STRUCT(pcl::PointSurfel,
^
/usr/local/include/boost/preprocessor/seq/for_each.hpp/Users/alex/ros_catkin_ws/src/pcl/common/include/pcl/ros/register_point_struct.h::4958::573:: note: note: eexxppaanndedded f frroomm mmaaccrroo ''BPOOOISNTT__PPCLOUD_REGISTER_POINT_STRUCT'
POINT_CLOUD_REGISTER_POINT_STRUCT_I(name, \
^
In file included from /Users/alex/ros_catkin_ws/src/pcl/common/test/test_operators.cpp_SEQ:40_F:
/Users/alex/ros_catkin_ws/src/pcl/common/include/pcl/point_types.h:/Users/alex/ros_catkin_ws/src/pcl/common/include/pcl/ros/register_point_struct.h539::931::O Rwarning: offset of on n_on29:EA-C note: PH_M_eOxI'
D patypndee 'pcd fl::# define BOOST_PP_SEQ_FOR_EACH_M_I(r, macro, data, seq) macro(r, data, BOOST_PP_SEQ_HEAD(seq))
^
rom maPcoirntSurfel' [-Winvalid-offsetof]
/Users/alex/ros_catkin_ws/src/pcl/common/include/pcl/ros/register_point_struct.h:121:33: note: expanded from macro 'POINT_CLOUD_REGISTER_FIELD_OFFSET'
POINT_CLOUD_REGISTER_POINT_STRUCT(pcl::PointSurfel,
^
static const size_t value = offsetof(name, BOOST_PP_TUPLE_ELEM(3, 1, elem)); \
^
/Users/alex/ros_catkin_ws/src/pcl/common/include/pcl/ros/register_point_struct.h:58:3: note: expanded from macro 'POINT_CLOUD_REGISTER_POINT_STRUCT'
/usr/bin/../lib/clang/4.2/include/stddef.h:62:24: note: expanded from macro 'offse POINT_CLOUD_REGISTER_POINT_STRUCT_I(name, \
^tofo '
'
#define offsetof(t, d) __builtin_offsetof(t, d)
^
/Users/alex/ros_catkin_ws/src/pcl/common/include/pcl/ros/register_point_struct.h:93:29: note: expanded from macro 'POINT_CLOUD_REGISTER_POINT_STRUCT_I'
BOOST_PP_SEQ_FOR_EACH(POINT_CLOUD_REGISTER_FIELD_OFFSET, name, seq) \
^
/usr/local/include/boost/preprocessor/seq/for_each.hpp:26:67: note: expanded from macro 'BOOST_PP_SEQ_FOR_EACH'
POINT_CLOUD_REGI# define BOOST_PP_SEQ_FOR_EACH(macro, data, seq) BOOST_PP_FOR((macro, data, seq (nil)), BOOST_PP_SEQ_FOR_EACH_P, BOOST_PP_SEQ_FOR_EACH_O, BOOST_PP_SEQ_FOR_EACH_M)
STER_POINT_STRUCT_I'
BOOST_PP_SEQ_FOR_EACH(POINT_CLOUD_REGISTER_FIELD_OFFSET, name, seq) \
^ ^
note: (skipping 21 expansions in backtrace; use -fmacro-backtrace-limit=0 to see all)
In file included from /Users/alex/ros_catkin_ws/src/pcl/kdtree/src/kdtree_flann.cpp
/usr/local/include/boost/preprocessor/seq/for_each.hpp:49::3957:
/Users/alex/ros_catkin_ws/src/pcl/common/include/pcl/point_types.h: :note: 539e:x1p:a nwarning: doefdf sferto mo fm aocnr on o/usr/local/include/boost/preprocessor/seq/for_each.hpp:26:67'BOOn-PODS:T note: _tPyexpe P_Spand'pcEQed l_::PfFrOoRom maciro_ntS 'BOEACH_MurfeOST_PP_SEQ_FOR_EACH'
_I'
l# define BOOST_PP_SEQ_FOR_EACH_M_I(r, macro, data, seq) macro(r, data, BOOST_PP_SEQ_HEAD(seq))
^'
[-Winvalid-offsetof]
# define BOOST_PP_SEQ_FOR_EACH(macro, data, seq) BOOST_PP_FOR((macro, data, seq (nil)), BOOST_PP_SEQ_FOR_EACH_P, BOOST_PP_SEQ_FOR_EACH_O, BOOST_PP_SEQ_FOR_EACH_M)
^
note: (skipping 13 expansions in backtrace; use -fmacro-backtrace-limit=0 to see all)
/Users/alex/ros_catkin_ws/src/pcl/common/include/pcl/ros/register_point_struct.h:121:33: note: expande/usr/local/include/boost/preprocessor/seq/for_each.hppd: 49f:r57o:m note: meaxcpraon d'ePdO IfNrTo_mC LmOaUcDr_oR E'GBIOSOTSETR__PFPI_ESLEDQ__OFFOFRS_EETA'C
H_M_I'
POINT_CLOUD_REGISTER_POINT_STRUCT(pcl::PointSurfel,
^
static const size_t value = offsetof(name, BOOST_PP_TUPLE_ELEM(3, 1, elem)); \
^
# define BOOST_PP_SEQ_FOR_EACH_M_I(r, macro, data, seq) macro(r, data, BOOST_PP_SEQ_HEAD(seq))
^
/Users/alex/ros_catkin_ws/src/pcl/common/include/pcl/ros/register_point_struct.h:121/usr/bin/../lib/clang/4.2/include/stddef.h::3362:: 24note: :e xnote: peaxnpdaend frd/Users/alex/ros_catkin_ws/src/pcl/common/include/pcl/ros/register_point_struct.he:d58 :fro3o:m mamc macror o 'note: of'POINeT_xpfCLsaentdoefO'U
D_Rd from mEGISTEacro R'POINT_#define offsetof(t, d) __builtin_offsetof(t, d)
_CFL ^
OIUELD_OD_REGISTER_POINT_STFFSET'
static const size_t value = offsetof(name, BOOST_PP_TUPLE_ELEM(3, 1, elem)); \
^
/usr/bin/../lib/clang/4.2/include/stddef.h:62R:UC24: note: expanded froTm '
macro 'offsetof'
POINT_CLOUD_REGISTER_POINT_STRUCT_I(name, \
^
#define offsetof(t, d) __builtin_offsetof(t, d)
^
In file included from /Users/alex/ros_catkin_ws/src/pcl/common/test/test_operators.cpp:/Users/alex/ros_catkin_ws/src/pcl/common/include/pcl/ros/register_point_struct.h:93:29:40:
/Users/alex/ros_catkin_ws/src/pcl/common/include/pcl/point_types.hnote: :e539x:p1a:n dwarning: eodf ffsreotm omfa corno n'oPnO-IPNOTD_ CtLyOpUeD _'RpEcGlI:S:TPEoRi_nPtOSIuNrTf_eSlT'R U[C-TW_iIn'v
alid-offsetof]
BOOST_PP_SEQ_FOR_EACH(POINT_CLOUD_REGISTER_FIELD_OFFSET, name, seq) \
^
POINT_CLOUD_REGISTER_POINT_STRUCT(pcl::PointSurfel,
^
/usr/local/include/boost/preprocessor/seq/for_each.hpp:26:67: note: expanded from macro 'BOOST_PP_SEQ_FOR_EACH'
/Users/alex/ros_catkin_ws/src/pcl/common/include/pcl/ros/register_point_struct.h:58:3: note: expanded from macro 'POINT_CLOUD_REGISTER_POINT_STRU# define BOOST_PP_SEQ_FOR_EACH(macro, data, seq) BOOST_PP_FOR((macro, data, seq (nil)), BOOST_PP_SEQ_FOR_EACH_P, BOOST_PP_SEQ_FOR_EACH_O, BOOST_PP_SEQ_FOR_EACH_M)
^
In file included from /Users/alex/ros_catkin_ws/src/pcl/common/test/test_intensity.cpp:42:
note: /Users/alex/ros_catkin_ws/src/pcl/common/include/pcl/point_types.h(skipping 37 expansions in backtrace; use -fmacro-backtrace-limit=0 to see all):
/usr/local/include/boost/preprocessor/seq/for_each.hpp:49:57: note: expanded from macro 'BOOST_PP_SEQ_FOR_EACH_M_I'
# define BOOST_PP_SEQ_FOR_EACH_M_I(r, macro, data, seq) macro(r, data, BOOST_PP_SEQ_HEAD(seq))
^
/Users/alex/ros_catkin_ws/src/pcl/common/include/pcl/ros/register_point_struct.h:539:CT'
POINT_CLOUD_REGISTER_POINT_STRUCT_I(name, \
^1: warning: 121
:/Users/alex/ros_catkin_ws/src/pcl/common/include/pcl/ros/register_point_struct.h:93offs33::29et note: eo: note: expaxfnpa doenn dnd edf roofmr om n-macPrOmacDo r'toy P'OIpeNT_CLOUD_REPOINT_GIST 'pcl::ERCPo_PLOOIUNDT__RSETRintSUCGTI_SIT'
BOOST_PP_SEQ_FOR_EACH(POINT_CLOUD_REGISTER_FIELD_OFFSET, name, seq) \
^
ER_FuIErLfDe_lO'F F[S-EWTi'n
valid-offsetof]
static const size_t value = offsetof(name, BOOST_PP_TUPLE_ELEM(3, 1, elem)); \/usr/local/include/boost/preprocessor/seq/for_each.hpp:26
: ^67
: note: expanded from macro 'BOOST_PP_SEQ_FOR_EACH'
POINT_CLOUD_REGISTER_POINT_STRUCT(pcl::PointSurfel,
^
/usr/bin/../lib/clang/4.2/include/stddef.h:# define BOOST_PP_SEQ_FOR_EACH(macro, data, seq) BOOST_PP_FOR((macro, data, seq (nil)), BOOST_PP_SEQ_FOR_EACH_P, BOOST_PP_SEQ_FOR_EACH_O, BOOST_PP_SEQ_FOR_EACH_M)
^
/Users/alex/ros_catkin_ws/src/pcl/common/include/pcl/ros/register_point_struct.hnote: (skipping 25 expansions in backtrace; use -fmacro-backtrace-limit=0 to see all)
:58:3: note: expanded from macro 'POINT_CLOUD_REGISTER_POINT_STRUCT'
/usr/local/include/boost/preprocessor/seq/for_each.hpp:49:57: note: ex62:24:p anote: nedxepda nfdreodm fmraocmr om a'cBrOoO S'To_ffsePP POINT_CLOUD_REGISTER_POINT_STRUCT_I(name, \
_ ^S
EQ_FOR_EACH_M_I'
# define BOOST_PP_SEQ_FOR_EACH_M_I(r, macro, data, seq) macro(r, data, BOOST_PP_SEQ_HEAD(seq))
^
/Users/alex/ros_catkin_ws/src/pcl/common/include/pcl/ros/register_point_struct.h:121:33:/Users/alex/ros_catkin_ws/src/pcl/common/include/pcl/ros/register_point_struct.h:93:29tof:' note: expa
nded from macr#define offsetof(t, d) __builtin_offsetof(t, d)
^
onote: 'exPOpanded from macro 'POINTINT_CLOUD_REGISTER_POINT_STRU_CLOUD_REGISTER_FICT_ELID_O'
FFSET'
BOOST_PP_SEQ_FOR_EACH(POINT_CLOUD_REGISTER_FIELD_OFFSET, name, seq) \
^
static const size_t value = offsetof(name, BOOST_PP_TUPLE_ELEM(3, 1, elem)); \
^