Skip to content

Instantly share code, notes, and snippets.

Created Apr 16, 2014
Embed
What would you like to do?
This file contains any messages produced by compilers while
running configure, to aid debugging if configure makes a mistake.
It was created by ThirdPartyMumps configure 1.4, which was
generated by GNU Autoconf 2.59. Invocation command line was
$ ../../../ThirdParty/Mumps/configure --prefix=/home/Mostafa/MyBuild/os/build --cache-file=/dev/null --srcdir=../../../ThirdParty/Mumps
## --------- ##
## Platform. ##
## --------- ##
hostname = MOSTAFA-THINK
uname -m = i686
uname -r = 1.0.17(0.48/3/2)
uname -s = MINGW32_NT-6.2
uname -v = 2011-04-24 23:39
/usr/bin/uname -p = unknown
/bin/uname -X = unknown
/bin/arch = unknown
/usr/bin/arch -k = unknown
/usr/convex/getsysinfo = unknown
hostinfo = unknown
/bin/machine = unknown
/usr/bin/oslevel = unknown
/bin/universe = unknown
PATH: .
PATH: /usr/local/bin
PATH: /mingw/bin
PATH: /bin
PATH: /c/xpressmp/bin/
PATH: /usr/home/Mostafa/MyBuild/CoinIpopt/build_64_openblas_sandybridge/bin/
PATH: /c/Program Files/Ziena/KNITRO900/knitroampl/
PATH: /c/Program Files/Ziena/KNITRO900/lib/
PATH: /c/localsolver_4_0/bin/
PATH: /c/Program Files (x86)/GnuWin32/bin/
PATH: /c/PPSwarm_v1_5/
PATH: /c/IBM/ILOG/CPLEX_Studio125/opl/bin/x64_win64/
PATH: /c/IBM/ILOG/CPLEX_Studio125/opl/oplide/
PATH: /c/IBM/ILOG/CPLEX_Studio125/cplex/bin/x64_win64/
PATH: /c/IBM/ILOG/CPLEX_Studio125/cpoptimizer/bin/x64_win64/
PATH: /c/DSATools_13_net/Vsat/bin/
PATH: /c/DSATools_13_net/TSAT/bin/
PATH: /c/GAMS/win64/24.0/
PATH: /c/GAMS/win64/24.0/gbin/
PATH: /c/program files/matlab/r2013a/runtime/win64/
PATH: /c/program files/matlab/r2013a/bin/
PATH: /c/Python27/
PATH: /c/Python27/Lib/
PATH: /c/Python27/Scripts/
PATH: /mingw/bin/
PATH: /c/Program Files (x86)/Energy Exemplar/PLEXOS 6.208/
PATH: /c/Program Files/Xpdf/bin/
PATH: /c/program files (x86)/subversion/bin/
PATH: /c/Program Files/MiKTeX 2.9/miktex/bin/x64/
PATH: /c/python27/lib/site-packages/pyqt4/
PATH: /c/condor/bin/
PATH: /c/anaconda/
PATH: /c/anaconda/scripts/
PATH: /c/Program Files (x86)/Common Files/Intel/Shared Libraries/redist/intel64/compiler
PATH: /c/Program Files (x86)/Common Files/Intel/Shared Libraries/redist/ia32/compiler
PATH: /c/program files (x86)/intel/icls client/
PATH: /c/program files/intel/icls client/
PATH: /c/WINDOWS/system32
PATH: /c/WINDOWS
PATH: /c/WINDOWS/system32/wbem
PATH: /c/WINDOWS/system32/windowspowershell/v1.0/
PATH: /c/program files/intel/intel(r) management engine components/dal
PATH: /c/program files/intel/intel(r) management engine components/ipt
PATH: /c/program files (x86)/intel/intel(r) management engine components/dal
PATH: /c/program files (x86)/intel/intel(r) management engine components/ipt
PATH: /c/program files (x86)/intel/opencl sdk/2.0/bin/x86
PATH: /c/program files (x86)/intel/opencl sdk/2.0/bin/x64
PATH: /c/programdata/lenovo/readyapps
PATH: /c/program files/microsoft/web platform installer/
PATH: /c/program files (x86)/microsoft asp.net/asp.net web pages/v1.0/
PATH: /c/program files/intel/wifi/bin
PATH: /c/program files/common files/intel/wirelesscommon/
PATH: /c/program files/thinkpad/bluetooth software/
PATH: /c/program files/thinkpad/bluetooth software/syswow64
PATH: /c/Program Files (x86)/Windows Kits/8.1/Windows Performance Toolkit/
PATH: /c/Program Files/Microsoft SQL Server/110/Tools/Binn/
PATH: /c/Program Files (x86)/QuickTime/QTSystem/
PATH: /c/WINDOWS/system32
PATH: /c/WINDOWS
PATH: /c/WINDOWS/system32/wbem
PATH: /c/WINDOWS/system32/windowspowershell/v1.0/
PATH: /c/program files/nodejs/
PATH: /c/xpressmp/bin/
PATH: /usr/home/Mostafa/MyBuild/CoinIpopt/build_64_openblas_sandybridge/bin/
PATH: /c/Program Files/Ziena/KNITRO900/knitroampl/
PATH: /c/Program Files/Ziena/KNITRO900/lib/
PATH: /c/localsolver_4_0/bin/
PATH: /c/Program Files (x86)/GnuWin32/bin/
PATH: /c/PPSwarm_v1_5/
PATH: /c/IBM/ILOG/CPLEX_Studio125/opl/bin/x64_win64/
PATH: /c/IBM/ILOG/CPLEX_Studio125/opl/oplide/
PATH: /c/IBM/ILOG/CPLEX_Studio125/cplex/bin/x64_win64/
PATH: /c/IBM/ILOG/CPLEX_Studio125/cpoptimizer/bin/x64_win64/
PATH: /c/Python27/
PATH: /c/Python27/Lib/
PATH: /c/Python27/Scripts/
PATH: /c/Program Files/TortoiseHg/
PATH: /c/opal-rt/rt-lab/v10.7.0.361/common/bin
PATH: /c/texlive/2012/bin/win32
PATH: /c/program files/intel/wifi/bin/
PATH: /c/program files/common files/intel/wirelesscommon/
PATH: /c/users/mostafa/appdata/local/enthought/canopy/user
PATH: /c/users/mostafa/appdata/local/enthought/canopy/user/scripts
PATH: /c/program files (x86)/openvpn/bin
PATH: /c/users/mostafa/appdata/roaming/npm
## ----------- ##
## Core tests. ##
## ----------- ##
configure:1676: checking for svnversion
configure:1692: found /c/program files (x86)/subversion/bin//svnversion
configure:1703: result: yes
configure:1766: checking build system type
configure:1784: result: i686-pc-mingw32
configure:1800: checking whether we want to compile in debug mode
configure:1846: result: no
configure:2105: checking for gcc
configure:2121: found /mingw/bin/gcc
configure:2131: result: gcc
configure:2152: checking for C compiler version
configure:2155: gcc --version </dev/null >&5
gcc.exe (tdm64-1) 4.7.1
Copyright (C) 2012 Free Software Foundation, Inc.
This is free software; see the source for copying conditions. There is NO
warranty; not even for MERCHANTABILITY or FITNESS FOR A PARTICULAR PURPOSE.
configure:2158: $? = 0
configure:2160: gcc -v </dev/null >&5
Using built-in specs.
COLLECT_GCC=C:\MinGW64\bin\gcc.exe
COLLECT_LTO_WRAPPER=c:/mingw64/bin/../libexec/gcc/x86_64-w64-mingw32/4.7.1/lto-wrapper.exe
Target: x86_64-w64-mingw32
Configured with: ../../src/gcc-4.7.1/configure --build=x86_64-w64-mingw32 --enable-targets=all --enable-languages=c,c++,fortran,objc,obj-c++ --enable-libgomp --enable-lto --enable-libstdcxx-debug --enable-version-specific-runtime-libs --enable-fully-dynamic-string --with-gnu-ld --disable-werror --disable-nls --disable-win32-registry --prefix=/mingw64tdm --with-local-prefix=/mingw64tdm --with-pkgversion=tdm64-1 --with-bugurl=http://tdm-gcc.tdragon.net/bugs
Thread model: win32
gcc version 4.7.1 (tdm64-1)
configure:2163: $? = 0
configure:2165: gcc -V </dev/null >&5
gcc.exe: error: unrecognized command line option '-V'
gcc.exe: fatal error: no input files
compilation terminated.
configure:2168: $? = 1
configure:2191: checking for C compiler default output file name
configure:2194: gcc conftest.c >&5
configure:2197: $? = 0
configure:2243: result: a.exe
configure:2248: checking whether the C compiler works
configure:2254: ./a.exe
configure:2257: $? = 0
configure:2274: result: yes
configure:2281: checking whether we are cross compiling
configure:2283: result: no
configure:2286: checking for suffix of executables
configure:2288: gcc -o conftest.exe conftest.c >&5
configure:2291: $? = 0
configure:2316: result: .exe
configure:2322: checking for suffix of object files
configure:2343: gcc -c conftest.c >&5
configure:2346: $? = 0
configure:2368: result: o
configure:2372: checking whether we are using the GNU C compiler
configure:2396: gcc -c conftest.c >&5
configure:2402: $? = 0
configure:2406: test -z
|| test ! -s conftest.err
configure:2409: $? = 0
configure:2412: test -s conftest.o
configure:2415: $? = 0
configure:2428: result: yes
configure:2434: checking whether gcc accepts -g
configure:2455: gcc -c -g conftest.c >&5
configure:2461: $? = 0
configure:2465: test -z
|| test ! -s conftest.err
configure:2468: $? = 0
configure:2471: test -s conftest.o
configure:2474: $? = 0
configure:2485: result: yes
configure:2502: checking for gcc option to accept ANSI C
configure:2572: gcc -c -g -O2 conftest.c >&5
configure:2578: $? = 0
configure:2582: test -z
|| test ! -s conftest.err
configure:2585: $? = 0
configure:2588: test -s conftest.o
configure:2591: $? = 0
configure:2609: result: none needed
configure:2627: gcc -c -g -O2 conftest.c >&5
conftest.c:2:3: error: unknown type name 'choke'
conftest.c:2:3: error: expected '=', ',', ';', 'asm' or '__attribute__' at end of input
configure:2633: $? = 1
configure: failed program was:
| #ifndef __cplusplus
| choke me
| #endif
configure:3114: gcc -o conftest.exe -O3 -pipe -DNDEBUG -DMUMPS_BUILD conftest.c >&5
configure:3120: $? = 0
configure:3124: test -z
|| test ! -s conftest.err
configure:3127: $? = 0
configure:3130: test -s conftest.exe
configure:3133: $? = 0
configure:3200: C compiler options are: -O3 -pipe -DNDEBUG -DMUMPS_BUILD
configure:3286: Trying to determine Fortran compiler name
configure:3335: checking for gfortran
configure:3351: found /mingw/bin/gfortran
configure:3361: result: gfortran
configure:3469: checking for Fortran 77 compiler version
configure:3472: gfortran --version </dev/null >&5
GNU Fortran (tdm64-1) 4.7.1
Copyright (C) 2012 Free Software Foundation, Inc.
GNU Fortran comes with NO WARRANTY, to the extent permitted by law.
You may redistribute copies of GNU Fortran
under the terms of the GNU General Public License.
For more information about these matters, see the file named COPYING
configure:3475: $? = 0
configure:3477: gfortran -v </dev/null >&5
Using built-in specs.
COLLECT_GCC=C:\MinGW64\bin\gfortran.exe
COLLECT_LTO_WRAPPER=c:/mingw64/bin/../libexec/gcc/x86_64-w64-mingw32/4.7.1/lto-wrapper.exe
Target: x86_64-w64-mingw32
Configured with: ../../src/gcc-4.7.1/configure --build=x86_64-w64-mingw32 --enable-targets=all --enable-languages=c,c++,fortran,objc,obj-c++ --enable-libgomp --enable-lto --enable-libstdcxx-debug --enable-version-specific-runtime-libs --enable-fully-dynamic-string --with-gnu-ld --disable-werror --disable-nls --disable-win32-registry --prefix=/mingw64tdm --with-local-prefix=/mingw64tdm --with-pkgversion=tdm64-1 --with-bugurl=http://tdm-gcc.tdragon.net/bugs
Thread model: win32
gcc version 4.7.1 (tdm64-1)
configure:3480: $? = 0
configure:3482: gfortran -V </dev/null >&5
gfortran.exe: error: unrecognized command line option '-V'
gfortran.exe: fatal error: no input files
compilation terminated.
configure:3485: $? = 1
configure:3493: checking whether we are using the GNU Fortran 77 compiler
configure:3507: gfortran -c conftest.F >&5
configure:3513: $? = 0
configure:3517: test -z
|| test ! -s conftest.err
configure:3520: $? = 0
configure:3523: test -s conftest.o
configure:3526: $? = 0
configure:3539: result: yes
configure:3545: checking whether gfortran accepts -g
configure:3557: gfortran -c -g conftest.f >&5
configure:3563: $? = 0
configure:3567: test -z
|| test ! -s conftest.err
configure:3570: $? = 0
configure:3573: test -s conftest.o
configure:3576: $? = 0
configure:3588: result: yes
configure:3870: gfortran -o conftest.exe -O3 -pipe conftest.f >&5
configure:3876: $? = 0
configure:3880: test -z
|| test ! -s conftest.err
configure:3883: $? = 0
configure:3886: test -s conftest.exe
configure:3889: $? = 0
configure:3947: Fortran compiler options are: -O3 -pipe
configure:3993: checking how to get verbose linking output from gfortran
configure:4004: gfortran -c -O3 -pipe conftest.f >&5
configure:4010: $? = 0
configure:4014: test -z
|| test ! -s conftest.err
configure:4017: $? = 0
configure:4020: test -s conftest.o
configure:4023: $? = 0
configure:4040: gfortran -o conftest.exe -O3 -pipe -v conftest.f >&5
Using built-in specs.
COLLECT_GCC=C:\MinGW64\bin\gfortran.exe
COLLECT_LTO_WRAPPER=c:/mingw64/bin/../libexec/gcc/x86_64-w64-mingw32/4.7.1/lto-wrapper.exe
Target: x86_64-w64-mingw32
Configured with: ../../src/gcc-4.7.1/configure --build=x86_64-w64-mingw32 --enable-targets=all --enable-languages=c,c++,fortran,objc,obj-c++ --enable-libgomp --enable-lto --enable-libstdcxx-debug --enable-version-specific-runtime-libs --enable-fully-dynamic-string --with-gnu-ld --disable-werror --disable-nls --disable-win32-registry --prefix=/mingw64tdm --with-local-prefix=/mingw64tdm --with-pkgversion=tdm64-1 --with-bugurl=http://tdm-gcc.tdragon.net/bugs
Thread model: win32
gcc version 4.7.1 (tdm64-1)
COLLECT_GCC_OPTIONS='-o' 'conftest.exe' '-O3' '-pipe' '-v' '-shared-libgcc' '-mtune=generic' '-march=x86-64'
c:/mingw64/bin/../libexec/gcc/x86_64-w64-mingw32/4.7.1/f951.exe conftest.f -ffixed-form -quiet -dumpbase conftest.f -mtune=generic -march=x86-64 -auxbase conftest -O3 -version -fintrinsic-modules-path c:/mingw64/bin/../lib/gcc/x86_64-w64-mingw32/4.7.1/finclude -o - |
c:/mingw64/bin/../lib/gcc/x86_64-w64-mingw32/4.7.1/../../../../x86_64-w64-mingw32/bin/as.exe -v -o C:\Users\Mostafa\AppData\Local\Temp\ccbIjt9p.o
GNU Fortran (tdm64-1) version 4.7.1 (x86_64-w64-mingw32)
compiled by GNU C version 4.7.1, GMP version 4.3.2, MPFR version 2.4.2, MPC version 0.8.2
GGC heuristics: --param ggc-min-expand=100 --param ggc-min-heapsize=131072
GNU Fortran (tdm64-1) version 4.7.1 (x86_64-w64-mingw32)
compiled by GNU C version 4.7.1, GMP version 4.3.2, MPFR version 2.4.2, MPC version 0.8.2
GGC heuristics: --param ggc-min-expand=100 --param ggc-min-heapsize=131072
GNU assembler version 2.22.90 (x86_64-w64-mingw32) using BFD version (GNU Binutils) 2.22.90.20120727
Reading specs from c:/mingw64/bin/../lib/gcc/x86_64-w64-mingw32/4.7.1/libgfortran.spec
rename spec lib to liborig
COLLECT_GCC_OPTIONS='-o' 'conftest.exe' '-O3' '-pipe' '-v' '-shared-libgcc' '-mtune=generic' '-march=x86-64'
COMPILER_PATH=c:/mingw64/bin/../libexec/gcc/x86_64-w64-mingw32/4.7.1/;c:/mingw64/bin/../libexec/gcc/;c:/mingw64/bin/../lib/gcc/x86_64-w64-mingw32/4.7.1/../../../../x86_64-w64-mingw32/bin/
LIBRARY_PATH=c:/mingw64/bin/../lib/gcc/x86_64-w64-mingw32/4.7.1/;c:/mingw64/bin/../lib/gcc/;c:/mingw64/bin/../lib/gcc/x86_64-w64-mingw32/4.7.1/../../../../x86_64-w64-mingw32/lib/../lib/;c:/mingw64/bin/../lib/gcc/x86_64-w64-mingw32/4.7.1/../../../../lib/;c:/mingw64/bin/../lib/gcc/x86_64-w64-mingw32/4.7.1/../../../../x86_64-w64-mingw32/lib/;c:/mingw64/bin/../lib/gcc/x86_64-w64-mingw32/4.7.1/../../../
COLLECT_GCC_OPTIONS='-o' 'conftest.exe' '-O3' '-pipe' '-v' '-shared-libgcc' '-mtune=generic' '-march=x86-64'
c:/mingw64/bin/../libexec/gcc/x86_64-w64-mingw32/4.7.1/collect2.exe -m i386pep -Bdynamic -o conftest.exe c:/mingw64/bin/../lib/gcc/x86_64-w64-mingw32/4.7.1/../../../../x86_64-w64-mingw32/lib/../lib/crt2.o c:/mingw64/bin/../lib/gcc/x86_64-w64-mingw32/4.7.1/../../../../x86_64-w64-mingw32/lib/../lib/crtbegin.o -Lc:/mingw64/bin/../lib/gcc/x86_64-w64-mingw32/4.7.1 -Lc:/mingw64/bin/../lib/gcc -Lc:/mingw64/bin/../lib/gcc/x86_64-w64-mingw32/4.7.1/../../../../x86_64-w64-mingw32/lib/../lib -Lc:/mingw64/bin/../lib/gcc/x86_64-w64-mingw32/4.7.1/../../../../lib -Lc:/mingw64/bin/../lib/gcc/x86_64-w64-mingw32/4.7.1/../../../../x86_64-w64-mingw32/lib -Lc:/mingw64/bin/../lib/gcc/x86_64-w64-mingw32/4.7.1/../../.. C:\Users\Mostafa\AppData\Local\Temp\ccbIjt9p.o -lgfortran -lmingw32 -lgcc_s -lgcc -lmoldname -lmingwex -lmsvcrt -lquadmath -lm -lmingw32 -lgcc_s -lgcc -lmoldname -lmingwex -lmsvcrt -ladvapi32 -lshell32 -luser32 -lkernel32 -lmingw32 -lgcc_s -lgcc -lmoldname -lmingwex -lmsvcrt c:/mingw64/bin/../lib/gcc/x86_64-w64-mingw32/4.7.1/../../../../x86_64-w64-mingw32/lib/../lib/crtend.o
configure:4095: result: -v
configure:4097: checking for Fortran libraries of gfortran
configure:4118: gfortran -o conftest.exe -O3 -pipe -v conftest.f >&5
Using built-in specs.
COLLECT_GCC=C:\MinGW64\bin\gfortran.exe
COLLECT_LTO_WRAPPER=c:/mingw64/bin/../libexec/gcc/x86_64-w64-mingw32/4.7.1/lto-wrapper.exe
Target: x86_64-w64-mingw32
Configured with: ../../src/gcc-4.7.1/configure --build=x86_64-w64-mingw32 --enable-targets=all --enable-languages=c,c++,fortran,objc,obj-c++ --enable-libgomp --enable-lto --enable-libstdcxx-debug --enable-version-specific-runtime-libs --enable-fully-dynamic-string --with-gnu-ld --disable-werror --disable-nls --disable-win32-registry --prefix=/mingw64tdm --with-local-prefix=/mingw64tdm --with-pkgversion=tdm64-1 --with-bugurl=http://tdm-gcc.tdragon.net/bugs
Thread model: win32
gcc version 4.7.1 (tdm64-1)
COLLECT_GCC_OPTIONS='-o' 'conftest.exe' '-O3' '-pipe' '-v' '-shared-libgcc' '-mtune=generic' '-march=x86-64'
c:/mingw64/bin/../libexec/gcc/x86_64-w64-mingw32/4.7.1/f951.exe conftest.f -ffixed-form -quiet -dumpbase conftest.f -mtune=generic -march=x86-64 -auxbase conftest -O3 -version -fintrinsic-modules-path c:/mingw64/bin/../lib/gcc/x86_64-w64-mingw32/4.7.1/finclude -o - |
c:/mingw64/bin/../lib/gcc/x86_64-w64-mingw32/4.7.1/../../../../x86_64-w64-mingw32/bin/as.exe -v -o C:\Users\Mostafa\AppData\Local\Temp\cczOyfF0.o
GNU Fortran (tdm64-1) version 4.7.1 (x86_64-w64-mingw32)
compiled by GNU C version 4.7.1, GMP version 4.3.2, MPFR version 2.4.2, MPC version 0.8.2
GGC heuristics: --param ggc-min-expand=100 --param ggc-min-heapsize=131072
GNU Fortran (tdm64-1) version 4.7.1 (x86_64-w64-mingw32)
compiled by GNU C version 4.7.1, GMP version 4.3.2, MPFR version 2.4.2, MPC version 0.8.2
GGC heuristics: --param ggc-min-expand=100 --param ggc-min-heapsize=131072
GNU assembler version 2.22.90 (x86_64-w64-mingw32) using BFD version (GNU Binutils) 2.22.90.20120727
Reading specs from c:/mingw64/bin/../lib/gcc/x86_64-w64-mingw32/4.7.1/libgfortran.spec
rename spec lib to liborig
COLLECT_GCC_OPTIONS='-o' 'conftest.exe' '-O3' '-pipe' '-v' '-shared-libgcc' '-mtune=generic' '-march=x86-64'
COMPILER_PATH=c:/mingw64/bin/../libexec/gcc/x86_64-w64-mingw32/4.7.1/;c:/mingw64/bin/../libexec/gcc/;c:/mingw64/bin/../lib/gcc/x86_64-w64-mingw32/4.7.1/../../../../x86_64-w64-mingw32/bin/
LIBRARY_PATH=c:/mingw64/bin/../lib/gcc/x86_64-w64-mingw32/4.7.1/;c:/mingw64/bin/../lib/gcc/;c:/mingw64/bin/../lib/gcc/x86_64-w64-mingw32/4.7.1/../../../../x86_64-w64-mingw32/lib/../lib/;c:/mingw64/bin/../lib/gcc/x86_64-w64-mingw32/4.7.1/../../../../lib/;c:/mingw64/bin/../lib/gcc/x86_64-w64-mingw32/4.7.1/../../../../x86_64-w64-mingw32/lib/;c:/mingw64/bin/../lib/gcc/x86_64-w64-mingw32/4.7.1/../../../
COLLECT_GCC_OPTIONS='-o' 'conftest.exe' '-O3' '-pipe' '-v' '-shared-libgcc' '-mtune=generic' '-march=x86-64'
c:/mingw64/bin/../libexec/gcc/x86_64-w64-mingw32/4.7.1/collect2.exe -m i386pep -Bdynamic -o conftest.exe c:/mingw64/bin/../lib/gcc/x86_64-w64-mingw32/4.7.1/../../../../x86_64-w64-mingw32/lib/../lib/crt2.o c:/mingw64/bin/../lib/gcc/x86_64-w64-mingw32/4.7.1/../../../../x86_64-w64-mingw32/lib/../lib/crtbegin.o -Lc:/mingw64/bin/../lib/gcc/x86_64-w64-mingw32/4.7.1 -Lc:/mingw64/bin/../lib/gcc -Lc:/mingw64/bin/../lib/gcc/x86_64-w64-mingw32/4.7.1/../../../../x86_64-w64-mingw32/lib/../lib -Lc:/mingw64/bin/../lib/gcc/x86_64-w64-mingw32/4.7.1/../../../../lib -Lc:/mingw64/bin/../lib/gcc/x86_64-w64-mingw32/4.7.1/../../../../x86_64-w64-mingw32/lib -Lc:/mingw64/bin/../lib/gcc/x86_64-w64-mingw32/4.7.1/../../.. C:\Users\Mostafa\AppData\Local\Temp\cczOyfF0.o -lgfortran -lmingw32 -lgcc_s -lgcc -lmoldname -lmingwex -lmsvcrt -lquadmath -lm -lmingw32 -lgcc_s -lgcc -lmoldname -lmingwex -lmsvcrt -ladvapi32 -lshell32 -luser32 -lkernel32 -lmingw32 -lgcc_s -lgcc -lmoldname -lmingwex -lmsvcrt c:/mingw64/bin/../lib/gcc/x86_64-w64-mingw32/4.7.1/../../../../x86_64-w64-mingw32/lib/../lib/crtend.o
configure:4279: result: -Lc:/mingw64/bin/../lib/gcc/x86_64-w64-mingw32/4.7.1 -Lc:/mingw64/bin/../lib/gcc -Lc:/mingw64/bin/../lib/gcc/x86_64-w64-mingw32/4.7.1/../../../../x86_64-w64-mingw32/lib/../lib -Lc:/mingw64/bin/../lib/gcc/x86_64-w64-mingw32/4.7.1/../../../../lib -Lc:/mingw64/bin/../lib/gcc/x86_64-w64-mingw32/4.7.1/../../../../x86_64-w64-mingw32/lib -Lc:/mingw64/bin/../lib/gcc/x86_64-w64-mingw32/4.7.1/../../.. -lgfortran -lmingw32 -lgcc_s -lmoldname -lmingwex -lmsvcrt -lquadmath -lm -ladvapi32 -lshell32 -luser32 -lkernel32
configure:4354: checking for dummy main to link with Fortran libraries
configure:4393: gcc -o conftest.exe -O3 -pipe -DNDEBUG -DMUMPS_BUILD conftest.c -Lc:/mingw64/bin/../lib/gcc/x86_64-w64-mingw32/4.7.1 -Lc:/mingw64/bin/../lib/gcc -Lc:/mingw64/bin/../lib/gcc/x86_64-w64-mingw32/4.7.1/../../../../x86_64-w64-mingw32/lib/../lib -Lc:/mingw64/bin/../lib/gcc/x86_64-w64-mingw32/4.7.1/../../../../lib -Lc:/mingw64/bin/../lib/gcc/x86_64-w64-mingw32/4.7.1/../../../../x86_64-w64-mingw32/lib -Lc:/mingw64/bin/../lib/gcc/x86_64-w64-mingw32/4.7.1/../../.. -lgfortran -lmingw32 -lgcc_s -lmoldname -lmingwex -lmsvcrt -lquadmath -lm -ladvapi32 -lshell32 -luser32 -lkernel32 >&5
configure:4399: $? = 0
configure:4403: test -z
|| test ! -s conftest.err
configure:4406: $? = 0
configure:4409: test -s conftest.exe
configure:4412: $? = 0
configure:4490: result: none
configure:4526: checking for Fortran name-mangling scheme
configure:4540: gfortran -c -O3 -pipe conftest.f >&5
configure:4546: $? = 0
configure:4550: test -z
|| test ! -s conftest.err
configure:4553: $? = 0
configure:4556: test -s conftest.o
configure:4559: $? = 0
configure:4606: gcc -o conftest.exe -O3 -pipe -DNDEBUG -DMUMPS_BUILD conftest.c cfortran_test.o -Lc:/mingw64/bin/../lib/gcc/x86_64-w64-mingw32/4.7.1 -Lc:/mingw64/bin/../lib/gcc -Lc:/mingw64/bin/../lib/gcc/x86_64-w64-mingw32/4.7.1/../../../../x86_64-w64-mingw32/lib/../lib -Lc:/mingw64/bin/../lib/gcc/x86_64-w64-mingw32/4.7.1/../../../../lib -Lc:/mingw64/bin/../lib/gcc/x86_64-w64-mingw32/4.7.1/../../../../x86_64-w64-mingw32/lib -Lc:/mingw64/bin/../lib/gcc/x86_64-w64-mingw32/4.7.1/../../.. -lgfortran -lmingw32 -lgcc_s -lmoldname -lmingwex -lmsvcrt -lquadmath -lm -ladvapi32 -lshell32 -luser32 -lkernel32 >&5
C:\Users\Mostafa\AppData\Local\Temp\ccfVG9a4.o:conftest.c:(.text.startup+0xa): undefined reference to `foobar'
collect2.exe: error: ld returned 1 exit status
configure:4612: $? = 1
configure: failed program was:
| /* confdefs.h. */
|
| #define PACKAGE_NAME "ThirdPartyMumps"
| #define PACKAGE_TARNAME "thirdpartymumps"
| #define PACKAGE_VERSION "1.4"
| #define PACKAGE_STRING "ThirdPartyMumps 1.4"
| #define PACKAGE_BUGREPORT "http://projects.coin-or.org/BuildTools/newticket"
| #define MUMPS_VERSION "1.4"
| #define MUMPS_VERSION_MAJOR 1
| #define MUMPS_VERSION_MINOR 4
| #define MUMPS_VERSION_RELEASE 9999
| #define COIN_MUMPS_VERBOSITY 0
| #define COIN_MUMPS_CHECKLEVEL 0
| /* end confdefs.h. */
|
| /* Override any gcc2 internal prototype to avoid an error. */
| #ifdef __cplusplus
| extern "C"
| #endif
| /* We use char because int might match the return type of a gcc2
| builtin and then its argument prototype would still apply. */
| char foobar ();
| #ifdef F77_DUMMY_MAIN
|
| # ifdef __cplusplus
| extern "C"
| # endif
| int F77_DUMMY_MAIN() { return 1; }
|
| #endif
| int
| main ()
| {
| foobar ();
| ;
| return 0;
| }
configure:4606: gcc -o conftest.exe -O3 -pipe -DNDEBUG -DMUMPS_BUILD conftest.c cfortran_test.o -Lc:/mingw64/bin/../lib/gcc/x86_64-w64-mingw32/4.7.1 -Lc:/mingw64/bin/../lib/gcc -Lc:/mingw64/bin/../lib/gcc/x86_64-w64-mingw32/4.7.1/../../../../x86_64-w64-mingw32/lib/../lib -Lc:/mingw64/bin/../lib/gcc/x86_64-w64-mingw32/4.7.1/../../../../lib -Lc:/mingw64/bin/../lib/gcc/x86_64-w64-mingw32/4.7.1/../../../../x86_64-w64-mingw32/lib -Lc:/mingw64/bin/../lib/gcc/x86_64-w64-mingw32/4.7.1/../../.. -lgfortran -lmingw32 -lgcc_s -lmoldname -lmingwex -lmsvcrt -lquadmath -lm -ladvapi32 -lshell32 -luser32 -lkernel32 >&5
configure:4612: $? = 0
configure:4616: test -z
|| test ! -s conftest.err
configure:4619: $? = 0
configure:4622: test -s conftest.exe
configure:4625: $? = 0
configure:4693: gcc -o conftest.exe -O3 -pipe -DNDEBUG -DMUMPS_BUILD conftest.c cfortran_test.o -Lc:/mingw64/bin/../lib/gcc/x86_64-w64-mingw32/4.7.1 -Lc:/mingw64/bin/../lib/gcc -Lc:/mingw64/bin/../lib/gcc/x86_64-w64-mingw32/4.7.1/../../../../x86_64-w64-mingw32/lib/../lib -Lc:/mingw64/bin/../lib/gcc/x86_64-w64-mingw32/4.7.1/../../../../lib -Lc:/mingw64/bin/../lib/gcc/x86_64-w64-mingw32/4.7.1/../../../../x86_64-w64-mingw32/lib -Lc:/mingw64/bin/../lib/gcc/x86_64-w64-mingw32/4.7.1/../../.. -lgfortran -lmingw32 -lgcc_s -lmoldname -lmingwex -lmsvcrt -lquadmath -lm -ladvapi32 -lshell32 -luser32 -lkernel32 >&5
configure:4699: $? = 0
configure:4703: test -z
|| test ! -s conftest.err
configure:4706: $? = 0
configure:4709: test -s conftest.exe
configure:4712: $? = 0
configure:4762: result: lower case, underscore, no extra underscore
configure:4920: checking how to run the C preprocessor
configure:4955: gcc -E conftest.c
configure:4961: $? = 0
configure:4993: gcc -E conftest.c
conftest.c:17:28: fatal error: ac_nonexistent.h: No such file or directory
compilation terminated.
configure:4999: $? = 1
configure: failed program was:
| /* confdefs.h. */
|
| #define PACKAGE_NAME "ThirdPartyMumps"
| #define PACKAGE_TARNAME "thirdpartymumps"
| #define PACKAGE_VERSION "1.4"
| #define PACKAGE_STRING "ThirdPartyMumps 1.4"
| #define PACKAGE_BUGREPORT "http://projects.coin-or.org/BuildTools/newticket"
| #define MUMPS_VERSION "1.4"
| #define MUMPS_VERSION_MAJOR 1
| #define MUMPS_VERSION_MINOR 4
| #define MUMPS_VERSION_RELEASE 9999
| #define COIN_MUMPS_VERBOSITY 0
| #define COIN_MUMPS_CHECKLEVEL 0
| #define F77_FUNC(name,NAME) name ## _
| #define F77_FUNC_(name,NAME) name ## _
| /* end confdefs.h. */
| #include <ac_nonexistent.h>
configure:5038: result: gcc -E
configure:5062: gcc -E conftest.c
configure:5068: $? = 0
configure:5100: gcc -E conftest.c
conftest.c:17:28: fatal error: ac_nonexistent.h: No such file or directory
compilation terminated.
configure:5106: $? = 1
configure: failed program was:
| /* confdefs.h. */
|
| #define PACKAGE_NAME "ThirdPartyMumps"
| #define PACKAGE_TARNAME "thirdpartymumps"
| #define PACKAGE_VERSION "1.4"
| #define PACKAGE_STRING "ThirdPartyMumps 1.4"
| #define PACKAGE_BUGREPORT "http://projects.coin-or.org/BuildTools/newticket"
| #define MUMPS_VERSION "1.4"
| #define MUMPS_VERSION_MAJOR 1
| #define MUMPS_VERSION_MINOR 4
| #define MUMPS_VERSION_RELEASE 9999
| #define COIN_MUMPS_VERBOSITY 0
| #define COIN_MUMPS_CHECKLEVEL 0
| #define F77_FUNC(name,NAME) name ## _
| #define F77_FUNC_(name,NAME) name ## _
| /* end confdefs.h. */
| #include <ac_nonexistent.h>
configure:5150: checking for egrep
configure:5160: result: grep -E
configure:5165: checking for ANSI C header files
configure:5198: gcc -c -O3 -pipe -DNDEBUG -DMUMPS_BUILD conftest.c >&5
configure:5204: $? = 0
configure:5208: test -z
|| test ! -s conftest.err
configure:5211: $? = 0
configure:5214: test -s conftest.o
configure:5217: $? = 0
configure:5306: gcc -o conftest.exe -O3 -pipe -DNDEBUG -DMUMPS_BUILD conftest.c >&5
conftest.c: In function 'main':
conftest.c:34:7: warning: incompatible implicit declaration of built-in function 'exit' [enabled by default]
configure:5309: $? = 0
configure:5311: ./conftest.exe
configure:5314: $? = 0
configure:5329: result: yes
configure:5353: checking for sys/types.h
configure:5369: gcc -c -O3 -pipe -DNDEBUG -DMUMPS_BUILD conftest.c >&5
configure:5375: $? = 0
configure:5379: test -z
|| test ! -s conftest.err
configure:5382: $? = 0
configure:5385: test -s conftest.o
configure:5388: $? = 0
configure:5399: result: yes
configure:5353: checking for sys/stat.h
configure:5369: gcc -c -O3 -pipe -DNDEBUG -DMUMPS_BUILD conftest.c >&5
configure:5375: $? = 0
configure:5379: test -z
|| test ! -s conftest.err
configure:5382: $? = 0
configure:5385: test -s conftest.o
configure:5388: $? = 0
configure:5399: result: yes
configure:5353: checking for stdlib.h
configure:5369: gcc -c -O3 -pipe -DNDEBUG -DMUMPS_BUILD conftest.c >&5
configure:5375: $? = 0
configure:5379: test -z
|| test ! -s conftest.err
configure:5382: $? = 0
configure:5385: test -s conftest.o
configure:5388: $? = 0
configure:5399: result: yes
configure:5353: checking for string.h
configure:5369: gcc -c -O3 -pipe -DNDEBUG -DMUMPS_BUILD conftest.c >&5
configure:5375: $? = 0
configure:5379: test -z
|| test ! -s conftest.err
configure:5382: $? = 0
configure:5385: test -s conftest.o
configure:5388: $? = 0
configure:5399: result: yes
configure:5353: checking for memory.h
configure:5369: gcc -c -O3 -pipe -DNDEBUG -DMUMPS_BUILD conftest.c >&5
configure:5375: $? = 0
configure:5379: test -z
|| test ! -s conftest.err
configure:5382: $? = 0
configure:5385: test -s conftest.o
configure:5388: $? = 0
configure:5399: result: yes
configure:5353: checking for strings.h
configure:5369: gcc -c -O3 -pipe -DNDEBUG -DMUMPS_BUILD conftest.c >&5
configure:5375: $? = 0
configure:5379: test -z
|| test ! -s conftest.err
configure:5382: $? = 0
configure:5385: test -s conftest.o
configure:5388: $? = 0
configure:5399: result: yes
configure:5353: checking for inttypes.h
configure:5369: gcc -c -O3 -pipe -DNDEBUG -DMUMPS_BUILD conftest.c >&5
configure:5375: $? = 0
configure:5379: test -z
|| test ! -s conftest.err
configure:5382: $? = 0
configure:5385: test -s conftest.o
configure:5388: $? = 0
configure:5399: result: yes
configure:5353: checking for stdint.h
configure:5369: gcc -c -O3 -pipe -DNDEBUG -DMUMPS_BUILD conftest.c >&5
configure:5375: $? = 0
configure:5379: test -z
|| test ! -s conftest.err
configure:5382: $? = 0
configure:5385: test -s conftest.o
configure:5388: $? = 0
configure:5399: result: yes
configure:5353: checking for unistd.h
configure:5369: gcc -c -O3 -pipe -DNDEBUG -DMUMPS_BUILD conftest.c >&5
configure:5375: $? = 0
configure:5379: test -z
|| test ! -s conftest.err
configure:5382: $? = 0
configure:5385: test -s conftest.o
configure:5388: $? = 0
configure:5399: result: yes
configure:5431: checking pthread.h usability
configure:5443: gcc -c -O3 -pipe -DNDEBUG -DMUMPS_BUILD conftest.c >&5
configure:5449: $? = 0
configure:5453: test -z
|| test ! -s conftest.err
configure:5456: $? = 0
configure:5459: test -s conftest.o
configure:5462: $? = 0
configure:5472: result: yes
configure:5476: checking pthread.h presence
configure:5486: gcc -E conftest.c
configure:5492: $? = 0
configure:5512: result: yes
configure:5547: checking for pthread.h
configure:5554: result: yes
configure:5572: checking for pthread_create in -lpthread
configure:5610: gcc -o conftest.exe -O3 -pipe -DNDEBUG -DMUMPS_BUILD conftest.c -lpthread >&5
configure:5616: $? = 0
configure:5620: test -z
|| test ! -s conftest.err
configure:5623: $? = 0
configure:5626: test -s conftest.exe
configure:5629: $? = 0
configure:5642: result: yes
configure:5732: checking whether ln -s works
configure:5736: result: yes
configure:5757: checking for a BSD-compatible install
configure:5812: result: /bin/install -c
configure:5823: checking whether build environment is sane
configure:5866: result: yes
configure:5931: checking for gawk
configure:5947: found /bin/gawk
configure:5957: result: gawk
configure:5967: checking whether make sets $(MAKE)
configure:5987: result: yes
configure:6017: checking for style of include used by make
configure:6045: result: GNU
configure:6226: checking dependency style of gcc
configure:6316: result: gcc3
configure:6334: checking whether to enable maintainer-specific portions of Makefiles
configure:6343: result: no
configure:21741: Using libtool script in directory ../..
configure:21792: checking if library version is set
configure:21799: result: no
configure:21865: checking for pkg-config
configure:21898: result: no
configure:24408: checking whether -lblas has BLAS
configure:24524: gcc -o conftest.exe -O3 -pipe -DNDEBUG -DMUMPS_BUILD conftest.c -lblas >&5
c:/mingw64/bin/../lib/gcc/x86_64-w64-mingw32/4.7.1/../../../../x86_64-w64-mingw32/bin/ld.exe: cannot find -lblas
collect2.exe: error: ld returned 1 exit status
configure:24530: $? = 1
configure: failed program was:
| /* confdefs.h. */
|
| #define PACKAGE_NAME "ThirdPartyMumps"
| #define PACKAGE_TARNAME "thirdpartymumps"
| #define PACKAGE_VERSION "1.4"
| #define PACKAGE_STRING "ThirdPartyMumps 1.4"
| #define PACKAGE_BUGREPORT "http://projects.coin-or.org/BuildTools/newticket"
| #define MUMPS_VERSION "1.4"
| #define MUMPS_VERSION_MAJOR 1
| #define MUMPS_VERSION_MINOR 4
| #define MUMPS_VERSION_RELEASE 9999
| #define COIN_MUMPS_VERBOSITY 0
| #define COIN_MUMPS_CHECKLEVEL 0
| #define F77_FUNC(name,NAME) name ## _
| #define F77_FUNC_(name,NAME) name ## _
| #define STDC_HEADERS 1
| #define HAVE_SYS_TYPES_H 1
| #define HAVE_SYS_STAT_H 1
| #define HAVE_STDLIB_H 1
| #define HAVE_STRING_H 1
| #define HAVE_MEMORY_H 1
| #define HAVE_STRINGS_H 1
| #define HAVE_INTTYPES_H 1
| #define HAVE_STDINT_H 1
| #define HAVE_UNISTD_H 1
| #define HAVE_PTHREAD_H 1
| #define PACKAGE "thirdpartymumps"
| #define VERSION "1.4"
| #define STDC_HEADERS 1
| #define HAVE_SYS_TYPES_H 1
| #define HAVE_SYS_STAT_H 1
| #define HAVE_STDLIB_H 1
| #define HAVE_STRING_H 1
| #define HAVE_MEMORY_H 1
| #define HAVE_STRINGS_H 1
| #define HAVE_INTTYPES_H 1
| #define HAVE_STDINT_H 1
| #define HAVE_UNISTD_H 1
| /* end confdefs.h. */
| void daxpy_();
| #ifdef F77_DUMMY_MAIN
|
| # ifdef __cplusplus
| extern "C"
| # endif
| int F77_DUMMY_MAIN() { return 1; }
|
| #endif
| int
| main ()
| {
| daxpy_()
| ;
| return 0;
| }
configure:24591: gcc -o conftest.exe -O3 -pipe -DNDEBUG -DMUMPS_BUILD conftest.c -lblas -Lc:/mingw64/bin/../lib/gcc/x86_64-w64-mingw32/4.7.1 -Lc:/mingw64/bin/../lib/gcc -Lc:/mingw64/bin/../lib/gcc/x86_64-w64-mingw32/4.7.1/../../../../x86_64-w64-mingw32/lib/../lib -Lc:/mingw64/bin/../lib/gcc/x86_64-w64-mingw32/4.7.1/../../../../lib -Lc:/mingw64/bin/../lib/gcc/x86_64-w64-mingw32/4.7.1/../../../../x86_64-w64-mingw32/lib -Lc:/mingw64/bin/../lib/gcc/x86_64-w64-mingw32/4.7.1/../../.. -lgfortran -lmingw32 -lgcc_s -lmoldname -lmingwex -lmsvcrt -lquadmath -lm -ladvapi32 -lshell32 -luser32 -lkernel32 >&5
c:/mingw64/bin/../lib/gcc/x86_64-w64-mingw32/4.7.1/../../../../x86_64-w64-mingw32/bin/ld.exe: cannot find -lblas
collect2.exe: error: ld returned 1 exit status
configure:24597: $? = 1
configure: failed program was:
| /* confdefs.h. */
|
| #define PACKAGE_NAME "ThirdPartyMumps"
| #define PACKAGE_TARNAME "thirdpartymumps"
| #define PACKAGE_VERSION "1.4"
| #define PACKAGE_STRING "ThirdPartyMumps 1.4"
| #define PACKAGE_BUGREPORT "http://projects.coin-or.org/BuildTools/newticket"
| #define MUMPS_VERSION "1.4"
| #define MUMPS_VERSION_MAJOR 1
| #define MUMPS_VERSION_MINOR 4
| #define MUMPS_VERSION_RELEASE 9999
| #define COIN_MUMPS_VERBOSITY 0
| #define COIN_MUMPS_CHECKLEVEL 0
| #define F77_FUNC(name,NAME) name ## _
| #define F77_FUNC_(name,NAME) name ## _
| #define STDC_HEADERS 1
| #define HAVE_SYS_TYPES_H 1
| #define HAVE_SYS_STAT_H 1
| #define HAVE_STDLIB_H 1
| #define HAVE_STRING_H 1
| #define HAVE_MEMORY_H 1
| #define HAVE_STRINGS_H 1
| #define HAVE_INTTYPES_H 1
| #define HAVE_STDINT_H 1
| #define HAVE_UNISTD_H 1
| #define HAVE_PTHREAD_H 1
| #define PACKAGE "thirdpartymumps"
| #define VERSION "1.4"
| #define STDC_HEADERS 1
| #define HAVE_SYS_TYPES_H 1
| #define HAVE_SYS_STAT_H 1
| #define HAVE_STDLIB_H 1
| #define HAVE_STRING_H 1
| #define HAVE_MEMORY_H 1
| #define HAVE_STRINGS_H 1
| #define HAVE_INTTYPES_H 1
| #define HAVE_STDINT_H 1
| #define HAVE_UNISTD_H 1
| /* end confdefs.h. */
| void daxpy_();
| #ifdef F77_DUMMY_MAIN
|
| # ifdef __cplusplus
| extern "C"
| # endif
| int F77_DUMMY_MAIN() { return 1; }
|
| #endif
| int
| main ()
| {
| daxpy_()
| ;
| return 0;
| }
configure:24627: result: no
configure:24812: checking for COIN-OR package Blas
configure:24995: result: skipped check via pkg-config, redirect to fallback
configure:24998: checking for COIN-OR package Blas (fallback)
configure:25194: result: yes
configure:25374: checking for COIN-OR package Metis
configure:25557: result: skipped check via pkg-config, redirect to fallback
configure:25560: checking for COIN-OR package Metis (fallback)
configure:25756: result: yes
configure:25891: checking whether we can compile Fortran 90 code
configure:25904: gfortran -c -O3 -pipe conftest.f >&5
configure:25910: $? = 0
configure:25914: test -z
|| test ! -s conftest.err
configure:25917: $? = 0
configure:25920: test -s conftest.o
configure:25923: $? = 0
configure:25933: result: yes
configure:25969: checking for additional preprocessor C flags
configure:25971: result: -DAdd_ -DALLOW_NON_INIT -DMUMPS_ARITH=MUMPS_ARITH_d -Dmetis
configure:25973: checking for additional preprocessor Fortran flags
configure:25975: result: -Dmetis
configure:25985: checking which command should be used to link input files
configure:25996: result: ln -s
configure:26270: creating ./config.status
## ---------------------- ##
## Running config.status. ##
## ---------------------- ##
This file was extended by ThirdPartyMumps config.status 1.4, which was
generated by GNU Autoconf 2.59. Invocation command line was
CONFIG_FILES =
CONFIG_HEADERS =
CONFIG_LINKS =
CONFIG_COMMANDS =
$ ./config.status
on MOSTAFA-THINK
config.status:783: creating Makefile
config.status:783: creating coinmumps.pc
config.status:783: creating coinmumps-uninstalled.pc
config.status:959: executing depfiles commands
configure:27460: In case of trouble, first consult the troubleshooting page at https://projects.coin-or.org/BuildTools/wiki/user-troubleshooting
configure:27463: Configuration of ThirdPartyMumps successful
## ---------------- ##
## Cache variables. ##
## ---------------- ##
ac_cv_build=i686-pc-mingw32
ac_cv_build_alias=i686-pc-mingw32
ac_cv_c_compiler_gnu=yes
ac_cv_env_ADD_CFLAGS_set=
ac_cv_env_ADD_CFLAGS_value=
ac_cv_env_ADD_FFLAGS_set=
ac_cv_env_ADD_FFLAGS_value=
ac_cv_env_CC_set=
ac_cv_env_CC_value=
ac_cv_env_CDEFS_set=
ac_cv_env_CDEFS_value=
ac_cv_env_CFLAGS_set=
ac_cv_env_CFLAGS_value=
ac_cv_env_CPPFLAGS_set=
ac_cv_env_CPPFLAGS_value=
ac_cv_env_CPP_set=
ac_cv_env_CPP_value=
ac_cv_env_CXXCPP_set=
ac_cv_env_CXXCPP_value=
ac_cv_env_CXXFLAGS_set=
ac_cv_env_CXXFLAGS_value=
ac_cv_env_CXX_set=
ac_cv_env_CXX_value=
ac_cv_env_DBG_CFLAGS_set=
ac_cv_env_DBG_CFLAGS_value=
ac_cv_env_DBG_FFLAGS_set=
ac_cv_env_DBG_FFLAGS_value=
ac_cv_env_F77_set=
ac_cv_env_F77_value=
ac_cv_env_FFLAGS_set=
ac_cv_env_FFLAGS_value=
ac_cv_env_LDFLAGS_set=
ac_cv_env_LDFLAGS_value=
ac_cv_env_MPICC_set=
ac_cv_env_MPICC_value=
ac_cv_env_MPIF77_set=
ac_cv_env_MPIF77_value=
ac_cv_env_OPT_CFLAGS_set=
ac_cv_env_OPT_CFLAGS_value=
ac_cv_env_OPT_FFLAGS_set=
ac_cv_env_OPT_FFLAGS_value=
ac_cv_env_PKG_CONFIG_set=
ac_cv_env_PKG_CONFIG_value=
ac_cv_env_build_alias_set=
ac_cv_env_build_alias_value=
ac_cv_env_host_alias_set=
ac_cv_env_host_alias_value=
ac_cv_env_target_alias_set=
ac_cv_env_target_alias_value=
ac_cv_exeext=.exe
ac_cv_f77_compiler_gnu=yes
ac_cv_f77_dummy_main=none
ac_cv_f77_libs=' -Lc:/mingw64/bin/../lib/gcc/x86_64-w64-mingw32/4.7.1 -Lc:/mingw64/bin/../lib/gcc -Lc:/mingw64/bin/../lib/gcc/x86_64-w64-mingw32/4.7.1/../../../../x86_64-w64-mingw32/lib/../lib -Lc:/mingw64/bin/../lib/gcc/x86_64-w64-mingw32/4.7.1/../../../../lib -Lc:/mingw64/bin/../lib/gcc/x86_64-w64-mingw32/4.7.1/../../../../x86_64-w64-mingw32/lib -Lc:/mingw64/bin/../lib/gcc/x86_64-w64-mingw32/4.7.1/../../.. -lgfortran -lmingw32 -lgcc_s -lmoldname -lmingwex -lmsvcrt -lquadmath -lm -ladvapi32 -lshell32 -luser32 -lkernel32'
ac_cv_f77_mangling='lower case, underscore, no extra underscore'
ac_cv_fortran_dummy_main=none
ac_cv_header_inttypes_h=yes
ac_cv_header_memory_h=yes
ac_cv_header_pthread_h=yes
ac_cv_header_stdc=yes
ac_cv_header_stdint_h=yes
ac_cv_header_stdlib_h=yes
ac_cv_header_string_h=yes
ac_cv_header_strings_h=yes
ac_cv_header_sys_stat_h=yes
ac_cv_header_sys_types_h=yes
ac_cv_header_unistd_h=yes
ac_cv_lib_pthread_pthread_create=yes
ac_cv_objext=o
ac_cv_path_install='/bin/install -c'
ac_cv_prog_AWK=gawk
ac_cv_prog_CPP='gcc -E'
ac_cv_prog_ac_ct_CC=gcc
ac_cv_prog_ac_ct_F77=gfortran
ac_cv_prog_cc_g=yes
ac_cv_prog_cc_stdc=
ac_cv_prog_egrep='grep -E'
ac_cv_prog_f77_g=yes
ac_cv_prog_f77_v=-v
ac_cv_prog_have_svnversion=yes
ac_cv_prog_make_make_set=yes
am_cv_CC_dependencies_compiler_type=gcc3
## ----------------- ##
## Output variables. ##
## ----------------- ##
ABSBUILDDIR='/home/Mostafa/MyBuild/os/build/ThirdParty/Mumps'
ACLOCAL='${SHELL} /home/Mostafa/MyBuild/os/ThirdParty/Mumps/missing --run aclocal-1.9'
ADD_CFLAGS=''
ADD_FFLAGS=''
ALWAYS_FALSE_FALSE=''
ALWAYS_FALSE_TRUE='#'
AMDEPBACKSLASH='\'
AMDEP_FALSE='#'
AMDEP_TRUE=''
AMTAR='${SHELL} /home/Mostafa/MyBuild/os/ThirdParty/Mumps/missing --run tar'
AR='ar'
AUTOCONF='${SHELL} /home/Mostafa/MyBuild/os/ThirdParty/Mumps/missing --run autoconf'
AUTOHEADER='${SHELL} /home/Mostafa/MyBuild/os/ThirdParty/Mumps/missing --run autoheader'
AUTOMAKE='${SHELL} /home/Mostafa/MyBuild/os/ThirdParty/Mumps/missing --run automake-1.9'
AUX_DIR=''
AWK='gawk'
BLAS_CFLAGS=' '
BLAS_CFLAGS_INSTALLED=' '
BLAS_DATA=''
BLAS_DATA_INSTALLED=''
BLAS_DEPENDENCIES=' /home/Mostafa/MyBuild/os/build/ThirdParty/Blas/libcoinblas.la '
BLAS_LIBS=' /home/Mostafa/MyBuild/os/build/ThirdParty/Blas/libcoinblas.la -Lc:/mingw64/bin/../lib/gcc/x86_64-w64-mingw32/4.7.1 -Lc:/mingw64/bin/../lib/gcc -Lc:/mingw64/bin/../lib/gcc/x86_64-w64-mingw32/4.7.1/../../../../x86_64-w64-mingw32/lib/../lib -Lc:/mingw64/bin/../lib/gcc/x86_64-w64-mingw32/4.7.1/../../../../lib -Lc:/mingw64/bin/../lib/gcc/x86_64-w64-mingw32/4.7.1/../../../../x86_64-w64-mingw32/lib -Lc:/mingw64/bin/../lib/gcc/x86_64-w64-mingw32/4.7.1/../../.. -lgfortran -lmingw32 -lmoldname -lmingwex -lmsvcrt -lquadmath -lm -ladvapi32 -lshell32 -luser32 -lkernel32 '
BLAS_LIBS_INSTALLED=' -L/home/Mostafa/MyBuild/os/build/lib -lcoinblas -Lc:/mingw64/bin/../lib/gcc/x86_64-w64-mingw32/4.7.1 -Lc:/mingw64/bin/../lib/gcc -Lc:/mingw64/bin/../lib/gcc/x86_64-w64-mingw32/4.7.1/../../../../x86_64-w64-mingw32/lib/../lib -Lc:/mingw64/bin/../lib/gcc/x86_64-w64-mingw32/4.7.1/../../../../lib -Lc:/mingw64/bin/../lib/gcc/x86_64-w64-mingw32/4.7.1/../../../../x86_64-w64-mingw32/lib -Lc:/mingw64/bin/../lib/gcc/x86_64-w64-mingw32/4.7.1/../../.. -lgfortran -lmingw32 -lmoldname -lmingwex -lmsvcrt -lquadmath -lm -ladvapi32 -lshell32 -luser32 -lkernel32 '
BUILDTOOLSDIR=''
CC='gcc'
CCDEPMODE='depmode=gcc3'
CDEFS=''
CFLAGS='-O3 -pipe -DNDEBUG -DMUMPS_BUILD'
COIN_CC_IS_CL_FALSE=''
COIN_CC_IS_CL_TRUE='#'
COIN_HAS_BLAS_FALSE='#'
COIN_HAS_BLAS_TRUE=''
COIN_HAS_METIS_FALSE='#'
COIN_HAS_METIS_TRUE=''
COIN_HAS_PKGCONFIG_FALSE=''
COIN_HAS_PKGCONFIG_TRUE='#'
COIN_PKG_CONFIG_PATH='/home/Mostafa/MyBuild/os/build/lib64/pkgconfig:/home/Mostafa/MyBuild/os/build/lib/pkgconfig:/home/Mostafa/MyBuild/os/build/share/pkgconfig:'
COIN_PKG_CONFIG_PATH_UNINSTALLED='/home/Mostafa/MyBuild/os/build/ThirdParty/Mumps:/home/Mostafa/MyBuild/os/build/ThirdParty/HSL:/home/Mostafa/MyBuild/os/build/ThirdParty/Metis:/home/Mostafa/MyBuild/os/build/ThirdParty/Glpk:/home/Mostafa/MyBuild/os/build/ThirdParty/Lapack:/home/Mostafa/MyBuild/os/build/ThirdParty/Blas:/home/Mostafa/MyBuild/os/build/ThirdParty/ASL:'
CPP='gcc -E'
CPPFLAGS=''
CXX=''
CXXCPP='g++ -E'
CXXDEPMODE=''
CXXFLAGS=''
CYGPATH_W='echo'
DBG_CFLAGS='-g -O0 -pipe '
DBG_FFLAGS='-g -O0 -pipe '
DEFS='-DPACKAGE_NAME=\"ThirdPartyMumps\" -DPACKAGE_TARNAME=\"thirdpartymumps\" -DPACKAGE_VERSION=\"1.4\" -DPACKAGE_STRING=\"ThirdPartyMumps\ 1.4\" -DPACKAGE_BUGREPORT=\"http://projects.coin-or.org/BuildTools/newticket\" -DMUMPS_VERSION=\"1.4\" -DMUMPS_VERSION_MAJOR=1 -DMUMPS_VERSION_MINOR=4 -DMUMPS_VERSION_RELEASE=9999 -DCOIN_MUMPS_VERBOSITY=0 -DCOIN_MUMPS_CHECKLEVEL=0 -DF77_FUNC\(name,NAME\)=name\ \#\#\ _ -DF77_FUNC_\(name,NAME\)=name\ \#\#\ _ -DSTDC_HEADERS=1 -DHAVE_SYS_TYPES_H=1 -DHAVE_SYS_STAT_H=1 -DHAVE_STDLIB_H=1 -DHAVE_STRING_H=1 -DHAVE_MEMORY_H=1 -DHAVE_STRINGS_H=1 -DHAVE_INTTYPES_H=1 -DHAVE_STDINT_H=1 -DHAVE_UNISTD_H=1 -DHAVE_PTHREAD_H=1 -DPACKAGE=\"thirdpartymumps\" -DVERSION=\"1.4\" -DSTDC_HEADERS=1 -DHAVE_SYS_TYPES_H=1 -DHAVE_SYS_STAT_H=1 -DHAVE_STDLIB_H=1 -DHAVE_STRING_H=1 -DHAVE_MEMORY_H=1 -DHAVE_STRINGS_H=1 -DHAVE_INTTYPES_H=1 -DHAVE_STDINT_H=1 -DHAVE_UNISTD_H=1 -DCOIN_HAS_BLAS=1 -DCOIN_HAS_BLAS=1 -DCOIN_HAS_METIS=1 -DCOIN_HAS_METIS=1 '
DEPDIR='.deps'
ECHO='echo'
ECHO_C=''
ECHO_N='-n'
ECHO_T=''
EGREP='grep -E'
EXEEXT='.exe'
F77='gfortran'
FFLAGS='-O3 -pipe '
FLIBS=' -Lc:/mingw64/bin/../lib/gcc/x86_64-w64-mingw32/4.7.1 -Lc:/mingw64/bin/../lib/gcc -Lc:/mingw64/bin/../lib/gcc/x86_64-w64-mingw32/4.7.1/../../../../x86_64-w64-mingw32/lib/../lib -Lc:/mingw64/bin/../lib/gcc/x86_64-w64-mingw32/4.7.1/../../../../lib -Lc:/mingw64/bin/../lib/gcc/x86_64-w64-mingw32/4.7.1/../../../../x86_64-w64-mingw32/lib -Lc:/mingw64/bin/../lib/gcc/x86_64-w64-mingw32/4.7.1/../../.. -lgfortran -lmingw32 -lgcc_s -lmoldname -lmingwex -lmsvcrt -lquadmath -lm -ladvapi32 -lshell32 -luser32 -lkernel32'
HAVE_EXTERNALS_FALSE=''
HAVE_EXTERNALS_TRUE='#'
INSTALL_DATA='${INSTALL} -m 644'
INSTALL_PROGRAM='${INSTALL}'
INSTALL_SCRIPT='${INSTALL}'
INSTALL_STRIP_PROGRAM='${SHELL} $(install_sh) -c -s'
LDFLAGS=''
LIBEXT='a'
LIBOBJS=''
LIBS=''
LIBTOOL='$(SHELL) $(top_builddir)/../../libtool'
LIBTOOLM4=''
LN_S='ln -s'
LTLIBOBJS=''
LT_LDFLAGS=''
MAINT='#'
MAINTAINER_MODE_FALSE=''
MAINTAINER_MODE_TRUE='#'
MAKEINFO='${SHELL} /home/Mostafa/MyBuild/os/ThirdParty/Mumps/missing --run makeinfo'
METIS_CFLAGS=' -I/home/Mostafa/MyBuild/os/ThirdParty/Metis/metis-4.0/Lib '
METIS_CFLAGS_INSTALLED=' -I/home/Mostafa/MyBuild/os/build/include/coin/ThirdParty '
METIS_DATA=''
METIS_DATA_INSTALLED=''
METIS_DEPENDENCIES=' /home/Mostafa/MyBuild/os/build/ThirdParty/Metis/libcoinmetis.la '
METIS_LIBS=' /home/Mostafa/MyBuild/os/build/ThirdParty/Metis/libcoinmetis.la '
METIS_LIBS_INSTALLED=' -L/home/Mostafa/MyBuild/os/build/lib -lcoinmetis '
MPICC=''
MPIF77=''
MUMPSDIR='MUMPS'
MUMPSOBJDIR='/home/Mostafa/MyBuild/os/build/ThirdParty/Mumps'
MUMPSSRCDIR='/home/Mostafa/MyBuild/os/ThirdParty/Mumps//MUMPS'
MUMPS_CFLAGS=' -I/home/Mostafa/MyBuild/os/ThirdParty/Metis/metis-4.0/Lib '
MUMPS_CFLAGS_INSTALLED=' -I/home/Mostafa/MyBuild/os/build/include/coin/ThirdParty '
MUMPS_DEPENDENCIES=' /home/Mostafa/MyBuild/os/build/ThirdParty/Metis/libcoinmetis.la /home/Mostafa/MyBuild/os/build/ThirdParty/Blas/libcoinblas.la '
MUMPS_LIBS=' /home/Mostafa/MyBuild/os/build/ThirdParty/Metis/libcoinmetis.la /home/Mostafa/MyBuild/os/build/ThirdParty/Blas/libcoinblas.la -Lc:/mingw64/bin/../lib/gcc/x86_64-w64-mingw32/4.7.1 -Lc:/mingw64/bin/../lib/gcc -Lc:/mingw64/bin/../lib/gcc/x86_64-w64-mingw32/4.7.1/../../../../x86_64-w64-mingw32/lib/../lib -Lc:/mingw64/bin/../lib/gcc/x86_64-w64-mingw32/4.7.1/../../../../lib -Lc:/mingw64/bin/../lib/gcc/x86_64-w64-mingw32/4.7.1/../../../../x86_64-w64-mingw32/lib -Lc:/mingw64/bin/../lib/gcc/x86_64-w64-mingw32/4.7.1/../../.. -lgfortran -lmingw32 -lmoldname -lmingwex -lmsvcrt -lquadmath -lm -ladvapi32 -lshell32 -luser32 -lkernel32 '
MUMPS_LIBS_INSTALLED=' -L/home/Mostafa/MyBuild/os/build/lib -lcoinmetis -L/home/Mostafa/MyBuild/os/build/lib -lcoinblas -Lc:/mingw64/bin/../lib/gcc/x86_64-w64-mingw32/4.7.1 -Lc:/mingw64/bin/../lib/gcc -Lc:/mingw64/bin/../lib/gcc/x86_64-w64-mingw32/4.7.1/../../../../x86_64-w64-mingw32/lib/../lib -Lc:/mingw64/bin/../lib/gcc/x86_64-w64-mingw32/4.7.1/../../../../lib -Lc:/mingw64/bin/../lib/gcc/x86_64-w64-mingw32/4.7.1/../../../../x86_64-w64-mingw32/lib -Lc:/mingw64/bin/../lib/gcc/x86_64-w64-mingw32/4.7.1/../../.. -lgfortran -lmingw32 -lmoldname -lmingwex -lmsvcrt -lquadmath -lm -ladvapi32 -lshell32 -luser32 -lkernel32 '
MUMPS_PCLIBS='-lpthread -Lc:/mingw64/bin/../lib/gcc/x86_64-w64-mingw32/4.7.1 -Lc:/mingw64/bin/../lib/gcc -Lc:/mingw64/bin/../lib/gcc/x86_64-w64-mingw32/4.7.1/../../../../x86_64-w64-mingw32/lib/../lib -Lc:/mingw64/bin/../lib/gcc/x86_64-w64-mingw32/4.7.1/../../../../lib -Lc:/mingw64/bin/../lib/gcc/x86_64-w64-mingw32/4.7.1/../../../../x86_64-w64-mingw32/lib -Lc:/mingw64/bin/../lib/gcc/x86_64-w64-mingw32/4.7.1/../../.. -lgfortran -lmingw32 -lgcc_s -lmoldname -lmingwex -lmsvcrt -lquadmath -lm -ladvapi32 -lshell32 -luser32 -lkernel32'
MUMPS_PCREQUIRES='coinmetis coinblas '
MUMPS_SVN_REV=''
MY_DEFS='-DAdd_ -DALLOW_NON_INIT -DMUMPS_ARITH=MUMPS_ARITH_d -Dmetis'
MY_FDEFS=' -Dmetis'
OBJEXT='o'
OPT_CFLAGS='-O3 -pipe -DNDEBUG '
OPT_FFLAGS='-O3 -pipe '
PACKAGE='thirdpartymumps'
PACKAGE_BUGREPORT='http://projects.coin-or.org/BuildTools/newticket'
PACKAGE_NAME='ThirdPartyMumps'
PACKAGE_STRING='ThirdPartyMumps 1.4'
PACKAGE_TARNAME='thirdpartymumps'
PACKAGE_VERSION='1.4'
PATH_SEPARATOR=':'
PKG_CONFIG=''
RANLIB='ranlib'
RPATH_FLAGS=''
SET_MAKE=''
SHELL='/bin/sh'
STRIP='strip'
VERSION='1.4'
VPATH_DISTCLEANFILES=''
abs_bin_dir='/home/Mostafa/MyBuild/os/build/bin'
abs_include_dir='/home/Mostafa/MyBuild/os/build/include'
abs_lib_dir='/home/Mostafa/MyBuild/os/build/lib'
abs_source_dir='/home/Mostafa/MyBuild/os/ThirdParty/Mumps'
ac_c_preproc_warn_flag=''
ac_ct_AR='ar'
ac_ct_CC='gcc'
ac_ct_CXX=''
ac_ct_F77='gfortran'
ac_ct_RANLIB='ranlib'
ac_ct_STRIP='strip'
ac_cxx_preproc_warn_flag=''
ac_pt_PKG_CONFIG=''
am__fastdepCC_FALSE='#'
am__fastdepCC_TRUE=''
am__fastdepCXX_FALSE='#'
am__fastdepCXX_TRUE=''
am__include='include'
am__leading_dot='.'
am__quote=''
am__tar='${AMTAR} chof - "$$tardir"'
am__untar='${AMTAR} xf -'
bindir='${exec_prefix}/bin'
build='i686-pc-mingw32'
build_alias=''
build_cpu='i686'
build_os='mingw32'
build_vendor='pc'
datadir='${prefix}/share'
exec_prefix='${prefix}'
have_autoconf=''
have_automake=''
have_svn=''
have_svnversion='yes'
host='i686-pc-mingw32'
host_alias=''
host_cpu='i686'
host_os='mingw32'
host_vendor='pc'
includedir='${prefix}/include'
infodir='${prefix}/info'
install_sh='/home/Mostafa/MyBuild/os/ThirdParty/Mumps/install-sh'
libdir='${exec_prefix}/lib'
libexecdir='${exec_prefix}/libexec'
localstatedir='${prefix}/var'
mandir='${prefix}/man'
mkdir_p='mkdir -p --'
oldincludedir='/usr/include'
prefix='/home/Mostafa/MyBuild/os/build'
program_transform_name='s,x,x,'
sbindir='${exec_prefix}/sbin'
sharedstatedir='${prefix}/com'
sol_cc_compiler=''
sysconfdir='${prefix}/etc'
target_alias=''
## ----------- ##
## confdefs.h. ##
## ----------- ##
#define COIN_HAS_BLAS 1
#define COIN_HAS_BLAS 1
#define COIN_HAS_METIS 1
#define COIN_HAS_METIS 1
#define COIN_MUMPS_CHECKLEVEL 0
#define COIN_MUMPS_VERBOSITY 0
#define F77_FUNC(name,NAME) name ## _
#define F77_FUNC_(name,NAME) name ## _
#define HAVE_INTTYPES_H 1
#define HAVE_INTTYPES_H 1
#define HAVE_MEMORY_H 1
#define HAVE_MEMORY_H 1
#define HAVE_PTHREAD_H 1
#define HAVE_STDINT_H 1
#define HAVE_STDINT_H 1
#define HAVE_STDLIB_H 1
#define HAVE_STDLIB_H 1
#define HAVE_STRINGS_H 1
#define HAVE_STRINGS_H 1
#define HAVE_STRING_H 1
#define HAVE_STRING_H 1
#define HAVE_SYS_STAT_H 1
#define HAVE_SYS_STAT_H 1
#define HAVE_SYS_TYPES_H 1
#define HAVE_SYS_TYPES_H 1
#define HAVE_UNISTD_H 1
#define HAVE_UNISTD_H 1
#define MUMPS_VERSION "1.4"
#define MUMPS_VERSION_MAJOR 1
#define MUMPS_VERSION_MINOR 4
#define MUMPS_VERSION_RELEASE 9999
#define PACKAGE "thirdpartymumps"
#define PACKAGE_BUGREPORT "http://projects.coin-or.org/BuildTools/newticket"
#define PACKAGE_NAME "ThirdPartyMumps"
#define PACKAGE_STRING "ThirdPartyMumps 1.4"
#define PACKAGE_TARNAME "thirdpartymumps"
#define PACKAGE_VERSION "1.4"
#define STDC_HEADERS 1
#define STDC_HEADERS 1
#define VERSION "1.4"
configure: exit 0
Sign up for free to join this conversation on GitHub. Already have an account? Sign in to comment