Skip to content

Instantly share code, notes, and snippets.

Created Sep 3, 2014
Embed
What would you like to do?
In file included from /Users/remirampin/Documents/programming/uvcdat/build-e03fa52b/build/VTK/ThirdParty/freetype/vtkfreetype/src/cff/cff.c:23:
In file included from /Users/remirampin/Documents/programming/uvcdat/build-e03fa52b/build/VTK/ThirdParty/freetype/vtkfreetype/src/cff/cffdrivr.c:26:
In file included from /Users/remirampin/Documents/programming/uvcdat/build-e03fa52b/build/VTK/ThirdParty/freetype/vtkfreetype/include/freetype/internal/services/svpsinfo.h:23:
/Users/remirampin/Documents/programming/uvcdat/build-e03fa52b/build/VTK/ThirdParty/freetype/vtkfreetype/include/freetype/internal/t1types.h:81:17: error: redefinition of 'T1_EncodingType_'
typedef enum T1_EncodingType_
^
/Users/remirampin/Documents/programming/uvcdat/build-e03fa52b/install/Externals/include/freetype/t1tables.h:506:17: note: previous definition is here
typedef enum T1_EncodingType_
^
In file included from /Users/remirampin/Documents/programming/uvcdat/build-e03fa52b/build/VTK/ThirdParty/freetype/vtkfreetype/src/cff/cff.c:23:
In file included from /Users/remirampin/Documents/programming/uvcdat/build-e03fa52b/build/VTK/ThirdParty/freetype/vtkfreetype/src/cff/cffdrivr.c:26:
In file included from /Users/remirampin/Documents/programming/uvcdat/build-e03fa52b/build/VTK/ThirdParty/freetype/vtkfreetype/include/freetype/internal/services/svpsinfo.h:23:
/Users/remirampin/Documents/programming/uvcdat/build-e03fa52b/build/VTK/ThirdParty/freetype/vtkfreetype/include/freetype/internal/t1types.h:83:5: error: redefinition of enumerator 'T1_ENCODING_TYPE_NONE'
T1_ENCODING_TYPE_NONE = 0,
^
/Users/remirampin/Documents/programming/uvcdat/build-e03fa52b/install/Externals/include/freetype/t1tables.h:508:5: note: previous definition is here
T1_ENCODING_TYPE_NONE = 0,
^
In file included from /Users/remirampin/Documents/programming/uvcdat/build-e03fa52b/build/VTK/ThirdParty/freetype/vtkfreetype/src/cff/cff.c:23:
In file included from /Users/remirampin/Documents/programming/uvcdat/build-e03fa52b/build/VTK/ThirdParty/freetype/vtkfreetype/src/cff/cffdrivr.c:26:
In file included from /Users/remirampin/Documents/programming/uvcdat/build-e03fa52b/build/VTK/ThirdParty/freetype/vtkfreetype/include/freetype/internal/services/svpsinfo.h:23:
/Users/remirampin/Documents/programming/uvcdat/build-e03fa52b/build/VTK/ThirdParty/freetype/vtkfreetype/include/freetype/internal/t1types.h:84:5: error: redefinition of enumerator 'T1_ENCODING_TYPE_ARRAY'
T1_ENCODING_TYPE_ARRAY,
^
/Users/remirampin/Documents/programming/uvcdat/build-e03fa52b/install/Externals/include/freetype/t1tables.h:509:5: note: previous definition is here
T1_ENCODING_TYPE_ARRAY,
^
In file included from /Users/remirampin/Documents/programming/uvcdat/build-e03fa52b/build/VTK/ThirdParty/freetype/vtkfreetype/src/cff/cff.c:23:
In file included from /Users/remirampin/Documents/programming/uvcdat/build-e03fa52b/build/VTK/ThirdParty/freetype/vtkfreetype/src/cff/cffdrivr.c:26:
In file included from /Users/remirampin/Documents/programming/uvcdat/build-e03fa52b/build/VTK/ThirdParty/freetype/vtkfreetype/include/freetype/internal/services/svpsinfo.h:23:
/Users/remirampin/Documents/programming/uvcdat/build-e03fa52b/build/VTK/ThirdParty/freetype/vtkfreetype/include/freetype/internal/t1types.h:85:5: error: redefinition of enumerator 'T1_ENCODING_TYPE_STANDARD'
T1_ENCODING_TYPE_STANDARD,
^
/Users/remirampin/Documents/programming/uvcdat/build-e03fa52b/install/Externals/include/freetype/t1tables.h:510:5: note: previous definition is here
T1_ENCODING_TYPE_STANDARD,
^
In file included from /Users/remirampin/Documents/programming/uvcdat/build-e03fa52b/build/VTK/ThirdParty/freetype/vtkfreetype/src/cff/cff.c:23:
In file included from /Users/remirampin/Documents/programming/uvcdat/build-e03fa52b/build/VTK/ThirdParty/freetype/vtkfreetype/src/cff/cffdrivr.c:26:
In file included from /Users/remirampin/Documents/programming/uvcdat/build-e03fa52b/build/VTK/ThirdParty/freetype/vtkfreetype/include/freetype/internal/services/svpsinfo.h:23:
/Users/remirampin/Documents/programming/uvcdat/build-e03fa52b/build/VTK/ThirdParty/freetype/vtkfreetype/include/freetype/internal/t1types.h:86:5: error: redefinition of enumerator 'T1_ENCODING_TYPE_ISOLATIN1'
T1_ENCODING_TYPE_ISOLATIN1,
^
/Users/remirampin/Documents/programming/uvcdat/build-e03fa52b/install/Externals/include/freetype/t1tables.h:511:5: note: previous definition is here
T1_ENCODING_TYPE_ISOLATIN1,
^
In file included from /Users/remirampin/Documents/programming/uvcdat/build-e03fa52b/build/VTK/ThirdParty/freetype/vtkfreetype/src/cff/cff.c:23:
In file included from /Users/remirampin/Documents/programming/uvcdat/build-e03fa52b/build/VTK/ThirdParty/freetype/vtkfreetype/src/cff/cffdrivr.c:26:
In file included from /Users/remirampin/Documents/programming/uvcdat/build-e03fa52b/build/VTK/ThirdParty/freetype/vtkfreetype/include/freetype/internal/services/svpsinfo.h:23:
/Users/remirampin/Documents/programming/uvcdat/build-e03fa52b/build/VTK/ThirdParty/freetype/vtkfreetype/include/freetype/internal/t1types.h:87:5: error: redefinition of enumerator 'T1_ENCODING_TYPE_EXPERT'
T1_ENCODING_TYPE_EXPERT
^
/Users/remirampin/Documents/programming/uvcdat/build-e03fa52b/install/Externals/include/freetype/t1tables.h:512:5: note: previous definition is here
T1_ENCODING_TYPE_EXPERT
^
In file included from /Users/remirampin/Documents/programming/uvcdat/build-e03fa52b/build/VTK/ThirdParty/freetype/vtkfreetype/src/cff/cff.c:23:
In file included from /Users/remirampin/Documents/programming/uvcdat/build-e03fa52b/build/VTK/ThirdParty/freetype/vtkfreetype/src/cff/cffdrivr.c:26:
In file included from /Users/remirampin/Documents/programming/uvcdat/build-e03fa52b/build/VTK/ThirdParty/freetype/vtkfreetype/include/freetype/internal/services/svpsinfo.h:23:
/Users/remirampin/Documents/programming/uvcdat/build-e03fa52b/build/VTK/ThirdParty/freetype/vtkfreetype/include/freetype/internal/t1types.h:89:5: error: typedef redefinition with different types ('enum T1_EncodingType' vs 'enum T1_EncodingType_')
} T1_EncodingType;
^
/Users/remirampin/Documents/programming/uvcdat/build-e03fa52b/install/Externals/include/freetype/t1tables.h:514:5: note: previous definition is here
} T1_EncodingType;
^
7 errors generated.
make[5]: *** [ThirdParty/freetype/vtkfreetype/CMakeFiles/vtkfreetype.dir/src/cff/cff.c.o] Error 1
make[4]: *** [ThirdParty/freetype/vtkfreetype/CMakeFiles/vtkfreetype.dir/all] Error 2
make[3]: *** [all] Error 2
Sign up for free to join this conversation on GitHub. Already have an account? Sign in to comment