Skip to content

Instantly share code, notes, and snippets.

Embed
What would you like to do?
/var/log/portage/build/kde-base/dolphin-plugins-4.8.90:20120608-122258.log
 * Package: kde-base/dolphin-plugins-4.8.90
 * Repository: kde
 * Maintainer: kde@gentoo.org
 * USE: amd64 consolekit elibc_glibc git kernel_linux multilib policykit subversion test userland_GNU
 * FEATURES: compressdebug preserve-libs sandbox splitdebug test userpriv usersandbox
>>> Unpacking source...
* Unpacking parts of kdesdk-4.8.90.tar.xz to /var/tmp/portage/kde-base/dolphin-plugins-4.8.90/work ...
tar extract command failed at least partially - continuing anyway
 [ ok ]
>>> Source unpacked in /var/tmp/portage/kde-base/dolphin-plugins-4.8.90/work
>>> Preparing source in /var/tmp/portage/kde-base/dolphin-plugins-4.8.90/work/dolphin-plugins-4.8.90 ...
* Injecting library dependencies from 'libkonq' ...
 [ ok ]
>>> Source prepared.
>>> Configuring source in /var/tmp/portage/kde-base/dolphin-plugins-4.8.90/work/dolphin-plugins-4.8.90 ...
>>> Working in BUILD_DIR: "/var/tmp/portage/kde-base/dolphin-plugins-4.8.90/work/dolphin-plugins-4.8.90_build"
cmake --no-warn-unused-cli -C /var/tmp/portage/kde-base/dolphin-plugins-4.8.90/work/dolphin-plugins-4.8.90_build/gentoo_common_config.cmake -DCMAKE_INSTALL_PREFIX=/usr -DKDE4_BUILD_TESTS=OFF -DCMAKE_INSTALL_PREFIX=/usr -DSYSCONF_INSTALL_DIR=/etc -DCMAKE_BUILD_TYPE=Gentoo -DCMAKE_INSTALL_DO_STRIP=OFF -DCMAKE_USER_MAKE_RULES_OVERRIDE=/var/tmp/portage/kde-base/dolphin-plugins-4.8.90/work/dolphin-plugins-4.8.90_build/gentoo_rules.cmake /var/tmp/portage/kde-base/dolphin-plugins-4.8.90/work/dolphin-plugins-4.8.90
Not searching for unused variables given on the command line.
loading initial cache file /var/tmp/portage/kde-base/dolphin-plugins-4.8.90/work/dolphin-plugins-4.8.90_build/gentoo_common_config.cmake
-- The C compiler identification is GNU
-- The CXX compiler identification is GNU
-- Check for working C compiler: /usr/bin/x86_64-pc-linux-gnu-gcc
-- Check for working C compiler: /usr/bin/x86_64-pc-linux-gnu-gcc -- works
-- Detecting C compiler ABI info
-- Detecting C compiler ABI info - done
-- Check for working CXX compiler: /usr/bin/x86_64-pc-linux-gnu-g++
-- Check for working CXX compiler: /usr/bin/x86_64-pc-linux-gnu-g++ -- works
-- Detecting CXX compiler ABI info
-- Detecting CXX compiler ABI info - done
-- Looking for Q_WS_X11
-- Looking for Q_WS_X11 - found
-- Looking for Q_WS_WIN
-- Looking for Q_WS_WIN - not found.
-- Looking for Q_WS_QWS
-- Looking for Q_WS_QWS - not found.
-- Looking for Q_WS_MAC
-- Looking for Q_WS_MAC - not found.
-- Found Qt-Version 4.8.2 (using /usr/bin/qmake)
-- Looking for XOpenDisplay in /usr/lib64/libX11.so;/usr/lib64/libXext.so;/usr/lib64/libXft.so;/usr/lib64/libXau.so;/usr/lib64/libXdmcp.so;/usr/lib64/libXpm.so
-- Looking for XOpenDisplay in /usr/lib64/libX11.so;/usr/lib64/libXext.so;/usr/lib64/libXft.so;/usr/lib64/libXau.so;/usr/lib64/libXdmcp.so;/usr/lib64/libXpm.so - found
-- Looking for gethostbyname
-- Looking for gethostbyname - found
-- Looking for connect
-- Looking for connect - found
-- Looking for remove
-- Looking for remove - found
-- Looking for shmat
-- Looking for shmat - found
-- Looking for IceConnectionNumber in ICE
-- Looking for IceConnectionNumber in ICE - found
-- Found X11: /usr/lib64/libX11.so
-- Looking for include files CMAKE_HAVE_PTHREAD_H
-- Looking for include files CMAKE_HAVE_PTHREAD_H - found
-- Looking for pthread_create in pthreads
-- Looking for pthread_create in pthreads - not found
-- Looking for pthread_create in pthread
-- Looking for pthread_create in pthread - found
-- Found Threads: TRUE
-- Found OpenSSL: /usr/lib64/libssl.so
-- Looking for _POSIX_TIMERS
-- Looking for _POSIX_TIMERS - found
-- Found Automoc4: /usr/bin/automoc4
-- Found Perl: /usr/bin/perl
-- Found Phonon: /usr/include
-- Performing Test _OFFT_IS_64BIT
-- Performing Test _OFFT_IS_64BIT - Success
-- Performing Test HAVE_FPIE_SUPPORT
-- Performing Test HAVE_FPIE_SUPPORT - Success
-- Performing Test __KDE_HAVE_W_OVERLOADED_VIRTUAL
-- Performing Test __KDE_HAVE_W_OVERLOADED_VIRTUAL - Success
-- Performing Test __KDE_HAVE_GCC_VISIBILITY
-- Performing Test __KDE_HAVE_GCC_VISIBILITY - Success
-- Found KDE 4.8 include dir: /usr/include
-- Found KDE 4.8 library dir: /usr/lib64
-- Found the KDE4 kconfig_compiler preprocessor: /usr/bin/kconfig_compiler
-- Found automoc4: /usr/bin/automoc4
-- Found KdepimLibs: /usr/lib64/cmake/KdepimLibs/KdepimLibsConfig.cmake
-- Found Strigi: /usr/lib64/libstreams.so
-- Found HUNSPELL: /usr/lib64/libhunspell-1.3.so
-- Performing Test LIBC_IS_GLIBC
-- Performing Test LIBC_IS_GLIBC - Success
-- Looking for ltdl.h
-- Looking for ltdl.h - found
-----------------------------------------------------------------------------
-- The following external packages were located on your system.
-- This installation will have the extra features provided by these packages.
-----------------------------------------------------------------------------
* HUNSPELL - Library used for stemming
-----------------------------------------------------------------------------
-- Congratulations! All external packages have been found.
-----------------------------------------------------------------------------
-- <<< Gentoo configuration >>>
Build type Gentoo
Install path /usr
Compiler flags:
C -march=native -O2 -pipe -ggdb -Wno-long-long -std=iso9899:1990 -Wundef -Wcast-align -Werror-implicit-function-declaration -Wchar-subscripts -Wall -W -Wpointer-arith -Wwrite-strings -Wformat-security -Wmissing-format-attribute -fno-common
C++ -march=native -O2 -pipe -ggdb -Wnon-virtual-dtor -Wno-long-long -ansi -Wundef -Wcast-align -Wchar-subscripts -Wall -W -Wpointer-arith -Wformat-security -fno-exceptions -DQT_NO_EXCEPTIONS -fno-check-new -fno-common -Woverloaded-virtual -fno-threadsafe-statics -fvisibility=hidden -Werror=return-type -fvisibility-inlines-hidden
Linker flags:
Executable -Wl,--enable-new-dtags -Wl,--as-needed -Wl,-O1 -Wl,--hash-style=gnu
Module -Wl,--enable-new-dtags -Wl,--fatal-warnings -Wl,--no-undefined -lc -Wl,--as-needed -Wl,-O1 -Wl,--hash-style=gnu
Shared -Wl,--enable-new-dtags -Wl,--fatal-warnings -Wl,--no-undefined -lc -Wl,--as-needed -Wl,-O1 -Wl,--hash-style=gnu
-- Configuring done
-- Generating done
-- Build files have been written to: /var/tmp/portage/kde-base/dolphin-plugins-4.8.90/work/dolphin-plugins-4.8.90_build
>>> Source configured.
>>> Compiling source in /var/tmp/portage/kde-base/dolphin-plugins-4.8.90/work/dolphin-plugins-4.8.90 ...
>>> Working in BUILD_DIR: "/var/tmp/portage/kde-base/dolphin-plugins-4.8.90/work/dolphin-plugins-4.8.90_build"
make -j9 VERBOSE=1
/usr/bin/cmake -H/var/tmp/portage/kde-base/dolphin-plugins-4.8.90/work/dolphin-plugins-4.8.90 -B/var/tmp/portage/kde-base/dolphin-plugins-4.8.90/work/dolphin-plugins-4.8.90_build --check-build-system CMakeFiles/Makefile.cmake 0
/usr/bin/cmake -E cmake_progress_start /var/tmp/portage/kde-base/dolphin-plugins-4.8.90/work/dolphin-plugins-4.8.90_build/CMakeFiles /var/tmp/portage/kde-base/dolphin-plugins-4.8.90/work/dolphin-plugins-4.8.90_build/CMakeFiles/progress.marks
make -f CMakeFiles/Makefile2 all
make[1]: Entering directory `/var/tmp/portage/kde-base/dolphin-plugins-4.8.90/work/dolphin-plugins-4.8.90_build'
make -f dolphin-plugins/git/CMakeFiles/fileviewgitplugin_automoc.dir/build.make dolphin-plugins/git/CMakeFiles/fileviewgitplugin_automoc.dir/depend
make -f dolphin-plugins/svn/CMakeFiles/fileviewsvnplugin_automoc.dir/build.make dolphin-plugins/svn/CMakeFiles/fileviewsvnplugin_automoc.dir/depend
make[2]: Entering directory `/var/tmp/portage/kde-base/dolphin-plugins-4.8.90/work/dolphin-plugins-4.8.90_build'
cd /var/tmp/portage/kde-base/dolphin-plugins-4.8.90/work/dolphin-plugins-4.8.90_build && /usr/bin/cmake -E cmake_depends "Unix Makefiles" /var/tmp/portage/kde-base/dolphin-plugins-4.8.90/work/dolphin-plugins-4.8.90 /var/tmp/portage/kde-base/dolphin-plugins-4.8.90/work/dolphin-plugins-4.8.90/dolphin-plugins/git /var/tmp/portage/kde-base/dolphin-plugins-4.8.90/work/dolphin-plugins-4.8.90_build /var/tmp/portage/kde-base/dolphin-plugins-4.8.90/work/dolphin-plugins-4.8.90_build/dolphin-plugins/git /var/tmp/portage/kde-base/dolphin-plugins-4.8.90/work/dolphin-plugins-4.8.90_build/dolphin-plugins/git/CMakeFiles/fileviewgitplugin_automoc.dir/DependInfo.cmake --color=
make[2]: Entering directory `/var/tmp/portage/kde-base/dolphin-plugins-4.8.90/work/dolphin-plugins-4.8.90_build'
cd /var/tmp/portage/kde-base/dolphin-plugins-4.8.90/work/dolphin-plugins-4.8.90_build && /usr/bin/cmake -E cmake_depends "Unix Makefiles" /var/tmp/portage/kde-base/dolphin-plugins-4.8.90/work/dolphin-plugins-4.8.90 /var/tmp/portage/kde-base/dolphin-plugins-4.8.90/work/dolphin-plugins-4.8.90/dolphin-plugins/svn /var/tmp/portage/kde-base/dolphin-plugins-4.8.90/work/dolphin-plugins-4.8.90_build /var/tmp/portage/kde-base/dolphin-plugins-4.8.90/work/dolphin-plugins-4.8.90_build/dolphin-plugins/svn /var/tmp/portage/kde-base/dolphin-plugins-4.8.90/work/dolphin-plugins-4.8.90_build/dolphin-plugins/svn/CMakeFiles/fileviewsvnplugin_automoc.dir/DependInfo.cmake --color=
Dependee "/var/tmp/portage/kde-base/dolphin-plugins-4.8.90/work/dolphin-plugins-4.8.90_build/dolphin-plugins/git/CMakeFiles/fileviewgitplugin_automoc.dir/DependInfo.cmake" is newer than depender "/var/tmp/portage/kde-base/dolphin-plugins-4.8.90/work/dolphin-plugins-4.8.90_build/dolphin-plugins/git/CMakeFiles/fileviewgitplugin_automoc.dir/depend.internal".
Dependee "/var/tmp/portage/kde-base/dolphin-plugins-4.8.90/work/dolphin-plugins-4.8.90_build/dolphin-plugins/git/CMakeFiles/CMakeDirectoryInformation.cmake" is newer than depender "/var/tmp/portage/kde-base/dolphin-plugins-4.8.90/work/dolphin-plugins-4.8.90_build/dolphin-plugins/git/CMakeFiles/fileviewgitplugin_automoc.dir/depend.internal".
Scanning dependencies of target fileviewgitplugin_automoc
Dependee "/var/tmp/portage/kde-base/dolphin-plugins-4.8.90/work/dolphin-plugins-4.8.90_build/dolphin-plugins/svn/CMakeFiles/fileviewsvnplugin_automoc.dir/DependInfo.cmake" is newer than depender "/var/tmp/portage/kde-base/dolphin-plugins-4.8.90/work/dolphin-plugins-4.8.90_build/dolphin-plugins/svn/CMakeFiles/fileviewsvnplugin_automoc.dir/depend.internal".
Dependee "/var/tmp/portage/kde-base/dolphin-plugins-4.8.90/work/dolphin-plugins-4.8.90_build/dolphin-plugins/svn/CMakeFiles/CMakeDirectoryInformation.cmake" is newer than depender "/var/tmp/portage/kde-base/dolphin-plugins-4.8.90/work/dolphin-plugins-4.8.90_build/dolphin-plugins/svn/CMakeFiles/fileviewsvnplugin_automoc.dir/depend.internal".
Scanning dependencies of target fileviewsvnplugin_automoc
make[2]: Leaving directory `/var/tmp/portage/kde-base/dolphin-plugins-4.8.90/work/dolphin-plugins-4.8.90_build'
make -f dolphin-plugins/git/CMakeFiles/fileviewgitplugin_automoc.dir/build.make dolphin-plugins/git/CMakeFiles/fileviewgitplugin_automoc.dir/build
make[2]: Leaving directory `/var/tmp/portage/kde-base/dolphin-plugins-4.8.90/work/dolphin-plugins-4.8.90_build'
make -f dolphin-plugins/svn/CMakeFiles/fileviewsvnplugin_automoc.dir/build.make dolphin-plugins/svn/CMakeFiles/fileviewsvnplugin_automoc.dir/build
make[2]: Entering directory `/var/tmp/portage/kde-base/dolphin-plugins-4.8.90/work/dolphin-plugins-4.8.90_build'
make[2]: Entering directory `/var/tmp/portage/kde-base/dolphin-plugins-4.8.90/work/dolphin-plugins-4.8.90_build'
cd /var/tmp/portage/kde-base/dolphin-plugins-4.8.90/work/dolphin-plugins-4.8.90_build/dolphin-plugins/git && /usr/bin/automoc4 /var/tmp/portage/kde-base/dolphin-plugins-4.8.90/work/dolphin-plugins-4.8.90_build/dolphin-plugins/git/fileviewgitplugin_automoc.cpp /var/tmp/portage/kde-base/dolphin-plugins-4.8.90/work/dolphin-plugins-4.8.90/dolphin-plugins/git /var/tmp/portage/kde-base/dolphin-plugins-4.8.90/work/dolphin-plugins-4.8.90_build/dolphin-plugins/git /usr/bin/moc /usr/bin/cmake
cd /var/tmp/portage/kde-base/dolphin-plugins-4.8.90/work/dolphin-plugins-4.8.90_build/dolphin-plugins/svn && /usr/bin/automoc4 /var/tmp/portage/kde-base/dolphin-plugins-4.8.90/work/dolphin-plugins-4.8.90_build/dolphin-plugins/svn/fileviewsvnplugin_automoc.cpp /var/tmp/portage/kde-base/dolphin-plugins-4.8.90/work/dolphin-plugins-4.8.90/dolphin-plugins/svn /var/tmp/portage/kde-base/dolphin-plugins-4.8.90/work/dolphin-plugins-4.8.90_build/dolphin-plugins/svn /usr/bin/moc /usr/bin/cmake
Generating /var/tmp/portage/kde-base/dolphin-plugins-4.8.90/work/dolphin-plugins-4.8.90_build/dolphin-plugins/svn/moc_fileviewsvnplugin.cpp from /var/tmp/portage/kde-base/dolphin-plugins-4.8.90/work/dolphin-plugins-4.8.90/dolphin-plugins/svn/fileviewsvnplugin.h
/usr/bin/moc -I/var/tmp/portage/kde-base/dolphin-plugins-4.8.90/work/dolphin-plugins-4.8.90_build -I/var/tmp/portage/kde-base/dolphin-plugins-4.8.90/work/dolphin-plugins-4.8.90 -I/usr/include -I/usr/include/KDE -I/usr/include/qt4/QtXmlPatterns -I/usr/include/qt4/QtXml -I/usr/include/qt4/QtWebKit -I/usr/include/qt4/QtUiTools -I/usr/include/qt4/QtTest -I/usr/include/qt4/QtSvg -I/usr/include/qt4/QtSql -I/usr/include/qt4/QtScriptTools -I/usr/include/qt4/QtScript -I/usr/include/qt4/QtOpenGL -I/usr/include/qt4/QtNetwork -I/usr/include/qt4/QtMultimedia -I/usr/include/qt4/QtHelp -I/usr/include/qt4/QtDesigner -I/usr/include/qt4/QtDeclarative -I/usr/include/qt4/QtDBus -I/usr/include/qt4/QtAssistant -I/usr/include/qt4/Qt3Support -I/usr/include/qt4/QtGui -I/usr/include/qt4/QtCore -I/usr/include/qt4/Qt -I/usr/share/qt4/mkspecs/default -I/usr/include/qt4 -D_BSD_SOURCE -D_XOPEN_SOURCE=500 -D_BSD_SOURCE -DQT_NO_STL -DQT_NO_CAST_TO_ASCII -D_REENTRANT -DKDE_DEPRECATED_WARNINGS -DKDE4_CMAKE_TOPLEVEL_DIR_LENGTH=53 -DQT_USE_FAST_CONCATENATION -DQT_USE_FAST_OPERATOR_PLUS -o /var/tmp/portage/kde-base/dolphin-plugins-4.8.90/work/dolphin-plugins-4.8.90_build/dolphin-plugins/svn/moc_fileviewsvnplugin.cpp /var/tmp/portage/kde-base/dolphin-plugins-4.8.90/work/dolphin-plugins-4.8.90/dolphin-plugins/svn/fileviewsvnplugin.h
Generating /var/tmp/portage/kde-base/dolphin-plugins-4.8.90/work/dolphin-plugins-4.8.90_build/dolphin-plugins/git/commitdialog.moc from /var/tmp/portage/kde-base/dolphin-plugins-4.8.90/work/dolphin-plugins-4.8.90/dolphin-plugins/git/commitdialog.h
/usr/bin/moc -I/var/tmp/portage/kde-base/dolphin-plugins-4.8.90/work/dolphin-plugins-4.8.90_build -I/var/tmp/portage/kde-base/dolphin-plugins-4.8.90/work/dolphin-plugins-4.8.90 -I/usr/include -I/usr/include/KDE -I/usr/include/qt4/QtXmlPatterns -I/usr/include/qt4/QtXml -I/usr/include/qt4/QtWebKit -I/usr/include/qt4/QtUiTools -I/usr/include/qt4/QtTest -I/usr/include/qt4/QtSvg -I/usr/include/qt4/QtSql -I/usr/include/qt4/QtScriptTools -I/usr/include/qt4/QtScript -I/usr/include/qt4/QtOpenGL -I/usr/include/qt4/QtNetwork -I/usr/include/qt4/QtMultimedia -I/usr/include/qt4/QtHelp -I/usr/include/qt4/QtDesigner -I/usr/include/qt4/QtDeclarative -I/usr/include/qt4/QtDBus -I/usr/include/qt4/QtAssistant -I/usr/include/qt4/Qt3Support -I/usr/include/qt4/QtGui -I/usr/include/qt4/QtCore -I/usr/include/qt4/Qt -I/usr/share/qt4/mkspecs/default -I/usr/include/qt4 -D_BSD_SOURCE -D_XOPEN_SOURCE=500 -D_BSD_SOURCE -DQT_NO_STL -DQT_NO_CAST_TO_ASCII -D_REENTRANT -DKDE_DEPRECATED_WARNINGS -DKDE4_CMAKE_TOPLEVEL_DIR_LENGTH=53 -DQT_USE_FAST_CONCATENATION -DQT_USE_FAST_OPERATOR_PLUS -o /var/tmp/portage/kde-base/dolphin-plugins-4.8.90/work/dolphin-plugins-4.8.90_build/dolphin-plugins/git/commitdialog.moc /var/tmp/portage/kde-base/dolphin-plugins-4.8.90/work/dolphin-plugins-4.8.90/dolphin-plugins/git/commitdialog.h
Generating /var/tmp/portage/kde-base/dolphin-plugins-4.8.90/work/dolphin-plugins-4.8.90_build/dolphin-plugins/git/checkoutdialog.moc from /var/tmp/portage/kde-base/dolphin-plugins-4.8.90/work/dolphin-plugins-4.8.90/dolphin-plugins/git/checkoutdialog.h
make[2]: Leaving directory `/var/tmp/portage/kde-base/dolphin-plugins-4.8.90/work/dolphin-plugins-4.8.90_build'
/usr/bin/moc -I/var/tmp/portage/kde-base/dolphin-plugins-4.8.90/work/dolphin-plugins-4.8.90_build -I/var/tmp/portage/kde-base/dolphin-plugins-4.8.90/work/dolphin-plugins-4.8.90 -I/usr/include -I/usr/include/KDE -I/usr/include/qt4/QtXmlPatterns -I/usr/include/qt4/QtXml -I/usr/include/qt4/QtWebKit -I/usr/include/qt4/QtUiTools -I/usr/include/qt4/QtTest -I/usr/include/qt4/QtSvg -I/usr/include/qt4/QtSql -I/usr/include/qt4/QtScriptTools -I/usr/include/qt4/QtScript -I/usr/include/qt4/QtOpenGL -I/usr/include/qt4/QtNetwork -I/usr/include/qt4/QtMultimedia -I/usr/include/qt4/QtHelp -I/usr/include/qt4/QtDesigner -I/usr/include/qt4/QtDeclarative -I/usr/include/qt4/QtDBus -I/usr/include/qt4/QtAssistant -I/usr/include/qt4/Qt3Support -I/usr/include/qt4/QtGui -I/usr/include/qt4/QtCore -I/usr/include/qt4/Qt -I/usr/share/qt4/mkspecs/default -I/usr/include/qt4 -D_BSD_SOURCE -D_XOPEN_SOURCE=500 -D_BSD_SOURCE -DQT_NO_STL -DQT_NO_CAST_TO_ASCII -D_REENTRANT -DKDE_DEPRECATED_WARNINGS -DKDE4_CMAKE_TOPLEVEL_DIR_LENGTH=53 -DQT_USE_FAST_CONCATENATION -DQT_USE_FAST_OPERATOR_PLUS -o /var/tmp/portage/kde-base/dolphin-plugins-4.8.90/work/dolphin-plugins-4.8.90_build/dolphin-plugins/git/checkoutdialog.moc /var/tmp/portage/kde-base/dolphin-plugins-4.8.90/work/dolphin-plugins-4.8.90/dolphin-plugins/git/checkoutdialog.h
/usr/bin/cmake -E cmake_progress_report /var/tmp/portage/kde-base/dolphin-plugins-4.8.90/work/dolphin-plugins-4.8.90_build/CMakeFiles
[ 0%] Built target fileviewsvnplugin_automoc
make -f dolphin-plugins/svn/CMakeFiles/fileviewsvnplugin.dir/build.make dolphin-plugins/svn/CMakeFiles/fileviewsvnplugin.dir/depend
make[2]: Entering directory `/var/tmp/portage/kde-base/dolphin-plugins-4.8.90/work/dolphin-plugins-4.8.90_build'
/usr/bin/cmake -E cmake_progress_report /var/tmp/portage/kde-base/dolphin-plugins-4.8.90/work/dolphin-plugins-4.8.90_build/CMakeFiles 14
[ 7%] Generating fileviewsvnpluginsettings.h, fileviewsvnpluginsettings.cpp
cd /var/tmp/portage/kde-base/dolphin-plugins-4.8.90/work/dolphin-plugins-4.8.90_build/dolphin-plugins/svn && /usr/bin/kconfig_compiler /var/tmp/portage/kde-base/dolphin-plugins-4.8.90/work/dolphin-plugins-4.8.90/dolphin-plugins/svn/fileviewsvnpluginsettings.kcfg /var/tmp/portage/kde-base/dolphin-plugins-4.8.90/work/dolphin-plugins-4.8.90/dolphin-plugins/svn/fileviewsvnpluginsettings.kcfgc -d /var/tmp/portage/kde-base/dolphin-plugins-4.8.90/work/dolphin-plugins-4.8.90_build/dolphin-plugins/svn/
cd /var/tmp/portage/kde-base/dolphin-plugins-4.8.90/work/dolphin-plugins-4.8.90_build && /usr/bin/cmake -E cmake_depends "Unix Makefiles" /var/tmp/portage/kde-base/dolphin-plugins-4.8.90/work/dolphin-plugins-4.8.90 /var/tmp/portage/kde-base/dolphin-plugins-4.8.90/work/dolphin-plugins-4.8.90/dolphin-plugins/svn /var/tmp/portage/kde-base/dolphin-plugins-4.8.90/work/dolphin-plugins-4.8.90_build /var/tmp/portage/kde-base/dolphin-plugins-4.8.90/work/dolphin-plugins-4.8.90_build/dolphin-plugins/svn /var/tmp/portage/kde-base/dolphin-plugins-4.8.90/work/dolphin-plugins-4.8.90_build/dolphin-plugins/svn/CMakeFiles/fileviewsvnplugin.dir/DependInfo.cmake --color=
Dependee "/var/tmp/portage/kde-base/dolphin-plugins-4.8.90/work/dolphin-plugins-4.8.90_build/dolphin-plugins/svn/CMakeFiles/fileviewsvnplugin.dir/DependInfo.cmake" is newer than depender "/var/tmp/portage/kde-base/dolphin-plugins-4.8.90/work/dolphin-plugins-4.8.90_build/dolphin-plugins/svn/CMakeFiles/fileviewsvnplugin.dir/depend.internal".
Dependee "/var/tmp/portage/kde-base/dolphin-plugins-4.8.90/work/dolphin-plugins-4.8.90_build/dolphin-plugins/svn/CMakeFiles/CMakeDirectoryInformation.cmake" is newer than depender "/var/tmp/portage/kde-base/dolphin-plugins-4.8.90/work/dolphin-plugins-4.8.90_build/dolphin-plugins/svn/CMakeFiles/fileviewsvnplugin.dir/depend.internal".
Scanning dependencies of target fileviewsvnplugin
Generating /var/tmp/portage/kde-base/dolphin-plugins-4.8.90/work/dolphin-plugins-4.8.90_build/dolphin-plugins/git/fileviewgitplugin.moc from /var/tmp/portage/kde-base/dolphin-plugins-4.8.90/work/dolphin-plugins-4.8.90/dolphin-plugins/git/fileviewgitplugin.h
/usr/bin/moc -I/var/tmp/portage/kde-base/dolphin-plugins-4.8.90/work/dolphin-plugins-4.8.90_build -I/var/tmp/portage/kde-base/dolphin-plugins-4.8.90/work/dolphin-plugins-4.8.90 -I/usr/include -I/usr/include/KDE -I/usr/include/qt4/QtXmlPatterns -I/usr/include/qt4/QtXml -I/usr/include/qt4/QtWebKit -I/usr/include/qt4/QtUiTools -I/usr/include/qt4/QtTest -I/usr/include/qt4/QtSvg -I/usr/include/qt4/QtSql -I/usr/include/qt4/QtScriptTools -I/usr/include/qt4/QtScript -I/usr/include/qt4/QtOpenGL -I/usr/include/qt4/QtNetwork -I/usr/include/qt4/QtMultimedia -I/usr/include/qt4/QtHelp -I/usr/include/qt4/QtDesigner -I/usr/include/qt4/QtDeclarative -I/usr/include/qt4/QtDBus -I/usr/include/qt4/QtAssistant -I/usr/include/qt4/Qt3Support -I/usr/include/qt4/QtGui -I/usr/include/qt4/QtCore -I/usr/include/qt4/Qt -I/usr/share/qt4/mkspecs/default -I/usr/include/qt4 -D_BSD_SOURCE -D_XOPEN_SOURCE=500 -D_BSD_SOURCE -DQT_NO_STL -DQT_NO_CAST_TO_ASCII -D_REENTRANT -DKDE_DEPRECATED_WARNINGS -DKDE4_CMAKE_TOPLEVEL_DIR_LENGTH=53 -DQT_USE_FAST_CONCATENATION -DQT_USE_FAST_OPERATOR_PLUS -o /var/tmp/portage/kde-base/dolphin-plugins-4.8.90/work/dolphin-plugins-4.8.90_build/dolphin-plugins/git/fileviewgitplugin.moc /var/tmp/portage/kde-base/dolphin-plugins-4.8.90/work/dolphin-plugins-4.8.90/dolphin-plugins/git/fileviewgitplugin.h
Generating /var/tmp/portage/kde-base/dolphin-plugins-4.8.90/work/dolphin-plugins-4.8.90_build/dolphin-plugins/git/tagdialog.moc from /var/tmp/portage/kde-base/dolphin-plugins-4.8.90/work/dolphin-plugins-4.8.90/dolphin-plugins/git/tagdialog.h
/usr/bin/moc -I/var/tmp/portage/kde-base/dolphin-plugins-4.8.90/work/dolphin-plugins-4.8.90_build -I/var/tmp/portage/kde-base/dolphin-plugins-4.8.90/work/dolphin-plugins-4.8.90 -I/usr/include -I/usr/include/KDE -I/usr/include/qt4/QtXmlPatterns -I/usr/include/qt4/QtXml -I/usr/include/qt4/QtWebKit -I/usr/include/qt4/QtUiTools -I/usr/include/qt4/QtTest -I/usr/include/qt4/QtSvg -I/usr/include/qt4/QtSql -I/usr/include/qt4/QtScriptTools -I/usr/include/qt4/QtScript -I/usr/include/qt4/QtOpenGL -I/usr/include/qt4/QtNetwork -I/usr/include/qt4/QtMultimedia -I/usr/include/qt4/QtHelp -I/usr/include/qt4/QtDesigner -I/usr/include/qt4/QtDeclarative -I/usr/include/qt4/QtDBus -I/usr/include/qt4/QtAssistant -I/usr/include/qt4/Qt3Support -I/usr/include/qt4/QtGui -I/usr/include/qt4/QtCore -I/usr/include/qt4/Qt -I/usr/share/qt4/mkspecs/default -I/usr/include/qt4 -D_BSD_SOURCE -D_XOPEN_SOURCE=500 -D_BSD_SOURCE -DQT_NO_STL -DQT_NO_CAST_TO_ASCII -D_REENTRANT -DKDE_DEPRECATED_WARNINGS -DKDE4_CMAKE_TOPLEVEL_DIR_LENGTH=53 -DQT_USE_FAST_CONCATENATION -DQT_USE_FAST_OPERATOR_PLUS -o /var/tmp/portage/kde-base/dolphin-plugins-4.8.90/work/dolphin-plugins-4.8.90_build/dolphin-plugins/git/tagdialog.moc /var/tmp/portage/kde-base/dolphin-plugins-4.8.90/work/dolphin-plugins-4.8.90/dolphin-plugins/git/tagdialog.h
Generating /var/tmp/portage/kde-base/dolphin-plugins-4.8.90/work/dolphin-plugins-4.8.90_build/dolphin-plugins/git/pushdialog.moc from /var/tmp/portage/kde-base/dolphin-plugins-4.8.90/work/dolphin-plugins-4.8.90/dolphin-plugins/git/pushdialog.h
/usr/bin/moc -I/var/tmp/portage/kde-base/dolphin-plugins-4.8.90/work/dolphin-plugins-4.8.90_build -I/var/tmp/portage/kde-base/dolphin-plugins-4.8.90/work/dolphin-plugins-4.8.90 -I/usr/include -I/usr/include/KDE -I/usr/include/qt4/QtXmlPatterns -I/usr/include/qt4/QtXml -I/usr/include/qt4/QtWebKit -I/usr/include/qt4/QtUiTools -I/usr/include/qt4/QtTest -I/usr/include/qt4/QtSvg -I/usr/include/qt4/QtSql -I/usr/include/qt4/QtScriptTools -I/usr/include/qt4/QtScript -I/usr/include/qt4/QtOpenGL -I/usr/include/qt4/QtNetwork -I/usr/include/qt4/QtMultimedia -I/usr/include/qt4/QtHelp -I/usr/include/qt4/QtDesigner -I/usr/include/qt4/QtDeclarative -I/usr/include/qt4/QtDBus -I/usr/include/qt4/QtAssistant -I/usr/include/qt4/Qt3Support -I/usr/include/qt4/QtGui -I/usr/include/qt4/QtCore -I/usr/include/qt4/Qt -I/usr/share/qt4/mkspecs/default -I/usr/include/qt4 -D_BSD_SOURCE -D_XOPEN_SOURCE=500 -D_BSD_SOURCE -DQT_NO_STL -DQT_NO_CAST_TO_ASCII -D_REENTRANT -DKDE_DEPRECATED_WARNINGS -DKDE4_CMAKE_TOPLEVEL_DIR_LENGTH=53 -DQT_USE_FAST_CONCATENATION -DQT_USE_FAST_OPERATOR_PLUS -o /var/tmp/portage/kde-base/dolphin-plugins-4.8.90/work/dolphin-plugins-4.8.90_build/dolphin-plugins/git/pushdialog.moc /var/tmp/portage/kde-base/dolphin-plugins-4.8.90/work/dolphin-plugins-4.8.90/dolphin-plugins/git/pushdialog.h
make[2]: Leaving directory `/var/tmp/portage/kde-base/dolphin-plugins-4.8.90/work/dolphin-plugins-4.8.90_build'
make -f dolphin-plugins/svn/CMakeFiles/fileviewsvnplugin.dir/build.make dolphin-plugins/svn/CMakeFiles/fileviewsvnplugin.dir/build
make[2]: Entering directory `/var/tmp/portage/kde-base/dolphin-plugins-4.8.90/work/dolphin-plugins-4.8.90_build'
/usr/bin/cmake -E cmake_progress_report /var/tmp/portage/kde-base/dolphin-plugins-4.8.90/work/dolphin-plugins-4.8.90_build/CMakeFiles 11
[ 14%] /usr/bin/cmake -E cmake_progress_report /var/tmp/portage/kde-base/dolphin-plugins-4.8.90/work/dolphin-plugins-4.8.90_build/CMakeFiles 12
/usr/bin/cmake -E cmake_progress_report /var/tmp/portage/kde-base/dolphin-plugins-4.8.90/work/dolphin-plugins-4.8.90_build/CMakeFiles 13
[ 21%] [ 28%] Building CXX object dolphin-plugins/svn/CMakeFiles/fileviewsvnplugin.dir/fileviewsvnplugin_automoc.o
Generating /var/tmp/portage/kde-base/dolphin-plugins-4.8.90/work/dolphin-plugins-4.8.90_build/dolphin-plugins/git/pulldialog.moc from /var/tmp/portage/kde-base/dolphin-plugins-4.8.90/work/dolphin-plugins-4.8.90/dolphin-plugins/git/pulldialog.h
/usr/bin/moc -I/var/tmp/portage/kde-base/dolphin-plugins-4.8.90/work/dolphin-plugins-4.8.90_build -I/var/tmp/portage/kde-base/dolphin-plugins-4.8.90/work/dolphin-plugins-4.8.90 -I/usr/include -I/usr/include/KDE -I/usr/include/qt4/QtXmlPatterns -I/usr/include/qt4/QtXml -I/usr/include/qt4/QtWebKit -I/usr/include/qt4/QtUiTools -I/usr/include/qt4/QtTest -I/usr/include/qt4/QtSvg -I/usr/include/qt4/QtSql -I/usr/include/qt4/QtScriptTools -I/usr/include/qt4/QtScript -I/usr/include/qt4/QtOpenGL -I/usr/include/qt4/QtNetwork -I/usr/include/qt4/QtMultimedia -I/usr/include/qt4/QtHelp -I/usr/include/qt4/QtDesigner -I/usr/include/qt4/QtDeclarative -I/usr/include/qt4/QtDBus -I/usr/include/qt4/QtAssistant -I/usr/include/qt4/Qt3Support -I/usr/include/qt4/QtGui -I/usr/include/qt4/QtCore -I/usr/include/qt4/Qt -I/usr/share/qt4/mkspecs/default -I/usr/include/qt4 -D_BSD_SOURCE -D_XOPEN_SOURCE=500 -D_BSD_SOURCE -DQT_NO_STL -DQT_NO_CAST_TO_ASCII -D_REENTRANT -DKDE_DEPRECATED_WARNINGS -DKDE4_CMAKE_TOPLEVEL_DIR_LENGTH=53 -DQT_USE_FAST_CONCATENATION -DQT_USE_FAST_OPERATOR_PLUS -o /var/tmp/portage/kde-base/dolphin-plugins-4.8.90/work/dolphin-plugins-4.8.90_build/dolphin-plugins/git/pulldialog.moc /var/tmp/portage/kde-base/dolphin-plugins-4.8.90/work/dolphin-plugins-4.8.90/dolphin-plugins/git/pulldialog.h
cd /var/tmp/portage/kde-base/dolphin-plugins-4.8.90/work/dolphin-plugins-4.8.90_build/dolphin-plugins/svn && /usr/bin/x86_64-pc-linux-gnu-g++ -DMAKE_FILEVIEWSVNPLUGIN_LIB -D_BSD_SOURCE -D_XOPEN_SOURCE=500 -D_BSD_SOURCE -DQT_NO_STL -DQT_NO_CAST_TO_ASCII -D_REENTRANT -DKDE_DEPRECATED_WARNINGS -DKDE4_CMAKE_TOPLEVEL_DIR_LENGTH=53 -DQT_USE_FAST_CONCATENATION -DQT_USE_FAST_OPERATOR_PLUS -DQT_NO_DEBUG -DNDEBUG -march=native -O2 -pipe -ggdb -Wnon-virtual-dtor -Wno-long-long -ansi -Wundef -Wcast-align -Wchar-subscripts -Wall -W -Wpointer-arith -Wformat-security -fno-exceptions -DQT_NO_EXCEPTIONS -fno-check-new -fno-common -Woverloaded-virtual -fno-threadsafe-statics -fvisibility=hidden -Werror=return-type -fvisibility-inlines-hidden -fPIC -I/var/tmp/portage/kde-base/dolphin-plugins-4.8.90/work/dolphin-plugins-4.8.90_build/dolphin-plugins/svn -I/var/tmp/portage/kde-base/dolphin-plugins-4.8.90/work/dolphin-plugins-4.8.90/dolphin-plugins/svn -I/var/tmp/portage/kde-base/dolphin-plugins-4.8.90/work/dolphin-plugins-4.8.90 -I/var/tmp/portage/kde-base/dolphin-plugins-4.8.90/work/dolphin-plugins-4.8.90_build -I/usr/include/KDE -I/usr/include/qt4/QtXmlPatterns -I/usr/include/qt4/QtXml -I/usr/include/qt4/QtWebKit -I/usr/include/qt4/QtUiTools -I/usr/include/qt4/QtTest -I/usr/include/qt4/QtSvg -I/usr/include/qt4/QtSql -I/usr/include/qt4/QtScriptTools -I/usr/include/qt4/QtScript -I/usr/include/qt4/QtOpenGL -I/usr/include/qt4/QtNetwork -I/usr/include/qt4/QtMultimedia -I/usr/include/qt4/QtHelp -I/usr/include/qt4/QtDesigner -I/usr/include/qt4/QtDeclarative -I/usr/include/qt4/QtDBus -I/usr/include/qt4/QtAssistant -I/usr/include/qt4/Qt3Support -I/usr/include/qt4/QtGui -I/usr/include/qt4/QtCore -I/usr/include/qt4/Qt -I/usr/share/qt4/mkspecs/default -I/usr/include/qt4 -D_GNU_SOURCE -D_LARGEFILE64_SOURCE -o CMakeFiles/fileviewsvnplugin.dir/fileviewsvnplugin_automoc.o -c /var/tmp/portage/kde-base/dolphin-plugins-4.8.90/work/dolphin-plugins-4.8.90_build/dolphin-plugins/svn/fileviewsvnplugin_automoc.cpp
Building CXX object dolphin-plugins/svn/CMakeFiles/fileviewsvnplugin.dir/fileviewsvnpluginsettings.o
Building CXX object dolphin-plugins/svn/CMakeFiles/fileviewsvnplugin.dir/fileviewsvnplugin.o
cd /var/tmp/portage/kde-base/dolphin-plugins-4.8.90/work/dolphin-plugins-4.8.90_build/dolphin-plugins/svn && /usr/bin/x86_64-pc-linux-gnu-g++ -DMAKE_FILEVIEWSVNPLUGIN_LIB -D_BSD_SOURCE -D_XOPEN_SOURCE=500 -D_BSD_SOURCE -DQT_NO_STL -DQT_NO_CAST_TO_ASCII -D_REENTRANT -DKDE_DEPRECATED_WARNINGS -DKDE4_CMAKE_TOPLEVEL_DIR_LENGTH=53 -DQT_USE_FAST_CONCATENATION -DQT_USE_FAST_OPERATOR_PLUS -DQT_NO_DEBUG -DNDEBUG -march=native -O2 -pipe -ggdb -Wnon-virtual-dtor -Wno-long-long -ansi -Wundef -Wcast-align -Wchar-subscripts -Wall -W -Wpointer-arith -Wformat-security -fno-exceptions -DQT_NO_EXCEPTIONS -fno-check-new -fno-common -Woverloaded-virtual -fno-threadsafe-statics -fvisibility=hidden -Werror=return-type -fvisibility-inlines-hidden -fPIC -I/var/tmp/portage/kde-base/dolphin-plugins-4.8.90/work/dolphin-plugins-4.8.90_build/dolphin-plugins/svn -I/var/tmp/portage/kde-base/dolphin-plugins-4.8.90/work/dolphin-plugins-4.8.90/dolphin-plugins/svn -I/var/tmp/portage/kde-base/dolphin-plugins-4.8.90/work/dolphin-plugins-4.8.90 -I/var/tmp/portage/kde-base/dolphin-plugins-4.8.90/work/dolphin-plugins-4.8.90_build -I/usr/include/KDE -I/usr/include/qt4/QtXmlPatterns -I/usr/include/qt4/QtXml -I/usr/include/qt4/QtWebKit -I/usr/include/qt4/QtUiTools -I/usr/include/qt4/QtTest -I/usr/include/qt4/QtSvg -I/usr/include/qt4/QtSql -I/usr/include/qt4/QtScriptTools -I/usr/include/qt4/QtScript -I/usr/include/qt4/QtOpenGL -I/usr/include/qt4/QtNetwork -I/usr/include/qt4/QtMultimedia -I/usr/include/qt4/QtHelp -I/usr/include/qt4/QtDesigner -I/usr/include/qt4/QtDeclarative -I/usr/include/qt4/QtDBus -I/usr/include/qt4/QtAssistant -I/usr/include/qt4/Qt3Support -I/usr/include/qt4/QtGui -I/usr/include/qt4/QtCore -I/usr/include/qt4/Qt -I/usr/share/qt4/mkspecs/default -I/usr/include/qt4 -D_GNU_SOURCE -D_LARGEFILE64_SOURCE -o CMakeFiles/fileviewsvnplugin.dir/fileviewsvnpluginsettings.o -c /var/tmp/portage/kde-base/dolphin-plugins-4.8.90/work/dolphin-plugins-4.8.90_build/dolphin-plugins/svn/fileviewsvnpluginsettings.cpp
cd /var/tmp/portage/kde-base/dolphin-plugins-4.8.90/work/dolphin-plugins-4.8.90_build/dolphin-plugins/svn && /usr/bin/x86_64-pc-linux-gnu-g++ -DMAKE_FILEVIEWSVNPLUGIN_LIB -D_BSD_SOURCE -D_XOPEN_SOURCE=500 -D_BSD_SOURCE -DQT_NO_STL -DQT_NO_CAST_TO_ASCII -D_REENTRANT -DKDE_DEPRECATED_WARNINGS -DKDE4_CMAKE_TOPLEVEL_DIR_LENGTH=53 -DQT_USE_FAST_CONCATENATION -DQT_USE_FAST_OPERATOR_PLUS -DQT_NO_DEBUG -DNDEBUG -march=native -O2 -pipe -ggdb -Wnon-virtual-dtor -Wno-long-long -ansi -Wundef -Wcast-align -Wchar-subscripts -Wall -W -Wpointer-arith -Wformat-security -fno-exceptions -DQT_NO_EXCEPTIONS -fno-check-new -fno-common -Woverloaded-virtual -fno-threadsafe-statics -fvisibility=hidden -Werror=return-type -fvisibility-inlines-hidden -fPIC -I/var/tmp/portage/kde-base/dolphin-plugins-4.8.90/work/dolphin-plugins-4.8.90_build/dolphin-plugins/svn -I/var/tmp/portage/kde-base/dolphin-plugins-4.8.90/work/dolphin-plugins-4.8.90/dolphin-plugins/svn -I/var/tmp/portage/kde-base/dolphin-plugins-4.8.90/work/dolphin-plugins-4.8.90 -I/var/tmp/portage/kde-base/dolphin-plugins-4.8.90/work/dolphin-plugins-4.8.90_build -I/usr/include/KDE -I/usr/include/qt4/QtXmlPatterns -I/usr/include/qt4/QtXml -I/usr/include/qt4/QtWebKit -I/usr/include/qt4/QtUiTools -I/usr/include/qt4/QtTest -I/usr/include/qt4/QtSvg -I/usr/include/qt4/QtSql -I/usr/include/qt4/QtScriptTools -I/usr/include/qt4/QtScript -I/usr/include/qt4/QtOpenGL -I/usr/include/qt4/QtNetwork -I/usr/include/qt4/QtMultimedia -I/usr/include/qt4/QtHelp -I/usr/include/qt4/QtDesigner -I/usr/include/qt4/QtDeclarative -I/usr/include/qt4/QtDBus -I/usr/include/qt4/QtAssistant -I/usr/include/qt4/Qt3Support -I/usr/include/qt4/QtGui -I/usr/include/qt4/QtCore -I/usr/include/qt4/Qt -I/usr/share/qt4/mkspecs/default -I/usr/include/qt4 -D_GNU_SOURCE -D_LARGEFILE64_SOURCE -o CMakeFiles/fileviewsvnplugin.dir/fileviewsvnplugin.o -c /var/tmp/portage/kde-base/dolphin-plugins-4.8.90/work/dolphin-plugins-4.8.90/dolphin-plugins/svn/fileviewsvnplugin.cpp
make[2]: Leaving directory `/var/tmp/portage/kde-base/dolphin-plugins-4.8.90/work/dolphin-plugins-4.8.90_build'
/usr/bin/cmake -E cmake_progress_report /var/tmp/portage/kde-base/dolphin-plugins-4.8.90/work/dolphin-plugins-4.8.90_build/CMakeFiles
[ 28%] Built target fileviewgitplugin_automoc
make -f dolphin-plugins/git/CMakeFiles/fileviewgitplugin.dir/build.make dolphin-plugins/git/CMakeFiles/fileviewgitplugin.dir/depend
make[2]: Entering directory `/var/tmp/portage/kde-base/dolphin-plugins-4.8.90/work/dolphin-plugins-4.8.90_build'
/usr/bin/cmake -E cmake_progress_report /var/tmp/portage/kde-base/dolphin-plugins-4.8.90/work/dolphin-plugins-4.8.90_build/CMakeFiles 10
[ 35%] Generating fileviewgitpluginsettings.h, fileviewgitpluginsettings.cpp
cd /var/tmp/portage/kde-base/dolphin-plugins-4.8.90/work/dolphin-plugins-4.8.90_build/dolphin-plugins/git && /usr/bin/kconfig_compiler /var/tmp/portage/kde-base/dolphin-plugins-4.8.90/work/dolphin-plugins-4.8.90/dolphin-plugins/git/fileviewgitpluginsettings.kcfg /var/tmp/portage/kde-base/dolphin-plugins-4.8.90/work/dolphin-plugins-4.8.90/dolphin-plugins/git/fileviewgitpluginsettings.kcfgc -d /var/tmp/portage/kde-base/dolphin-plugins-4.8.90/work/dolphin-plugins-4.8.90_build/dolphin-plugins/git/
cd /var/tmp/portage/kde-base/dolphin-plugins-4.8.90/work/dolphin-plugins-4.8.90_build && /usr/bin/cmake -E cmake_depends "Unix Makefiles" /var/tmp/portage/kde-base/dolphin-plugins-4.8.90/work/dolphin-plugins-4.8.90 /var/tmp/portage/kde-base/dolphin-plugins-4.8.90/work/dolphin-plugins-4.8.90/dolphin-plugins/git /var/tmp/portage/kde-base/dolphin-plugins-4.8.90/work/dolphin-plugins-4.8.90_build /var/tmp/portage/kde-base/dolphin-plugins-4.8.90/work/dolphin-plugins-4.8.90_build/dolphin-plugins/git /var/tmp/portage/kde-base/dolphin-plugins-4.8.90/work/dolphin-plugins-4.8.90_build/dolphin-plugins/git/CMakeFiles/fileviewgitplugin.dir/DependInfo.cmake --color=
Dependee "/var/tmp/portage/kde-base/dolphin-plugins-4.8.90/work/dolphin-plugins-4.8.90_build/dolphin-plugins/git/CMakeFiles/fileviewgitplugin.dir/DependInfo.cmake" is newer than depender "/var/tmp/portage/kde-base/dolphin-plugins-4.8.90/work/dolphin-plugins-4.8.90_build/dolphin-plugins/git/CMakeFiles/fileviewgitplugin.dir/depend.internal".
Dependee "/var/tmp/portage/kde-base/dolphin-plugins-4.8.90/work/dolphin-plugins-4.8.90_build/dolphin-plugins/git/CMakeFiles/CMakeDirectoryInformation.cmake" is newer than depender "/var/tmp/portage/kde-base/dolphin-plugins-4.8.90/work/dolphin-plugins-4.8.90_build/dolphin-plugins/git/CMakeFiles/fileviewgitplugin.dir/depend.internal".
Scanning dependencies of target fileviewgitplugin
make[2]: Leaving directory `/var/tmp/portage/kde-base/dolphin-plugins-4.8.90/work/dolphin-plugins-4.8.90_build'
make -f dolphin-plugins/git/CMakeFiles/fileviewgitplugin.dir/build.make dolphin-plugins/git/CMakeFiles/fileviewgitplugin.dir/build
make[2]: Entering directory `/var/tmp/portage/kde-base/dolphin-plugins-4.8.90/work/dolphin-plugins-4.8.90_build'
/usr/bin/cmake -E cmake_progress_report /var/tmp/portage/kde-base/dolphin-plugins-4.8.90/work/dolphin-plugins-4.8.90_build/CMakeFiles 1
[ 42%] /usr/bin/cmake -E cmake_progress_report /var/tmp/portage/kde-base/dolphin-plugins-4.8.90/work/dolphin-plugins-4.8.90_build/CMakeFiles 2
/usr/bin/cmake -E cmake_progress_report /var/tmp/portage/kde-base/dolphin-plugins-4.8.90/work/dolphin-plugins-4.8.90_build/CMakeFiles 3
/usr/bin/cmake -E cmake_progress_report /var/tmp/portage/kde-base/dolphin-plugins-4.8.90/work/dolphin-plugins-4.8.90_build/CMakeFiles 4
[ 50%] Building CXX object dolphin-plugins/git/CMakeFiles/fileviewgitplugin.dir/fileviewgitplugin_automoc.o
/usr/bin/cmake -E cmake_progress_report /var/tmp/portage/kde-base/dolphin-plugins-4.8.90/work/dolphin-plugins-4.8.90_build/CMakeFiles 5
[ 57%] [ 64%] cd /var/tmp/portage/kde-base/dolphin-plugins-4.8.90/work/dolphin-plugins-4.8.90_build/dolphin-plugins/git && /usr/bin/x86_64-pc-linux-gnu-g++ -DMAKE_FILEVIEWGITPLUGIN_LIB -D_BSD_SOURCE -D_XOPEN_SOURCE=500 -D_BSD_SOURCE -DQT_NO_STL -DQT_NO_CAST_TO_ASCII -D_REENTRANT -DKDE_DEPRECATED_WARNINGS -DKDE4_CMAKE_TOPLEVEL_DIR_LENGTH=53 -DQT_USE_FAST_CONCATENATION -DQT_USE_FAST_OPERATOR_PLUS -DQT_NO_DEBUG -DNDEBUG -march=native -O2 -pipe -ggdb -Wnon-virtual-dtor -Wno-long-long -ansi -Wundef -Wcast-align -Wchar-subscripts -Wall -W -Wpointer-arith -Wformat-security -fno-exceptions -DQT_NO_EXCEPTIONS -fno-check-new -fno-common -Woverloaded-virtual -fno-threadsafe-statics -fvisibility=hidden -Werror=return-type -fvisibility-inlines-hidden -fPIC -I/var/tmp/portage/kde-base/dolphin-plugins-4.8.90/work/dolphin-plugins-4.8.90_build/dolphin-plugins/git -I/var/tmp/portage/kde-base/dolphin-plugins-4.8.90/work/dolphin-plugins-4.8.90/dolphin-plugins/git -I/var/tmp/portage/kde-base/dolphin-plugins-4.8.90/work/dolphin-plugins-4.8.90 -I/var/tmp/portage/kde-base/dolphin-plugins-4.8.90/work/dolphin-plugins-4.8.90_build -I/usr/include/KDE -I/usr/include/qt4/QtXmlPatterns -I/usr/include/qt4/QtXml -I/usr/include/qt4/QtWebKit -I/usr/include/qt4/QtUiTools -I/usr/include/qt4/QtTest -I/usr/include/qt4/QtSvg -I/usr/include/qt4/QtSql -I/usr/include/qt4/QtScriptTools -I/usr/include/qt4/QtScript -I/usr/include/qt4/QtOpenGL -I/usr/include/qt4/QtNetwork -I/usr/include/qt4/QtMultimedia -I/usr/include/qt4/QtHelp -I/usr/include/qt4/QtDesigner -I/usr/include/qt4/QtDeclarative -I/usr/include/qt4/QtDBus -I/usr/include/qt4/QtAssistant -I/usr/include/qt4/Qt3Support -I/usr/include/qt4/QtGui -I/usr/include/qt4/QtCore -I/usr/include/qt4/Qt -I/usr/share/qt4/mkspecs/default -I/usr/include/qt4 -D_GNU_SOURCE -D_LARGEFILE64_SOURCE -o CMakeFiles/fileviewgitplugin.dir/fileviewgitplugin_automoc.o -c /var/tmp/portage/kde-base/dolphin-plugins-4.8.90/work/dolphin-plugins-4.8.90_build/dolphin-plugins/git/fileviewgitplugin_automoc.cpp
/usr/bin/cmake -E cmake_progress_report /var/tmp/portage/kde-base/dolphin-plugins-4.8.90/work/dolphin-plugins-4.8.90_build/CMakeFiles 6
[ 71%] Building CXX object dolphin-plugins/git/CMakeFiles/fileviewgitplugin.dir/fileviewgitplugin.o
[ 78%] cd /var/tmp/portage/kde-base/dolphin-plugins-4.8.90/work/dolphin-plugins-4.8.90_build/dolphin-plugins/git && /usr/bin/x86_64-pc-linux-gnu-g++ -DMAKE_FILEVIEWGITPLUGIN_LIB -D_BSD_SOURCE -D_XOPEN_SOURCE=500 -D_BSD_SOURCE -DQT_NO_STL -DQT_NO_CAST_TO_ASCII -D_REENTRANT -DKDE_DEPRECATED_WARNINGS -DKDE4_CMAKE_TOPLEVEL_DIR_LENGTH=53 -DQT_USE_FAST_CONCATENATION -DQT_USE_FAST_OPERATOR_PLUS -DQT_NO_DEBUG -DNDEBUG -march=native -O2 -pipe -ggdb -Wnon-virtual-dtor -Wno-long-long -ansi -Wundef -Wcast-align -Wchar-subscripts -Wall -W -Wpointer-arith -Wformat-security -fno-exceptions -DQT_NO_EXCEPTIONS -fno-check-new -fno-common -Woverloaded-virtual -fno-threadsafe-statics -fvisibility=hidden -Werror=return-type -fvisibility-inlines-hidden -fPIC -I/var/tmp/portage/kde-base/dolphin-plugins-4.8.90/work/dolphin-plugins-4.8.90_build/dolphin-plugins/git -I/var/tmp/portage/kde-base/dolphin-plugins-4.8.90/work/dolphin-plugins-4.8.90/dolphin-plugins/git -I/var/tmp/portage/kde-base/dolphin-plugins-4.8.90/work/dolphin-plugins-4.8.90 -I/var/tmp/portage/kde-base/dolphin-plugins-4.8.90/work/dolphin-plugins-4.8.90_build -I/usr/include/KDE -I/usr/include/qt4/QtXmlPatterns -I/usr/include/qt4/QtXml -I/usr/include/qt4/QtWebKit -I/usr/include/qt4/QtUiTools -I/usr/include/qt4/QtTest -I/usr/include/qt4/QtSvg -I/usr/include/qt4/QtSql -I/usr/include/qt4/QtScriptTools -I/usr/include/qt4/QtScript -I/usr/include/qt4/QtOpenGL -I/usr/include/qt4/QtNetwork -I/usr/include/qt4/QtMultimedia -I/usr/include/qt4/QtHelp -I/usr/include/qt4/QtDesigner -I/usr/include/qt4/QtDeclarative -I/usr/include/qt4/QtDBus -I/usr/include/qt4/QtAssistant -I/usr/include/qt4/Qt3Support -I/usr/include/qt4/QtGui -I/usr/include/qt4/QtCore -I/usr/include/qt4/Qt -I/usr/share/qt4/mkspecs/default -I/usr/include/qt4 -D_GNU_SOURCE -D_LARGEFILE64_SOURCE -o CMakeFiles/fileviewgitplugin.dir/fileviewgitplugin.o -c /var/tmp/portage/kde-base/dolphin-plugins-4.8.90/work/dolphin-plugins-4.8.90/dolphin-plugins/git/fileviewgitplugin.cpp
Building CXX object dolphin-plugins/git/CMakeFiles/fileviewgitplugin.dir/tagdialog.o
Building CXX object dolphin-plugins/git/CMakeFiles/fileviewgitplugin.dir/commitdialog.o
cd /var/tmp/portage/kde-base/dolphin-plugins-4.8.90/work/dolphin-plugins-4.8.90_build/dolphin-plugins/git && /usr/bin/x86_64-pc-linux-gnu-g++ -DMAKE_FILEVIEWGITPLUGIN_LIB -D_BSD_SOURCE -D_XOPEN_SOURCE=500 -D_BSD_SOURCE -DQT_NO_STL -DQT_NO_CAST_TO_ASCII -D_REENTRANT -DKDE_DEPRECATED_WARNINGS -DKDE4_CMAKE_TOPLEVEL_DIR_LENGTH=53 -DQT_USE_FAST_CONCATENATION -DQT_USE_FAST_OPERATOR_PLUS -DQT_NO_DEBUG -DNDEBUG -march=native -O2 -pipe -ggdb -Wnon-virtual-dtor -Wno-long-long -ansi -Wundef -Wcast-align -Wchar-subscripts -Wall -W -Wpointer-arith -Wformat-security -fno-exceptions -DQT_NO_EXCEPTIONS -fno-check-new -fno-common -Woverloaded-virtual -fno-threadsafe-statics -fvisibility=hidden -Werror=return-type -fvisibility-inlines-hidden -fPIC -I/var/tmp/portage/kde-base/dolphin-plugins-4.8.90/work/dolphin-plugins-4.8.90_build/dolphin-plugins/git -I/var/tmp/portage/kde-base/dolphin-plugins-4.8.90/work/dolphin-plugins-4.8.90/dolphin-plugins/git -I/var/tmp/portage/kde-base/dolphin-plugins-4.8.90/work/dolphin-plugins-4.8.90 -I/var/tmp/portage/kde-base/dolphin-plugins-4.8.90/work/dolphin-plugins-4.8.90_build -I/usr/include/KDE -I/usr/include/qt4/QtXmlPatterns -I/usr/include/qt4/QtXml -I/usr/include/qt4/QtWebKit -I/usr/include/qt4/QtUiTools -I/usr/include/qt4/QtTest -I/usr/include/qt4/QtSvg -I/usr/include/qt4/QtSql -I/usr/include/qt4/QtScriptTools -I/usr/include/qt4/QtScript -I/usr/include/qt4/QtOpenGL -I/usr/include/qt4/QtNetwork -I/usr/include/qt4/QtMultimedia -I/usr/include/qt4/QtHelp -I/usr/include/qt4/QtDesigner -I/usr/include/qt4/QtDeclarative -I/usr/include/qt4/QtDBus -I/usr/include/qt4/QtAssistant -I/usr/include/qt4/Qt3Support -I/usr/include/qt4/QtGui -I/usr/include/qt4/QtCore -I/usr/include/qt4/Qt -I/usr/share/qt4/mkspecs/default -I/usr/include/qt4 -D_GNU_SOURCE -D_LARGEFILE64_SOURCE -o CMakeFiles/fileviewgitplugin.dir/commitdialog.o -c /var/tmp/portage/kde-base/dolphin-plugins-4.8.90/work/dolphin-plugins-4.8.90/dolphin-plugins/git/commitdialog.cpp
cd /var/tmp/portage/kde-base/dolphin-plugins-4.8.90/work/dolphin-plugins-4.8.90_build/dolphin-plugins/git && /usr/bin/x86_64-pc-linux-gnu-g++ -DMAKE_FILEVIEWGITPLUGIN_LIB -D_BSD_SOURCE -D_XOPEN_SOURCE=500 -D_BSD_SOURCE -DQT_NO_STL -DQT_NO_CAST_TO_ASCII -D_REENTRANT -DKDE_DEPRECATED_WARNINGS -DKDE4_CMAKE_TOPLEVEL_DIR_LENGTH=53 -DQT_USE_FAST_CONCATENATION -DQT_USE_FAST_OPERATOR_PLUS -DQT_NO_DEBUG -DNDEBUG -march=native -O2 -pipe -ggdb -Wnon-virtual-dtor -Wno-long-long -ansi -Wundef -Wcast-align -Wchar-subscripts -Wall -W -Wpointer-arith -Wformat-security -fno-exceptions -DQT_NO_EXCEPTIONS -fno-check-new -fno-common -Woverloaded-virtual -fno-threadsafe-statics -fvisibility=hidden -Werror=return-type -fvisibility-inlines-hidden -fPIC -I/var/tmp/portage/kde-base/dolphin-plugins-4.8.90/work/dolphin-plugins-4.8.90_build/dolphin-plugins/git -I/var/tmp/portage/kde-base/dolphin-plugins-4.8.90/work/dolphin-plugins-4.8.90/dolphin-plugins/git -I/var/tmp/portage/kde-base/dolphin-plugins-4.8.90/work/dolphin-plugins-4.8.90 -I/var/tmp/portage/kde-base/dolphin-plugins-4.8.90/work/dolphin-plugins-4.8.90_build -I/usr/include/KDE -I/usr/include/qt4/QtXmlPatterns -I/usr/include/qt4/QtXml -I/usr/include/qt4/QtWebKit -I/usr/include/qt4/QtUiTools -I/usr/include/qt4/QtTest -I/usr/include/qt4/QtSvg -I/usr/include/qt4/QtSql -I/usr/include/qt4/QtScriptTools -I/usr/include/qt4/QtScript -I/usr/include/qt4/QtOpenGL -I/usr/include/qt4/QtNetwork -I/usr/include/qt4/QtMultimedia -I/usr/include/qt4/QtHelp -I/usr/include/qt4/QtDesigner -I/usr/include/qt4/QtDeclarative -I/usr/include/qt4/QtDBus -I/usr/include/qt4/QtAssistant -I/usr/include/qt4/Qt3Support -I/usr/include/qt4/QtGui -I/usr/include/qt4/QtCore -I/usr/include/qt4/Qt -I/usr/share/qt4/mkspecs/default -I/usr/include/qt4 -D_GNU_SOURCE -D_LARGEFILE64_SOURCE -o CMakeFiles/fileviewgitplugin.dir/tagdialog.o -c /var/tmp/portage/kde-base/dolphin-plugins-4.8.90/work/dolphin-plugins-4.8.90/dolphin-plugins/git/tagdialog.cpp
Building CXX object dolphin-plugins/git/CMakeFiles/fileviewgitplugin.dir/checkoutdialog.o
cd /var/tmp/portage/kde-base/dolphin-plugins-4.8.90/work/dolphin-plugins-4.8.90_build/dolphin-plugins/git && /usr/bin/x86_64-pc-linux-gnu-g++ -DMAKE_FILEVIEWGITPLUGIN_LIB -D_BSD_SOURCE -D_XOPEN_SOURCE=500 -D_BSD_SOURCE -DQT_NO_STL -DQT_NO_CAST_TO_ASCII -D_REENTRANT -DKDE_DEPRECATED_WARNINGS -DKDE4_CMAKE_TOPLEVEL_DIR_LENGTH=53 -DQT_USE_FAST_CONCATENATION -DQT_USE_FAST_OPERATOR_PLUS -DQT_NO_DEBUG -DNDEBUG -march=native -O2 -pipe -ggdb -Wnon-virtual-dtor -Wno-long-long -ansi -Wundef -Wcast-align -Wchar-subscripts -Wall -W -Wpointer-arith -Wformat-security -fno-exceptions -DQT_NO_EXCEPTIONS -fno-check-new -fno-common -Woverloaded-virtual -fno-threadsafe-statics -fvisibility=hidden -Werror=return-type -fvisibility-inlines-hidden -fPIC -I/var/tmp/portage/kde-base/dolphin-plugins-4.8.90/work/dolphin-plugins-4.8.90_build/dolphin-plugins/git -I/var/tmp/portage/kde-base/dolphin-plugins-4.8.90/work/dolphin-plugins-4.8.90/dolphin-plugins/git -I/var/tmp/portage/kde-base/dolphin-plugins-4.8.90/work/dolphin-plugins-4.8.90 -I/var/tmp/portage/kde-base/dolphin-plugins-4.8.90/work/dolphin-plugins-4.8.90_build -I/usr/include/KDE -I/usr/include/qt4/QtXmlPatterns -I/usr/include/qt4/QtXml -I/usr/include/qt4/QtWebKit -I/usr/include/qt4/QtUiTools -I/usr/include/qt4/QtTest -I/usr/include/qt4/QtSvg -I/usr/include/qt4/QtSql -I/usr/include/qt4/QtScriptTools -I/usr/include/qt4/QtScript -I/usr/include/qt4/QtOpenGL -I/usr/include/qt4/QtNetwork -I/usr/include/qt4/QtMultimedia -I/usr/include/qt4/QtHelp -I/usr/include/qt4/QtDesigner -I/usr/include/qt4/QtDeclarative -I/usr/include/qt4/QtDBus -I/usr/include/qt4/QtAssistant -I/usr/include/qt4/Qt3Support -I/usr/include/qt4/QtGui -I/usr/include/qt4/QtCore -I/usr/include/qt4/Qt -I/usr/share/qt4/mkspecs/default -I/usr/include/qt4 -D_GNU_SOURCE -D_LARGEFILE64_SOURCE -o CMakeFiles/fileviewgitplugin.dir/checkoutdialog.o -c /var/tmp/portage/kde-base/dolphin-plugins-4.8.90/work/dolphin-plugins-4.8.90/dolphin-plugins/git/checkoutdialog.cpp
Building CXX object dolphin-plugins/git/CMakeFiles/fileviewgitplugin.dir/pushdialog.o
cd /var/tmp/portage/kde-base/dolphin-plugins-4.8.90/work/dolphin-plugins-4.8.90_build/dolphin-plugins/git && /usr/bin/x86_64-pc-linux-gnu-g++ -DMAKE_FILEVIEWGITPLUGIN_LIB -D_BSD_SOURCE -D_XOPEN_SOURCE=500 -D_BSD_SOURCE -DQT_NO_STL -DQT_NO_CAST_TO_ASCII -D_REENTRANT -DKDE_DEPRECATED_WARNINGS -DKDE4_CMAKE_TOPLEVEL_DIR_LENGTH=53 -DQT_USE_FAST_CONCATENATION -DQT_USE_FAST_OPERATOR_PLUS -DQT_NO_DEBUG -DNDEBUG -march=native -O2 -pipe -ggdb -Wnon-virtual-dtor -Wno-long-long -ansi -Wundef -Wcast-align -Wchar-subscripts -Wall -W -Wpointer-arith -Wformat-security -fno-exceptions -DQT_NO_EXCEPTIONS -fno-check-new -fno-common -Woverloaded-virtual -fno-threadsafe-statics -fvisibility=hidden -Werror=return-type -fvisibility-inlines-hidden -fPIC -I/var/tmp/portage/kde-base/dolphin-plugins-4.8.90/work/dolphin-plugins-4.8.90_build/dolphin-plugins/git -I/var/tmp/portage/kde-base/dolphin-plugins-4.8.90/work/dolphin-plugins-4.8.90/dolphin-plugins/git -I/var/tmp/portage/kde-base/dolphin-plugins-4.8.90/work/dolphin-plugins-4.8.90 -I/var/tmp/portage/kde-base/dolphin-plugins-4.8.90/work/dolphin-plugins-4.8.90_build -I/usr/include/KDE -I/usr/include/qt4/QtXmlPatterns -I/usr/include/qt4/QtXml -I/usr/include/qt4/QtWebKit -I/usr/include/qt4/QtUiTools -I/usr/include/qt4/QtTest -I/usr/include/qt4/QtSvg -I/usr/include/qt4/QtSql -I/usr/include/qt4/QtScriptTools -I/usr/include/qt4/QtScript -I/usr/include/qt4/QtOpenGL -I/usr/include/qt4/QtNetwork -I/usr/include/qt4/QtMultimedia -I/usr/include/qt4/QtHelp -I/usr/include/qt4/QtDesigner -I/usr/include/qt4/QtDeclarative -I/usr/include/qt4/QtDBus -I/usr/include/qt4/QtAssistant -I/usr/include/qt4/Qt3Support -I/usr/include/qt4/QtGui -I/usr/include/qt4/QtCore -I/usr/include/qt4/Qt -I/usr/share/qt4/mkspecs/default -I/usr/include/qt4 -D_GNU_SOURCE -D_LARGEFILE64_SOURCE -o CMakeFiles/fileviewgitplugin.dir/pushdialog.o -c /var/tmp/portage/kde-base/dolphin-plugins-4.8.90/work/dolphin-plugins-4.8.90/dolphin-plugins/git/pushdialog.cpp
/usr/bin/cmake -E cmake_progress_report /var/tmp/portage/kde-base/dolphin-plugins-4.8.90/work/dolphin-plugins-4.8.90_build/CMakeFiles 7
[ 85%] Building CXX object dolphin-plugins/git/CMakeFiles/fileviewgitplugin.dir/pulldialog.o
cd /var/tmp/portage/kde-base/dolphin-plugins-4.8.90/work/dolphin-plugins-4.8.90_build/dolphin-plugins/git && /usr/bin/x86_64-pc-linux-gnu-g++ -DMAKE_FILEVIEWGITPLUGIN_LIB -D_BSD_SOURCE -D_XOPEN_SOURCE=500 -D_BSD_SOURCE -DQT_NO_STL -DQT_NO_CAST_TO_ASCII -D_REENTRANT -DKDE_DEPRECATED_WARNINGS -DKDE4_CMAKE_TOPLEVEL_DIR_LENGTH=53 -DQT_USE_FAST_CONCATENATION -DQT_USE_FAST_OPERATOR_PLUS -DQT_NO_DEBUG -DNDEBUG -march=native -O2 -pipe -ggdb -Wnon-virtual-dtor -Wno-long-long -ansi -Wundef -Wcast-align -Wchar-subscripts -Wall -W -Wpointer-arith -Wformat-security -fno-exceptions -DQT_NO_EXCEPTIONS -fno-check-new -fno-common -Woverloaded-virtual -fno-threadsafe-statics -fvisibility=hidden -Werror=return-type -fvisibility-inlines-hidden -fPIC -I/var/tmp/portage/kde-base/dolphin-plugins-4.8.90/work/dolphin-plugins-4.8.90_build/dolphin-plugins/git -I/var/tmp/portage/kde-base/dolphin-plugins-4.8.90/work/dolphin-plugins-4.8.90/dolphin-plugins/git -I/var/tmp/portage/kde-base/dolphin-plugins-4.8.90/work/dolphin-plugins-4.8.90 -I/var/tmp/portage/kde-base/dolphin-plugins-4.8.90/work/dolphin-plugins-4.8.90_build -I/usr/include/KDE -I/usr/include/qt4/QtXmlPatterns -I/usr/include/qt4/QtXml -I/usr/include/qt4/QtWebKit -I/usr/include/qt4/QtUiTools -I/usr/include/qt4/QtTest -I/usr/include/qt4/QtSvg -I/usr/include/qt4/QtSql -I/usr/include/qt4/QtScriptTools -I/usr/include/qt4/QtScript -I/usr/include/qt4/QtOpenGL -I/usr/include/qt4/QtNetwork -I/usr/include/qt4/QtMultimedia -I/usr/include/qt4/QtHelp -I/usr/include/qt4/QtDesigner -I/usr/include/qt4/QtDeclarative -I/usr/include/qt4/QtDBus -I/usr/include/qt4/QtAssistant -I/usr/include/qt4/Qt3Support -I/usr/include/qt4/QtGui -I/usr/include/qt4/QtCore -I/usr/include/qt4/Qt -I/usr/share/qt4/mkspecs/default -I/usr/include/qt4 -D_GNU_SOURCE -D_LARGEFILE64_SOURCE -o CMakeFiles/fileviewgitplugin.dir/pulldialog.o -c /var/tmp/portage/kde-base/dolphin-plugins-4.8.90/work/dolphin-plugins-4.8.90/dolphin-plugins/git/pulldialog.cpp
/usr/bin/cmake -E cmake_progress_report /var/tmp/portage/kde-base/dolphin-plugins-4.8.90/work/dolphin-plugins-4.8.90_build/CMakeFiles 8
[ 92%] /usr/bin/cmake -E cmake_progress_report /var/tmp/portage/kde-base/dolphin-plugins-4.8.90/work/dolphin-plugins-4.8.90_build/CMakeFiles 9
Building CXX object dolphin-plugins/git/CMakeFiles/fileviewgitplugin.dir/gitwrapper.o
cd /var/tmp/portage/kde-base/dolphin-plugins-4.8.90/work/dolphin-plugins-4.8.90_build/dolphin-plugins/git && /usr/bin/x86_64-pc-linux-gnu-g++ -DMAKE_FILEVIEWGITPLUGIN_LIB -D_BSD_SOURCE -D_XOPEN_SOURCE=500 -D_BSD_SOURCE -DQT_NO_STL -DQT_NO_CAST_TO_ASCII -D_REENTRANT -DKDE_DEPRECATED_WARNINGS -DKDE4_CMAKE_TOPLEVEL_DIR_LENGTH=53 -DQT_USE_FAST_CONCATENATION -DQT_USE_FAST_OPERATOR_PLUS -DQT_NO_DEBUG -DNDEBUG -march=native -O2 -pipe -ggdb -Wnon-virtual-dtor -Wno-long-long -ansi -Wundef -Wcast-align -Wchar-subscripts -Wall -W -Wpointer-arith -Wformat-security -fno-exceptions -DQT_NO_EXCEPTIONS -fno-check-new -fno-common -Woverloaded-virtual -fno-threadsafe-statics -fvisibility=hidden -Werror=return-type -fvisibility-inlines-hidden -fPIC -I/var/tmp/portage/kde-base/dolphin-plugins-4.8.90/work/dolphin-plugins-4.8.90_build/dolphin-plugins/git -I/var/tmp/portage/kde-base/dolphin-plugins-4.8.90/work/dolphin-plugins-4.8.90/dolphin-plugins/git -I/var/tmp/portage/kde-base/dolphin-plugins-4.8.90/work/dolphin-plugins-4.8.90 -I/var/tmp/portage/kde-base/dolphin-plugins-4.8.90/work/dolphin-plugins-4.8.90_build -I/usr/include/KDE -I/usr/include/qt4/QtXmlPatterns -I/usr/include/qt4/QtXml -I/usr/include/qt4/QtWebKit -I/usr/include/qt4/QtUiTools -I/usr/include/qt4/QtTest -I/usr/include/qt4/QtSvg -I/usr/include/qt4/QtSql -I/usr/include/qt4/QtScriptTools -I/usr/include/qt4/QtScript -I/usr/include/qt4/QtOpenGL -I/usr/include/qt4/QtNetwork -I/usr/include/qt4/QtMultimedia -I/usr/include/qt4/QtHelp -I/usr/include/qt4/QtDesigner -I/usr/include/qt4/QtDeclarative -I/usr/include/qt4/QtDBus -I/usr/include/qt4/QtAssistant -I/usr/include/qt4/Qt3Support -I/usr/include/qt4/QtGui -I/usr/include/qt4/QtCore -I/usr/include/qt4/Qt -I/usr/share/qt4/mkspecs/default -I/usr/include/qt4 -D_GNU_SOURCE -D_LARGEFILE64_SOURCE -o CMakeFiles/fileviewgitplugin.dir/gitwrapper.o -c /var/tmp/portage/kde-base/dolphin-plugins-4.8.90/work/dolphin-plugins-4.8.90/dolphin-plugins/git/gitwrapper.cpp
[100%] Building CXX object dolphin-plugins/git/CMakeFiles/fileviewgitplugin.dir/fileviewgitpluginsettings.o
cd /var/tmp/portage/kde-base/dolphin-plugins-4.8.90/work/dolphin-plugins-4.8.90_build/dolphin-plugins/git && /usr/bin/x86_64-pc-linux-gnu-g++ -DMAKE_FILEVIEWGITPLUGIN_LIB -D_BSD_SOURCE -D_XOPEN_SOURCE=500 -D_BSD_SOURCE -DQT_NO_STL -DQT_NO_CAST_TO_ASCII -D_REENTRANT -DKDE_DEPRECATED_WARNINGS -DKDE4_CMAKE_TOPLEVEL_DIR_LENGTH=53 -DQT_USE_FAST_CONCATENATION -DQT_USE_FAST_OPERATOR_PLUS -DQT_NO_DEBUG -DNDEBUG -march=native -O2 -pipe -ggdb -Wnon-virtual-dtor -Wno-long-long -ansi -Wundef -Wcast-align -Wchar-subscripts -Wall -W -Wpointer-arith -Wformat-security -fno-exceptions -DQT_NO_EXCEPTIONS -fno-check-new -fno-common -Woverloaded-virtual -fno-threadsafe-statics -fvisibility=hidden -Werror=return-type -fvisibility-inlines-hidden -fPIC -I/var/tmp/portage/kde-base/dolphin-plugins-4.8.90/work/dolphin-plugins-4.8.90_build/dolphin-plugins/git -I/var/tmp/portage/kde-base/dolphin-plugins-4.8.90/work/dolphin-plugins-4.8.90/dolphin-plugins/git -I/var/tmp/portage/kde-base/dolphin-plugins-4.8.90/work/dolphin-plugins-4.8.90 -I/var/tmp/portage/kde-base/dolphin-plugins-4.8.90/work/dolphin-plugins-4.8.90_build -I/usr/include/KDE -I/usr/include/qt4/QtXmlPatterns -I/usr/include/qt4/QtXml -I/usr/include/qt4/QtWebKit -I/usr/include/qt4/QtUiTools -I/usr/include/qt4/QtTest -I/usr/include/qt4/QtSvg -I/usr/include/qt4/QtSql -I/usr/include/qt4/QtScriptTools -I/usr/include/qt4/QtScript -I/usr/include/qt4/QtOpenGL -I/usr/include/qt4/QtNetwork -I/usr/include/qt4/QtMultimedia -I/usr/include/qt4/QtHelp -I/usr/include/qt4/QtDesigner -I/usr/include/qt4/QtDeclarative -I/usr/include/qt4/QtDBus -I/usr/include/qt4/QtAssistant -I/usr/include/qt4/Qt3Support -I/usr/include/qt4/QtGui -I/usr/include/qt4/QtCore -I/usr/include/qt4/Qt -I/usr/share/qt4/mkspecs/default -I/usr/include/qt4 -D_GNU_SOURCE -D_LARGEFILE64_SOURCE -o CMakeFiles/fileviewgitplugin.dir/fileviewgitpluginsettings.o -c /var/tmp/portage/kde-base/dolphin-plugins-4.8.90/work/dolphin-plugins-4.8.90_build/dolphin-plugins/git/fileviewgitpluginsettings.cpp
Linking CXX shared module ../../lib/fileviewsvnplugin.so
cd /var/tmp/portage/kde-base/dolphin-plugins-4.8.90/work/dolphin-plugins-4.8.90_build/dolphin-plugins/svn && /usr/bin/cmake -E cmake_link_script CMakeFiles/fileviewsvnplugin.dir/link.txt --verbose=1
/usr/bin/x86_64-pc-linux-gnu-g++ -fPIC -march=native -O2 -pipe -ggdb -Wnon-virtual-dtor -Wno-long-long -ansi -Wundef -Wcast-align -Wchar-subscripts -Wall -W -Wpointer-arith -Wformat-security -fno-exceptions -DQT_NO_EXCEPTIONS -fno-check-new -fno-common -Woverloaded-virtual -fno-threadsafe-statics -fvisibility=hidden -Werror=return-type -fvisibility-inlines-hidden -Wl,--enable-new-dtags -Wl,--fatal-warnings -Wl,--no-undefined -lc -Wl,--as-needed -Wl,-O1 -Wl,--hash-style=gnu -shared -Wl,-soname,fileviewsvnplugin.so -o ../../lib/fileviewsvnplugin.so CMakeFiles/fileviewsvnplugin.dir/fileviewsvnplugin_automoc.o CMakeFiles/fileviewsvnplugin.dir/fileviewsvnplugin.o CMakeFiles/fileviewsvnplugin.dir/fileviewsvnpluginsettings.o -L/usr/lib64/qt4 /usr/lib64/libkio.so.5.8.0 /usr/lib64/qt4/libQtNetwork.so /usr/lib64/qt4/libQtXml.so /usr/lib64/libkdeui.so.5.8.0 /usr/lib64/qt4/libQtGui.so /usr/lib64/qt4/libQtSvg.so /usr/lib64/libkdecore.so.5.8.0 /usr/lib64/qt4/libQtDBus.so /usr/lib64/qt4/libQtCore.so -lpthread -Wl,-rpath,/usr/lib64/qt4:
Linking CXX shared module ../../lib/fileviewgitplugin.so
cd /var/tmp/portage/kde-base/dolphin-plugins-4.8.90/work/dolphin-plugins-4.8.90_build/dolphin-plugins/git && /usr/bin/cmake -E cmake_link_script CMakeFiles/fileviewgitplugin.dir/link.txt --verbose=1
/usr/bin/x86_64-pc-linux-gnu-g++ -fPIC -march=native -O2 -pipe -ggdb -Wnon-virtual-dtor -Wno-long-long -ansi -Wundef -Wcast-align -Wchar-subscripts -Wall -W -Wpointer-arith -Wformat-security -fno-exceptions -DQT_NO_EXCEPTIONS -fno-check-new -fno-common -Woverloaded-virtual -fno-threadsafe-statics -fvisibility=hidden -Werror=return-type -fvisibility-inlines-hidden -Wl,--enable-new-dtags -Wl,--fatal-warnings -Wl,--no-undefined -lc -Wl,--as-needed -Wl,-O1 -Wl,--hash-style=gnu -shared -Wl,-soname,fileviewgitplugin.so -o ../../lib/fileviewgitplugin.so CMakeFiles/fileviewgitplugin.dir/fileviewgitplugin_automoc.o CMakeFiles/fileviewgitplugin.dir/fileviewgitplugin.o CMakeFiles/fileviewgitplugin.dir/checkoutdialog.o CMakeFiles/fileviewgitplugin.dir/commitdialog.o CMakeFiles/fileviewgitplugin.dir/tagdialog.o CMakeFiles/fileviewgitplugin.dir/pushdialog.o CMakeFiles/fileviewgitplugin.dir/pulldialog.o CMakeFiles/fileviewgitplugin.dir/gitwrapper.o CMakeFiles/fileviewgitplugin.dir/fileviewgitpluginsettings.o -L/usr/lib64/qt4 /usr/lib64/libkio.so.5.8.0 /usr/lib64/qt4/libQtNetwork.so /usr/lib64/qt4/libQtXml.so /usr/lib64/libkdeui.so.5.8.0 /usr/lib64/qt4/libQtGui.so /usr/lib64/qt4/libQtSvg.so /usr/lib64/libkdecore.so.5.8.0 /usr/lib64/qt4/libQtDBus.so /usr/lib64/qt4/libQtCore.so -lpthread -Wl,-rpath,/usr/lib64/qt4:
CMakeFiles/fileviewsvnplugin.dir/fileviewsvnplugin_automoc.o: In function `FileViewSvnPlugin::qt_metacall(QMetaObject::Call, int, void**)':
/var/tmp/portage/kde-base/dolphin-plugins-4.8.90/work/dolphin-plugins-4.8.90_build/dolphin-plugins/svn/moc_fileviewsvnplugin.cpp:106: undefined reference to `KVersionControlPlugin2::qt_metacall(QMetaObject::Call, int, void**)'
CMakeFiles/fileviewsvnplugin.dir/fileviewsvnplugin_automoc.o: In function `FileViewSvnPlugin::qt_metacast(char const*)':
/var/tmp/portage/kde-base/dolphin-plugins-4.8.90/work/dolphin-plugins-4.8.90_build/dolphin-plugins/svn/moc_fileviewsvnplugin.cpp:101: undefined reference to `KVersionControlPlugin2::qt_metacast(char const*)'
CMakeFiles/fileviewsvnplugin.dir/fileviewsvnplugin_automoc.o:(.data.rel.ro._ZTI17FileViewSvnPlugin[typeinfo for FileViewSvnPlugin]+0x10): undefined reference to `typeinfo for KVersionControlPlugin2'
CMakeFiles/fileviewsvnplugin.dir/fileviewsvnplugin_automoc.o:(.data.rel.ro._ZTV17FileViewSvnPlugin[vtable for FileViewSvnPlugin]+0x88): undefined reference to `KVersionControlPlugin2::versionState(KFileItem const&)'
CMakeFiles/fileviewsvnplugin.dir/fileviewsvnplugin_automoc.o:(.data.rel.ro._ZTV17FileViewSvnPlugin[vtable for FileViewSvnPlugin]+0x90): undefined reference to `KVersionControlPlugin2::contextMenuActions(KFileItemList const&)'
CMakeFiles/fileviewsvnplugin.dir/fileviewsvnplugin_automoc.o:(.data.rel.ro._ZTV17FileViewSvnPlugin[vtable for FileViewSvnPlugin]+0x98): undefined reference to `KVersionControlPlugin2::contextMenuActions(QString const&)'
CMakeFiles/fileviewsvnplugin.dir/fileviewsvnplugin_automoc.o:(.data.rel.ro+0x0): undefined reference to `KVersionControlPlugin2::staticMetaObject'
CMakeFiles/fileviewsvnplugin.dir/fileviewsvnplugin.o: In function `FileViewSvnPlugin':
/var/tmp/portage/kde-base/dolphin-plugins-4.8.90/work/dolphin-plugins-4.8.90/dolphin-plugins/svn/fileviewsvnplugin.cpp:63: undefined reference to `KVersionControlPlugin2::KVersionControlPlugin2(QObject*)'
CMakeFiles/fileviewsvnplugin.dir/fileviewsvnplugin.o: In function `FileViewSvnPlugin::slotShowUpdatesToggled(bool)':
/var/tmp/portage/kde-base/dolphin-plugins-4.8.90/work/dolphin-plugins-4.8.90/dolphin-plugins/svn/fileviewsvnplugin.cpp:392: undefined reference to `KVersionControlPlugin2::itemVersionsChanged()'
CMakeFiles/fileviewsvnplugin.dir/fileviewsvnplugin.o: In function `FileViewSvnPlugin::beginRetrieval(QString const&)':
/var/tmp/portage/kde-base/dolphin-plugins-4.8.90/work/dolphin-plugins-4.8.90/dolphin-plugins/svn/fileviewsvnplugin.cpp:182: undefined reference to `KVersionControlPlugin2::infoMessage(QString const&)'
CMakeFiles/fileviewsvnplugin.dir/fileviewsvnplugin.o: In function `FileViewSvnPlugin::execSvnCommand(QString const&, QStringList const&, QString const&, QString const&, QString const&)':
/var/tmp/portage/kde-base/dolphin-plugins-4.8.90/work/dolphin-plugins-4.8.90/dolphin-plugins/svn/fileviewsvnplugin.cpp:401: undefined reference to `KVersionControlPlugin2::infoMessage(QString const&)'
CMakeFiles/fileviewsvnplugin.dir/fileviewsvnplugin.o: In function `FileViewSvnPlugin::commitFiles()':
/var/tmp/portage/kde-base/dolphin-plugins-4.8.90/work/dolphin-plugins-4.8.90/dolphin-plugins/svn/fileviewsvnplugin.cpp:326: undefined reference to `KVersionControlPlugin2::errorMessage(QString const&)'
CMakeFiles/fileviewsvnplugin.dir/fileviewsvnplugin.o: In function `FileViewSvnPlugin::slotOperationCompleted(int, QProcess::ExitStatus)':
/var/tmp/portage/kde-base/dolphin-plugins-4.8.90/work/dolphin-plugins-4.8.90/dolphin-plugins/svn/fileviewsvnplugin.cpp:369: undefined reference to `KVersionControlPlugin2::operationCompletedMessage(QString const&)'
CMakeFiles/fileviewsvnplugin.dir/fileviewsvnplugin.o: In function `~FileViewSvnPlugin':
/var/tmp/portage/kde-base/dolphin-plugins-4.8.90/work/dolphin-plugins-4.8.90/dolphin-plugins/svn/fileviewsvnplugin.cpp:112: undefined reference to `KVersionControlPlugin2::~KVersionControlPlugin2()'
/var/tmp/portage/kde-base/dolphin-plugins-4.8.90/work/dolphin-plugins-4.8.90/dolphin-plugins/svn/fileviewsvnplugin.cpp:112: undefined reference to `KVersionControlPlugin2::~KVersionControlPlugin2()'
CMakeFiles/fileviewsvnplugin.dir/fileviewsvnplugin.o: In function `FileViewSvnPlugin::slotOperationError()':
/var/tmp/portage/kde-base/dolphin-plugins-4.8.90/work/dolphin-plugins-4.8.90/dolphin-plugins/svn/fileviewsvnplugin.cpp:382: undefined reference to `KVersionControlPlugin2::errorMessage(QString const&)'
CMakeFiles/fileviewsvnplugin.dir/fileviewsvnplugin.o: In function `FileViewSvnPlugin::slotOperationCompleted(int, QProcess::ExitStatus)':
/var/tmp/portage/kde-base/dolphin-plugins-4.8.90/work/dolphin-plugins-4.8.90/dolphin-plugins/svn/fileviewsvnplugin.cpp:367: undefined reference to `KVersionControlPlugin2::errorMessage(QString const&)'
/var/tmp/portage/kde-base/dolphin-plugins-4.8.90/work/dolphin-plugins-4.8.90/dolphin-plugins/svn/fileviewsvnplugin.cpp:370: undefined reference to `KVersionControlPlugin2::itemVersionsChanged()'
collect2: ld gab 1 als Ende-Status zurück
make[2]: *** [lib/fileviewsvnplugin.so] Fehler 1
make[2]: Leaving directory `/var/tmp/portage/kde-base/dolphin-plugins-4.8.90/work/dolphin-plugins-4.8.90_build'
make[1]: *** [dolphin-plugins/svn/CMakeFiles/fileviewsvnplugin.dir/all] Fehler 2
make[1]: *** Warte auf noch nicht beendete Prozesse...
CMakeFiles/fileviewgitplugin.dir/fileviewgitplugin.o: In function `FileViewGitPlugin':
/var/tmp/portage/kde-base/dolphin-plugins-4.8.90/work/dolphin-plugins-4.8.90/dolphin-plugins/git/fileviewgitplugin.cpp:56: undefined reference to `KVersionControlPlugin2::KVersionControlPlugin2(QObject*)'
CMakeFiles/fileviewgitplugin.dir/fileviewgitplugin.o: In function `FileViewGitPlugin::commit()':
/var/tmp/portage/kde-base/dolphin-plugins-4.8.90/work/dolphin-plugins-4.8.90/dolphin-plugins/git/fileviewgitplugin.cpp:441: undefined reference to `KVersionControlPlugin2::operationCompletedMessage(QString const&)'
/var/tmp/portage/kde-base/dolphin-plugins-4.8.90/work/dolphin-plugins-4.8.90/dolphin-plugins/git/fileviewgitplugin.cpp:442: undefined reference to `KVersionControlPlugin2::itemVersionsChanged()'
CMakeFiles/fileviewgitplugin.dir/fileviewgitplugin.o: In function `FileViewGitPlugin::createTag()':
/var/tmp/portage/kde-base/dolphin-plugins-4.8.90/work/dolphin-plugins-4.8.90/dolphin-plugins/git/fileviewgitplugin.cpp:480: undefined reference to `KVersionControlPlugin2::errorMessage(QString const&)'
/var/tmp/portage/kde-base/dolphin-plugins-4.8.90/work/dolphin-plugins-4.8.90/dolphin-plugins/git/fileviewgitplugin.cpp:473: undefined reference to `KVersionControlPlugin2::operationCompletedMessage(QString const&)'
CMakeFiles/fileviewgitplugin.dir/fileviewgitplugin.o: In function `FileViewGitPlugin::push()':
/var/tmp/portage/kde-base/dolphin-plugins-4.8.90/work/dolphin-plugins-4.8.90/dolphin-plugins/git/fileviewgitplugin.cpp:496: undefined reference to `KVersionControlPlugin2::infoMessage(QString const&)'
CMakeFiles/fileviewgitplugin.dir/fileviewgitplugin.o: In function `FileViewGitPlugin::pull()':
/var/tmp/portage/kde-base/dolphin-plugins-4.8.90/work/dolphin-plugins-4.8.90/dolphin-plugins/git/fileviewgitplugin.cpp:517: undefined reference to `KVersionControlPlugin2::infoMessage(QString const&)'
CMakeFiles/fileviewgitplugin.dir/fileviewgitplugin.o: In function `FileViewGitPlugin::parsePullOutput()':
/var/tmp/portage/kde-base/dolphin-plugins-4.8.90/work/dolphin-plugins-4.8.90/dolphin-plugins/git/fileviewgitplugin.cpp:584: undefined reference to `KVersionControlPlugin2::itemVersionsChanged()'
CMakeFiles/fileviewgitplugin.dir/fileviewgitplugin.o: In function `FileViewGitPlugin::checkout()':
/var/tmp/portage/kde-base/dolphin-plugins-4.8.90/work/dolphin-plugins-4.8.90/dolphin-plugins/git/fileviewgitplugin.cpp:414: undefined reference to `KVersionControlPlugin2::errorMessage(QString const&)'
/var/tmp/portage/kde-base/dolphin-plugins-4.8.90/work/dolphin-plugins-4.8.90/dolphin-plugins/git/fileviewgitplugin.cpp:408: undefined reference to `KVersionControlPlugin2::operationCompletedMessage(QString const&)'
/var/tmp/portage/kde-base/dolphin-plugins-4.8.90/work/dolphin-plugins-4.8.90/dolphin-plugins/git/fileviewgitplugin.cpp:409: undefined reference to `KVersionControlPlugin2::itemVersionsChanged()'
CMakeFiles/fileviewgitplugin.dir/fileviewgitplugin.o: In function `FileViewGitPlugin::execGitCommand(QString const&, QStringList const&, QString const&, QString const&, QString const&)':
/var/tmp/portage/kde-base/dolphin-plugins-4.8.90/work/dolphin-plugins-4.8.90/dolphin-plugins/git/fileviewgitplugin.cpp:597: undefined reference to `KVersionControlPlugin2::infoMessage(QString const&)'
CMakeFiles/fileviewgitplugin.dir/fileviewgitplugin.o: In function `FileViewGitPlugin::slotOperationCompleted(int, QProcess::ExitStatus)':
/var/tmp/portage/kde-base/dolphin-plugins-4.8.90/work/dolphin-plugins-4.8.90/dolphin-plugins/git/fileviewgitplugin.cpp:540: undefined reference to `KVersionControlPlugin2::errorMessage(QString const&)'
/var/tmp/portage/kde-base/dolphin-plugins-4.8.90/work/dolphin-plugins-4.8.90/dolphin-plugins/git/fileviewgitplugin.cpp:542: undefined reference to `KVersionControlPlugin2::operationCompletedMessage(QString const&)'
/var/tmp/portage/kde-base/dolphin-plugins-4.8.90/work/dolphin-plugins-4.8.90/dolphin-plugins/git/fileviewgitplugin.cpp:543: undefined reference to `KVersionControlPlugin2::itemVersionsChanged()'
CMakeFiles/fileviewgitplugin.dir/fileviewgitplugin.o: In function `FileViewGitPlugin::qt_metacall(QMetaObject::Call, int, void**)':
/var/tmp/portage/kde-base/dolphin-plugins-4.8.90/work/dolphin-plugins-4.8.90_build/dolphin-plugins/git/fileviewgitplugin.moc:103: undefined reference to `KVersionControlPlugin2::qt_metacall(QMetaObject::Call, int, void**)'
CMakeFiles/fileviewgitplugin.dir/fileviewgitplugin.o: In function `FileViewGitPlugin::qt_metacast(char const*)':
/var/tmp/portage/kde-base/dolphin-plugins-4.8.90/work/dolphin-plugins-4.8.90_build/dolphin-plugins/git/fileviewgitplugin.moc:98: undefined reference to `KVersionControlPlugin2::qt_metacast(char const*)'
CMakeFiles/fileviewgitplugin.dir/fileviewgitplugin.o: In function `~FileViewGitPlugin':
/var/tmp/portage/kde-base/dolphin-plugins-4.8.90/work/dolphin-plugins-4.8.90/dolphin-plugins/git/fileviewgitplugin.cpp:105: undefined reference to `KVersionControlPlugin2::~KVersionControlPlugin2()'
CMakeFiles/fileviewgitplugin.dir/fileviewgitplugin.o: In function `FileViewGitPlugin::slotOperationError()':
/var/tmp/portage/kde-base/dolphin-plugins-4.8.90/work/dolphin-plugins-4.8.90/dolphin-plugins/git/fileviewgitplugin.cpp:555: undefined reference to `KVersionControlPlugin2::errorMessage(QString const&)'
CMakeFiles/fileviewgitplugin.dir/fileviewgitplugin.o:(.data.rel.ro._ZTI17FileViewGitPlugin[typeinfo for FileViewGitPlugin]+0x10): undefined reference to `typeinfo for KVersionControlPlugin2'
CMakeFiles/fileviewgitplugin.dir/fileviewgitplugin.o:(.data.rel.ro._ZTV17FileViewGitPlugin[vtable for FileViewGitPlugin]+0x88): undefined reference to `KVersionControlPlugin2::versionState(KFileItem const&)'
CMakeFiles/fileviewgitplugin.dir/fileviewgitplugin.o:(.data.rel.ro._ZTV17FileViewGitPlugin[vtable for FileViewGitPlugin]+0x90): undefined reference to `KVersionControlPlugin2::contextMenuActions(KFileItemList const&)'
CMakeFiles/fileviewgitplugin.dir/fileviewgitplugin.o:(.data.rel.ro._ZTV17FileViewGitPlugin[vtable for FileViewGitPlugin]+0x98): undefined reference to `KVersionControlPlugin2::contextMenuActions(QString const&)'
CMakeFiles/fileviewgitplugin.dir/fileviewgitplugin.o:(.data.rel.ro+0x0): undefined reference to `KVersionControlPlugin2::staticMetaObject'
collect2: ld gab 1 als Ende-Status zurück
make[2]: *** [lib/fileviewgitplugin.so] Fehler 1
make[2]: Leaving directory `/var/tmp/portage/kde-base/dolphin-plugins-4.8.90/work/dolphin-plugins-4.8.90_build'
make[1]: *** [dolphin-plugins/git/CMakeFiles/fileviewgitplugin.dir/all] Fehler 2
make[1]: Leaving directory `/var/tmp/portage/kde-base/dolphin-plugins-4.8.90/work/dolphin-plugins-4.8.90_build'
make: *** [all] Fehler 2
* ERROR: kde-base/dolphin-plugins-4.8.90 failed (compile phase):
* emake failed
*
* If you need support, post the output of `emerge --info '=kde-base/dolphin-plugins-4.8.90'`,
* the complete build log and the output of `emerge -pqv '=kde-base/dolphin-plugins-4.8.90'`.
* This ebuild is from an overlay named 'kde': '/usr/local/portage/kde/'
* The complete build log is located at '/var/log/portage/build/kde-base/dolphin-plugins-4.8.90:20120608-122258.log.gz'.
* For convenience, a symlink to the build log is located at '/var/tmp/portage/kde-base/dolphin-plugins-4.8.90/temp/build.log.gz'.
* The ebuild environment file is located at '/var/tmp/portage/kde-base/dolphin-plugins-4.8.90/temp/environment'.
* Working directory: '/var/tmp/portage/kde-base/dolphin-plugins-4.8.90/work/dolphin-plugins-4.8.90_build'
* S: '/var/tmp/portage/kde-base/dolphin-plugins-4.8.90/work/dolphin-plugins-4.8.90'
Sign up for free to join this conversation on GitHub. Already have an account? Sign in to comment