Skip to content

Instantly share code, notes, and snippets.

/gist:4578800

Created Jan 20, 2013
Embed
What would you like to do?
16:52:05.722 [ERROR] [system.err] Exception in thread "main" java.lang.NoClassDe
fFoundError: org/apache/log4j/Logger
16:52:05.722 [ERROR] [system.err] at org.jibx.schema.validation.Validation
Context.<clinit>(ValidationContext.java:56)
16:52:05.722 [ERROR] [system.err] at org.jibx.custom.classes.ClassCustomiz
ationBase.loadCustomizations(ClassCustomizationBase.java:157)
16:52:05.722 [ERROR] [system.err] at org.jibx.custom.CustomizationCommandL
ineBase.processArgs(CustomizationCommandLineBase.java:183)
16:52:05.722 [ERROR] [system.err] at org.jibx.binding.generator.BindGen.ma
in(BindGen.java:1335)
16:52:05.722 [ERROR] [system.err] Caused by: java.lang.ClassNotFoundException: o
rg.apache.log4j.Logger
16:52:05.722 [ERROR] [system.err] at java.net.URLClassLoader$1.run(URLClas
sLoader.java:366)
16:52:05.722 [ERROR] [system.err] at java.net.URLClassLoader$1.run(URLClas
sLoader.java:355)
16:52:05.722 [ERROR] [system.err] at java.security.AccessController.doPriv
ileged(Native Method)
16:52:05.722 [ERROR] [system.err] at java.net.URLClassLoader.findClass(URL
ClassLoader.java:354)
16:52:05.722 [ERROR] [system.err] at java.lang.ClassLoader.loadClass(Class
Loader.java:423)
16:52:05.722 [ERROR] [system.err] at sun.misc.Launcher$AppClassLoader.load
Class(Launcher.java:308)
16:52:05.722 [ERROR] [system.err] at java.lang.ClassLoader.loadClass(Class
Loader.java:356)
16:52:05.722 [ERROR] [system.err] ... 4 more
16:52:05.738 [ERROR] [org.gradle.BuildExceptionReporter]
16:52:05.738 [ERROR] [org.gradle.BuildExceptionReporter] FAILURE: Build failed w
ith an exception.
16:52:05.738 [ERROR] [org.gradle.BuildExceptionReporter]
16:52:05.738 [ERROR] [org.gradle.BuildExceptionReporter] * Where:
16:52:05.738 [ERROR] [org.gradle.BuildExceptionReporter] Build file 'D:\Croamis-
POC-Gradle\workspace-sts-2.9.2-croamis\croamis-stk-bu-app\croamis-stk-sub\croami
s-stk-comp\stk-services\build.gradle' line: 59
16:52:05.738 [ERROR] [org.gradle.BuildExceptionReporter]
16:52:05.738 [ERROR] [org.gradle.BuildExceptionReporter] * What went wrong:
16:52:05.738 [ERROR] [org.gradle.BuildExceptionReporter] Execution failed for ta
sk ':stk-services:createBinding'.
16:52:05.738 [ERROR] [org.gradle.BuildExceptionReporter] > Process 'command 'C:\
Program Files\Java\jdk1.7.0_10\bin\java.exe'' finished with non-zero exit value
1
16:52:05.738 [ERROR] [org.gradle.BuildExceptionReporter]
16:52:05.738 [ERROR] [org.gradle.BuildExceptionReporter] * Exception is:
16:52:05.738 [ERROR] [org.gradle.BuildExceptionReporter] org.gradle.api.tasks.Ta
skExecutionException: Execution failed for task ':stk-services:createBinding'.
16:52:05.738 [ERROR] [org.gradle.BuildExceptionReporter] at org.gradle.ap
i.internal.tasks.execution.ExecuteActionsTaskExecuter.executeActions(ExecuteActi
onsTaskExecuter.java:68)
16:52:05.738 [ERROR] [org.gradle.BuildExceptionReporter] at org.gradle.ap
i.internal.tasks.execution.ExecuteActionsTaskExecuter.execute(ExecuteActionsTask
Executer.java:46)
16:52:05.738 [ERROR] [org.gradle.BuildExceptionReporter] at org.gradle.ap
i.internal.tasks.execution.PostExecutionAnalysisTaskExecuter.execute(PostExecuti
onAnalysisTaskExecuter.java:34)
16:52:05.738 [ERROR] [org.gradle.BuildExceptionReporter] at org.gradle.ap
i.internal.changedetection.CacheLockHandlingTaskExecuter$1.run(CacheLockHandling
TaskExecuter.java:34)
16:52:05.738 [ERROR] [org.gradle.BuildExceptionReporter] at org.gradle.ca
che.internal.DefaultCacheAccess$3.create(DefaultCacheAccess.java:243)
16:52:05.738 [ERROR] [org.gradle.BuildExceptionReporter] at org.gradle.ca
che.internal.DefaultCacheAccess.longRunningOperation(DefaultCacheAccess.java:178
)
16:52:05.738 [ERROR] [org.gradle.BuildExceptionReporter] at org.gradle.ca
che.internal.DefaultCacheAccess.longRunningOperation(DefaultCacheAccess.java:241
)
16:52:05.738 [ERROR] [org.gradle.BuildExceptionReporter] at org.gradle.ca
che.internal.DefaultPersistentDirectoryStore.longRunningOperation(DefaultPersist
entDirectoryStore.java:137)
16:52:05.738 [ERROR] [org.gradle.BuildExceptionReporter] at org.gradle.ap
i.internal.changedetection.DefaultTaskArtifactStateCacheAccess.longRunningOperat
ion(DefaultTaskArtifactStateCacheAccess.java:83)
16:52:05.738 [ERROR] [org.gradle.BuildExceptionReporter] at org.gradle.ap
i.internal.changedetection.CacheLockHandlingTaskExecuter.execute(CacheLockHandli
ngTaskExecuter.java:32)
16:52:05.738 [ERROR] [org.gradle.BuildExceptionReporter] at org.gradle.ap
i.internal.tasks.execution.SkipUpToDateTaskExecuter.execute(SkipUpToDateTaskExec
uter.java:55)
16:52:05.738 [ERROR] [org.gradle.BuildExceptionReporter] at org.gradle.ap
i.internal.tasks.execution.ValidatingTaskExecuter.execute(ValidatingTaskExecuter
.java:57)
16:52:05.738 [ERROR] [org.gradle.BuildExceptionReporter] at org.gradle.ap
i.internal.tasks.execution.SkipEmptySourceFilesTaskExecuter.execute(SkipEmptySou
rceFilesTaskExecuter.java:41)
16:52:05.738 [ERROR] [org.gradle.BuildExceptionReporter] at org.gradle.ap
i.internal.tasks.execution.SkipTaskWithNoActionsExecuter.execute(SkipTaskWithNoA
ctionsExecuter.java:51)
16:52:05.738 [ERROR] [org.gradle.BuildExceptionReporter] at org.gradle.ap
i.internal.tasks.execution.SkipOnlyIfTaskExecuter.execute(SkipOnlyIfTaskExecuter
.java:52)
16:52:05.738 [ERROR] [org.gradle.BuildExceptionReporter] at org.gradle.ap
i.internal.tasks.execution.ExecuteAtMostOnceTaskExecuter.execute(ExecuteAtMostOn
ceTaskExecuter.java:42)
16:52:05.738 [ERROR] [org.gradle.BuildExceptionReporter] at org.gradle.ap
i.internal.AbstractTask.executeWithoutThrowingTaskFailure(AbstractTask.java:247)
16:52:05.738 [ERROR] [org.gradle.BuildExceptionReporter] at org.gradle.ap
i.internal.AbstractTask.execute(AbstractTask.java:242)
16:52:05.738 [ERROR] [org.gradle.BuildExceptionReporter] at org.gradle.ap
i.internal.TaskInternal$execute.call(Unknown Source)
16:52:05.738 [ERROR] [org.gradle.BuildExceptionReporter] at build_2bqsn9i
tttd7pi4bvs8656gppr$_run_closure5.doCall(D:\Croamis-POC-Gradle\workspace-sts-2.9
.2-croamis\croamis-stk-bu-app\croamis-stk-sub\croamis-stk-comp\stk-services\buil
d.gradle:59)
16:52:05.738 [ERROR] [org.gradle.BuildExceptionReporter] at org.gradle.ap
i.internal.AbstractTask$ClosureTaskAction.execute(AbstractTask.java:447)
16:52:05.738 [ERROR] [org.gradle.BuildExceptionReporter] at org.gradle.ap
i.internal.AbstractTask$ClosureTaskAction.execute(AbstractTask.java:431)
16:52:05.738 [ERROR] [org.gradle.BuildExceptionReporter] at org.gradle.ap
i.internal.tasks.execution.ExecuteActionsTaskExecuter.executeActions(ExecuteActi
onsTaskExecuter.java:60)
16:52:05.738 [ERROR] [org.gradle.BuildExceptionReporter] at org.gradle.ap
i.internal.tasks.execution.ExecuteActionsTaskExecuter.execute(ExecuteActionsTask
Executer.java:46)
16:52:05.738 [ERROR] [org.gradle.BuildExceptionReporter] at org.gradle.ap
i.internal.tasks.execution.PostExecutionAnalysisTaskExecuter.execute(PostExecuti
onAnalysisTaskExecuter.java:34)
16:52:05.738 [ERROR] [org.gradle.BuildExceptionReporter] at org.gradle.ap
i.internal.changedetection.CacheLockHandlingTaskExecuter$1.run(CacheLockHandling
TaskExecuter.java:34)
16:52:05.738 [ERROR] [org.gradle.BuildExceptionReporter] at org.gradle.ca
che.internal.DefaultCacheAccess$3.create(DefaultCacheAccess.java:243)
16:52:05.738 [ERROR] [org.gradle.BuildExceptionReporter] at org.gradle.ca
che.internal.DefaultCacheAccess.longRunningOperation(DefaultCacheAccess.java:188
)
16:52:05.738 [ERROR] [org.gradle.BuildExceptionReporter] at org.gradle.ca
che.internal.DefaultCacheAccess.longRunningOperation(DefaultCacheAccess.java:241
)
16:52:05.738 [ERROR] [org.gradle.BuildExceptionReporter] at org.gradle.ca
che.internal.DefaultPersistentDirectoryStore.longRunningOperation(DefaultPersist
entDirectoryStore.java:137)
16:52:05.738 [ERROR] [org.gradle.BuildExceptionReporter] at org.gradle.ap
i.internal.changedetection.DefaultTaskArtifactStateCacheAccess.longRunningOperat
ion(DefaultTaskArtifactStateCacheAccess.java:83)
16:52:05.738 [ERROR] [org.gradle.BuildExceptionReporter] at org.gradle.ap
i.internal.changedetection.CacheLockHandlingTaskExecuter.execute(CacheLockHandli
ngTaskExecuter.java:32)
16:52:05.738 [ERROR] [org.gradle.BuildExceptionReporter] at org.gradle.ap
i.internal.tasks.execution.SkipUpToDateTaskExecuter.execute(SkipUpToDateTaskExec
uter.java:55)
16:52:05.738 [ERROR] [org.gradle.BuildExceptionReporter] at org.gradle.ap
i.internal.tasks.execution.ValidatingTaskExecuter.execute(ValidatingTaskExecuter
.java:57)
16:52:05.738 [ERROR] [org.gradle.BuildExceptionReporter] at org.gradle.ap
i.internal.tasks.execution.SkipEmptySourceFilesTaskExecuter.execute(SkipEmptySou
rceFilesTaskExecuter.java:41)
16:52:05.738 [ERROR] [org.gradle.BuildExceptionReporter] at org.gradle.ap
i.internal.tasks.execution.SkipTaskWithNoActionsExecuter.execute(SkipTaskWithNoA
ctionsExecuter.java:51)
16:52:05.753 [ERROR] [org.gradle.BuildExceptionReporter] at org.gradle.ap
i.internal.tasks.execution.SkipOnlyIfTaskExecuter.execute(SkipOnlyIfTaskExecuter
.java:52)
16:52:05.753 [ERROR] [org.gradle.BuildExceptionReporter] at org.gradle.ap
i.internal.tasks.execution.ExecuteAtMostOnceTaskExecuter.execute(ExecuteAtMostOn
ceTaskExecuter.java:42)
16:52:05.753 [ERROR] [org.gradle.BuildExceptionReporter] at org.gradle.ap
i.internal.AbstractTask.executeWithoutThrowingTaskFailure(AbstractTask.java:247)
16:52:05.753 [ERROR] [org.gradle.BuildExceptionReporter] at org.gradle.ex
ecution.taskgraph.DefaultTaskPlanExecutor.executeTask(DefaultTaskPlanExecutor.ja
va:52)
16:52:05.753 [ERROR] [org.gradle.BuildExceptionReporter] at org.gradle.ex
ecution.taskgraph.DefaultTaskPlanExecutor.processTask(DefaultTaskPlanExecutor.ja
va:38)
16:52:05.753 [ERROR] [org.gradle.BuildExceptionReporter] at org.gradle.ex
ecution.taskgraph.DefaultTaskPlanExecutor.process(DefaultTaskPlanExecutor.java:3
0)
16:52:05.753 [ERROR] [org.gradle.BuildExceptionReporter] at org.gradle.ex
ecution.taskgraph.DefaultTaskGraphExecuter.execute(DefaultTaskGraphExecuter.java
:83)
16:52:05.753 [ERROR] [org.gradle.BuildExceptionReporter] at org.gradle.ex
ecution.SelectedTaskExecutionAction.execute(SelectedTaskExecutionAction.java:29)
16:52:05.753 [ERROR] [org.gradle.BuildExceptionReporter] at org.gradle.ex
ecution.DefaultBuildExecuter.execute(DefaultBuildExecuter.java:61)
16:52:05.753 [ERROR] [org.gradle.BuildExceptionReporter] at org.gradle.ex
ecution.DefaultBuildExecuter.access$200(DefaultBuildExecuter.java:23)
16:52:05.753 [ERROR] [org.gradle.BuildExceptionReporter] at org.gradle.ex
ecution.DefaultBuildExecuter$2.proceed(DefaultBuildExecuter.java:67)
16:52:05.753 [ERROR] [org.gradle.BuildExceptionReporter] at org.gradle.ap
i.internal.changedetection.TaskCacheLockHandlingBuildExecuter$1.run(TaskCacheLoc
kHandlingBuildExecuter.java:31)
16:52:05.753 [ERROR] [org.gradle.BuildExceptionReporter] at org.gradle.ca
che.internal.DefaultCacheAccess$2.create(DefaultCacheAccess.java:118)
16:52:05.753 [ERROR] [org.gradle.BuildExceptionReporter] at org.gradle.ca
che.internal.DefaultCacheAccess.useCache(DefaultCacheAccess.java:133)
16:52:05.753 [ERROR] [org.gradle.BuildExceptionReporter] at org.gradle.ca
che.internal.DefaultCacheAccess.useCache(DefaultCacheAccess.java:116)
16:52:05.753 [ERROR] [org.gradle.BuildExceptionReporter] at org.gradle.ca
che.internal.DefaultPersistentDirectoryStore.useCache(DefaultPersistentDirectory
Store.java:129)
16:52:05.753 [ERROR] [org.gradle.BuildExceptionReporter] at org.gradle.ap
i.internal.changedetection.DefaultTaskArtifactStateCacheAccess.useCache(DefaultT
askArtifactStateCacheAccess.java:79)
16:52:05.753 [ERROR] [org.gradle.BuildExceptionReporter] at org.gradle.ap
i.internal.changedetection.TaskCacheLockHandlingBuildExecuter.execute(TaskCacheL
ockHandlingBuildExecuter.java:29)
16:52:05.753 [ERROR] [org.gradle.BuildExceptionReporter] at org.gradle.ex
ecution.DefaultBuildExecuter.execute(DefaultBuildExecuter.java:61)
16:52:05.753 [ERROR] [org.gradle.BuildExceptionReporter] at org.gradle.ex
ecution.DefaultBuildExecuter.access$200(DefaultBuildExecuter.java:23)
16:52:05.753 [ERROR] [org.gradle.BuildExceptionReporter] at org.gradle.ex
ecution.DefaultBuildExecuter$2.proceed(DefaultBuildExecuter.java:67)
16:52:05.753 [ERROR] [org.gradle.BuildExceptionReporter] at org.gradle.ex
ecution.DryRunBuildExecutionAction.execute(DryRunBuildExecutionAction.java:32)
16:52:05.753 [ERROR] [org.gradle.BuildExceptionReporter] at org.gradle.ex
ecution.DefaultBuildExecuter.execute(DefaultBuildExecuter.java:61)
16:52:05.753 [ERROR] [org.gradle.BuildExceptionReporter] at org.gradle.ex
ecution.DefaultBuildExecuter.execute(DefaultBuildExecuter.java:54)
16:52:05.753 [ERROR] [org.gradle.BuildExceptionReporter] at org.gradle.in
itialization.DefaultGradleLauncher.doBuildStages(DefaultGradleLauncher.java:158)
16:52:05.753 [ERROR] [org.gradle.BuildExceptionReporter] at org.gradle.in
itialization.DefaultGradleLauncher.doBuild(DefaultGradleLauncher.java:113)
16:52:05.753 [ERROR] [org.gradle.BuildExceptionReporter] at org.gradle.in
itialization.DefaultGradleLauncher.run(DefaultGradleLauncher.java:81)
16:52:05.753 [ERROR] [org.gradle.BuildExceptionReporter] at org.gradle.la
uncher.cli.ExecuteBuildAction.run(ExecuteBuildAction.java:38)
16:52:05.753 [ERROR] [org.gradle.BuildExceptionReporter] at org.gradle.la
uncher.exec.InProcessGradleLauncherActionExecuter.execute(InProcessGradleLaunche
rActionExecuter.java:39)
16:52:05.753 [ERROR] [org.gradle.BuildExceptionReporter] at org.gradle.la
uncher.exec.InProcessGradleLauncherActionExecuter.execute(InProcessGradleLaunche
rActionExecuter.java:25)
16:52:05.753 [ERROR] [org.gradle.BuildExceptionReporter] at org.gradle.la
uncher.cli.RunBuildAction.run(RunBuildAction.java:50)
16:52:05.753 [ERROR] [org.gradle.BuildExceptionReporter] at org.gradle.la
uncher.cli.ActionAdapter.execute(ActionAdapter.java:30)
16:52:05.753 [ERROR] [org.gradle.BuildExceptionReporter] at org.gradle.la
uncher.cli.ActionAdapter.execute(ActionAdapter.java:22)
16:52:05.753 [ERROR] [org.gradle.BuildExceptionReporter] at org.gradle.la
uncher.cli.CommandLineActionFactory$ParseAndBuildAction.execute(CommandLineActio
nFactory.java:200)
16:52:05.753 [ERROR] [org.gradle.BuildExceptionReporter] at org.gradle.la
uncher.cli.CommandLineActionFactory$ParseAndBuildAction.execute(CommandLineActio
nFactory.java:173)
16:52:05.753 [ERROR] [org.gradle.BuildExceptionReporter] at org.gradle.la
uncher.cli.CommandLineActionFactory$WithLogging.execute(CommandLineActionFactory
.java:169)
16:52:05.753 [ERROR] [org.gradle.BuildExceptionReporter] at org.gradle.la
uncher.cli.CommandLineActionFactory$WithLogging.execute(CommandLineActionFactory
.java:138)
16:52:05.753 [ERROR] [org.gradle.BuildExceptionReporter] at org.gradle.la
uncher.cli.ExceptionReportingAction.execute(ExceptionReportingAction.java:33)
16:52:05.753 [ERROR] [org.gradle.BuildExceptionReporter] at org.gradle.la
uncher.cli.ExceptionReportingAction.execute(ExceptionReportingAction.java:22)
16:52:05.753 [ERROR] [org.gradle.BuildExceptionReporter] at org.gradle.la
uncher.Main.doAction(Main.java:48)
16:52:05.753 [ERROR] [org.gradle.BuildExceptionReporter] at org.gradle.la
uncher.bootstrap.EntryPoint.run(EntryPoint.java:45)
16:52:05.753 [ERROR] [org.gradle.BuildExceptionReporter] at org.gradle.la
uncher.Main.main(Main.java:39)
16:52:05.753 [ERROR] [org.gradle.BuildExceptionReporter] at org.gradle.la
uncher.bootstrap.ProcessBootstrap.runNoExit(ProcessBootstrap.java:50)
16:52:05.753 [ERROR] [org.gradle.BuildExceptionReporter] at org.gradle.la
uncher.bootstrap.ProcessBootstrap.run(ProcessBootstrap.java:32)
16:52:05.753 [ERROR] [org.gradle.BuildExceptionReporter] at org.gradle.la
uncher.GradleMain.main(GradleMain.java:26)
16:52:05.753 [ERROR] [org.gradle.BuildExceptionReporter] Caused by: org.gradle.p
rocess.internal.ExecException: Process 'command 'C:\Program Files\Java\jdk1.7.0_
10\bin\java.exe'' finished with non-zero exit value 1
16:52:05.753 [ERROR] [org.gradle.BuildExceptionReporter] at org.gradle.pr
ocess.internal.DefaultExecHandle$ExecResultImpl.assertNormalExitValue(DefaultExe
cHandle.java:363)
16:52:05.753 [ERROR] [org.gradle.BuildExceptionReporter] at org.gradle.pr
ocess.internal.DefaultJavaExecAction.execute(DefaultJavaExecAction.java:34)
16:52:05.753 [ERROR] [org.gradle.BuildExceptionReporter] at org.gradle.ap
i.tasks.JavaExec.exec(JavaExec.java:50)
16:52:05.753 [ERROR] [org.gradle.BuildExceptionReporter] at org.gradle.ap
i.internal.BeanDynamicObject$MetaClassAdapter.invokeMethod(BeanDynamicObject.jav
a:216)
16:52:05.753 [ERROR] [org.gradle.BuildExceptionReporter] at org.gradle.ap
i.internal.BeanDynamicObject.invokeMethod(BeanDynamicObject.java:122)
16:52:05.753 [ERROR] [org.gradle.BuildExceptionReporter] at org.gradle.ap
i.internal.CompositeDynamicObject.invokeMethod(CompositeDynamicObject.java:147)
16:52:05.753 [ERROR] [org.gradle.BuildExceptionReporter] at org.gradle.ap
i.tasks.JavaExec_Decorated.invokeMethod(Unknown Source)
16:52:05.753 [ERROR] [org.gradle.BuildExceptionReporter] at org.gradle.ut
il.ReflectionUtil.invoke(ReflectionUtil.groovy:23)
16:52:05.753 [ERROR] [org.gradle.BuildExceptionReporter] at org.gradle.ap
i.internal.project.taskfactory.AnnotationProcessingTaskFactory$4.execute(Annotat
ionProcessingTaskFactory.java:161)
16:52:05.753 [ERROR] [org.gradle.BuildExceptionReporter] at org.gradle.ap
i.internal.project.taskfactory.AnnotationProcessingTaskFactory$4.execute(Annotat
ionProcessingTaskFactory.java:156)
16:52:05.753 [ERROR] [org.gradle.BuildExceptionReporter] at org.gradle.ap
i.internal.AbstractTask$TaskActionWrapper.execute(AbstractTask.java:472)
16:52:05.753 [ERROR] [org.gradle.BuildExceptionReporter] at org.gradle.ap
i.internal.AbstractTask$TaskActionWrapper.execute(AbstractTask.java:461)
16:52:05.753 [ERROR] [org.gradle.BuildExceptionReporter] at org.gradle.ap
i.internal.tasks.execution.ExecuteActionsTaskExecuter.executeActions(ExecuteActi
onsTaskExecuter.java:60)
16:52:05.753 [ERROR] [org.gradle.BuildExceptionReporter] ... 80 more
16:52:05.753 [ERROR] [org.gradle.BuildExceptionReporter]
Sign up for free to join this conversation on GitHub. Already have an account? Sign in to comment
You can’t perform that action at this time.