Skip to content

Instantly share code, notes, and snippets.

/gist:6194508
Created Aug 9, 2013

Embed
What would you like to do?
Failures in cedarx-libs
/home/spenser/Code/buildroot_cubieboard/output/host/usr/bin/ccache /home/spenser/Code/buildroot_cubieboard/output/host/usr/bin/arm-linux-gnueabihf-gcc -I /home/spenser/Code/buildroot_cubieboard/output/build/sunxi-cedarx-74c3e9052/libcedarv/linux-armhf/libcedarv -I /home/spenser/Code/buildroot_cubieboard/output/build/sunxi-cedarx-74c3e9052/libcedarv/linux-armhf/libvecore -I /home/spenser/Code/buildroot_cubieboard/output/build/sunxi-cedarx-74c3e9052/old/a10_h264_encode -D_LARGEFILE_SOURCE -D_LARGEFILE64_SOURCE -D_FILE_OFFSET_BITS=64 -c -o capture/capture.o capture/capture.c
main.c:8:26: fatal error: encoder_type.h: No such file or directory
#include "encoder_type.h"
^
compilation terminated.
make[1]: *** [main.o] Error 1
make[1]: *** Waiting for unfinished jobs....
decode/decode_api.c: In function ‘decode_update_data_from_enc’:
decode/decode_api.c:78:4: warning: incompatible implicit declaration of built-in function ‘memset’ [enabled by default]
memset(&stream_data_info, 0, sizeof(cedarv_stream_data_info_t));
^
decode/decode_api.c:117:3: warning: incompatible implicit declaration of built-in function ‘memset’ [enabled by default]
memset(&stream_data_info, 0, sizeof(cedarv_stream_data_info_t));
^
render/render.c: In function ‘config_de_parameter’:
render/render.c:121:3: warning: return makes integer from pointer without a cast [enabled by default]
return NULL;
^
render/render.c: In function ‘render_render’:
render/render.c:244:24: warning: assignment makes integer from pointer without a cast [enabled by default]
tmpFrmBufAddr.addr[0] = display_info->y;
^
render/render.c:245:24: warning: assignment makes integer from pointer without a cast [enabled by default]
tmpFrmBufAddr.addr[1] = display_info->u;
^
capture/capture.c:17:28: fatal error: linux/videodev.h: No such file or directory
#include <linux/videodev.h>
^
compilation terminated.
make[1]: *** [capture/capture.o] Error 1
make[1]: Leaving directory `/home/spenser/Code/buildroot_cubieboard/output/build/sunxi-cedarx-74c3e9052/enc_dec_demo'
make: *** [/home/spenser/Code/buildroot_cubieboard/output/build/sunxi-cedarx-74c3e9052/.stamp_built] Error 2
Sign up for free to join this conversation on GitHub. Already have an account? Sign in to comment
You can’t perform that action at this time.