Skip to content

Instantly share code, notes, and snippets.

/gist:6467075
Created Sep 6, 2013

Embed
What would you like to do?
/home/spenser/Code/buildroot_exynos/output/host/usr/bin/ccache /home/spenser/Code/buildroot_exynos/output/host/usr/bin/arm-buildroot-linux-gnueabihf-gcc -g -Os -fno-common -ffixed-r8 -msoft-float -D__KERNEL__ -DCONFIG_SYS_TEXT_BASE=0xc3e00000 -I/home/spenser/Code/buildroot_exynos/output/build/uboot-93e4165e5db5aecc0cba5599554edd7a74d8a1f2/include -fno-builtin -ffreestanding -nostdinc -isystem /home/spenser/Code/buildroot_exynos/output/host/usr/lib/gcc/arm-buildroot-linux-gnueabihf/4.7.3/include -pipe -DCONFIG_ARM -D__ARM__ -marm -mabi=aapcs-linux -mno-thumb-interwork -march=armv7-a -Wall -Wstrict-prototypes -fno-stack-protector \
-o smdk4212.o smdk4212.c -c
/home/spenser/Code/buildroot_exynos/output/host/usr/bin/ccache /home/spenser/Code/buildroot_exynos/output/host/usr/bin/arm-buildroot-linux-gnueabihf-gcc -g -Os -fno-common -ffixed-r8 -msoft-float -D__KERNEL__ -DCONFIG_SYS_TEXT_BASE=0xc3e00000 -I/home/spenser/Code/buildroot_exynos/output/build/uboot-93e4165e5db5aecc0cba5599554edd7a74d8a1f2/include -fno-builtin -ffreestanding -nostdinc -isystem /home/spenser/Code/buildroot_exynos/output/host/usr/lib/gcc/arm-buildroot-linux-gnueabihf/4.7.3/include -pipe -DCONFIG_ARM -D__ARM__ -marm -mabi=aapcs-linux -mno-thumb-interwork -march=armv7-a -Wall -Wstrict-prototypes -fno-stack-protector \
-o smc.o smc.c -c
In file included from smdk4212.c:14:0:
/home/spenser/Code/buildroot_exynos/output/build/uboot-93e4165e5db5aecc0cba5599554edd7a74d8a1f2/include/asm/arch/cpu.h:522:1: warning: multi-line comment [-Wcomment]
In file included from smdk4212.c:15:0:
/home/spenser/Code/buildroot_exynos/output/build/uboot-93e4165e5db5aecc0cba5599554edd7a74d8a1f2/include/asm/arch/gpio.h:447:1: warning: function declaration isn’t a prototype [-Wstrict-prototypes]
smdk4212.c: In function ‘board_init’:
smdk4212.c:141:2: warning: implicit declaration of function ‘pmic_read’ [-Wimplicit-function-declaration]
smdk4212.c: In function ‘dram_init_banksize’:
smdk4212.c:249:41: warning: integer overflow in expression [-Woverflow]
smdk4212.c:251:41: warning: integer overflow in expression [-Woverflow]
smdk4212.c:253:41: warning: integer overflow in expression [-Woverflow]
smdk4212.c:255:41: warning: integer overflow in expression [-Woverflow]
smdk4212.c: In function ‘board_eth_init’:
smdk4212.c:268:2: warning: implicit declaration of function ‘smc911x_initialize’ [-Wimplicit-function-declaration]
smdk4212.c: In function ‘board_mmc_init’:
smdk4212.c:321:2: warning: implicit declaration of function ‘setup_hsmmc_clock’ [-Wimplicit-function-declaration]
smdk4212.c:322:2: warning: implicit declaration of function ‘setup_hsmmc_cfg_gpio’ [-Wimplicit-function-declaration]
smdk4212.c:324:3: warning: implicit declaration of function ‘smdk_s5p_mshc_init’ [-Wimplicit-function-declaration]
smdk4212.c:325:3: warning: implicit declaration of function ‘smdk_s3c_hsmmc_init’ [-Wimplicit-function-declaration]
In file included from smc.c:9:0:
/home/spenser/Code/buildroot_exynos/output/build/uboot-93e4165e5db5aecc0cba5599554edd7a74d8a1f2/include/asm/arch/cpu.h:522:1: warning: multi-line comment [-Wcomment]
{standard input}: Assembler messages:
{standard input}:77: Error: selected processor does not support ARM mode `smc 0'
{standard input}:155: Error: selected processor does not support ARM mode `smc 0'
{standard input}:199: Error: selected processor does not support ARM mode `smc 0'
{standard input}:235: Error: selected processor does not support ARM mode `smc 0'
{standard input}:276: Error: selected processor does not support ARM mode `smc 0'
make[2]: *** [smc.o] Error 1
make[2]: Leaving directory `/home/spenser/Code/buildroot_exynos/output/build/uboot-93e4165e5db5aecc0cba5599554edd7a74d8a1f2/board/samsung/smdk4212'
make[1]: *** [board/samsung/smdk4212/libsmdk4212.o] Error 2
make[1]: Leaving directory `/home/spenser/Code/buildroot_exynos/output/build/uboot-93e4165e5db5aecc0cba5599554edd7a74d8a1f2'
make: *** [/home/spenser/Code/buildroot_exynos/output/build/uboot-93e4165e5db5aecc0cba5599554edd7a74d8a1f2/.stamp_built] Error 2
Sign up for free to join this conversation on GitHub. Already have an account? Sign in to comment
You can’t perform that action at this time.