Skip to content

Instantly share code, notes, and snippets.

Embed
What would you like to do?
dpkg-buildpackage -rfakeroot -D -us -uc
dpkg-buildpackage: source package opendylan
dpkg-buildpackage: source version 2014.1-1
dpkg-buildpackage: source distribution unstable
dpkg-buildpackage: source changed by Faheem Mitha <faheem@faheem.info>
dpkg-source --before-build opendylan-2014.1
dpkg-buildpackage: host architecture amd64
fakeroot debian/rules clean
#dh clean --with autoreconf
dh clean
dh_testdir
dh_auto_clean
dh_clean
dpkg-source -b opendylan-2014.1
dpkg-source: info: using source format `3.0 (quilt)'
dpkg-source: info: building opendylan using existing ./opendylan_2014.1.orig.tar.bz2
dpkg-source: info: building opendylan in opendylan_2014.1-1.debian.tar.xz
dpkg-source: info: building opendylan in opendylan_2014.1-1.dsc
debian/rules build
#dh build --with autoreconf
dh build
dh_testdir
debian/rules override_dh_auto_configure
make[1]: Entering directory '/usr/local/src/opendylan/opendylan-2014.1'
./autogen.sh
*** Hello, there! ***
*** Please ignore errors and warnings from automake. ***
*** Thanks! ***
configure.ac:101: installing 'build-aux/compile'
configure.ac:19: installing 'build-aux/config.guess'
configure.ac:19: installing 'build-aux/config.sub'
configure.ac:61: installing 'build-aux/install-sh'
configure.ac:61: installing 'build-aux/missing'
automake: error: no 'Makefile.am' found for any configure output
PATH=/usr/local/src/opendylan/opendylan-2014.1.bin/bin:$PATH ./configure
checking build system type... x86_64-unknown-linux-gnu
checking host system type... x86_64-unknown-linux-gnu
checking target system type... x86_64-unknown-linux-gnu
checking for a BSD-compatible install... /usr/bin/install -c
checking whether build environment is sane... yes
checking for a thread-safe mkdir -p... /bin/mkdir -p
checking for gawk... gawk
checking whether make sets $(MAKE)... yes
checking whether make supports nested variables... yes
checking whether ln -s works... yes
checking for perl... /usr/bin/perl
checking for Perl module File::Spec... yes
checking for Perl module Getopt::Long... yes
checking for dylan-compiler... dylan-compiler
checking if dylan-compiler supports the -verbose flag... yes
checking for clang... clang
checking whether the C compiler works... yes
checking for C compiler default output file name... a.out
checking for suffix of executables...
checking whether we are cross compiling... no
checking for suffix of object files... o
checking whether we are using the GNU C compiler... yes
checking whether clang accepts -g... yes
checking for clang option to accept ISO C89... none needed
checking whether clang understands -c and -o together... yes
checking for style of include used by make... GNU
checking dependency style of clang... none
checking for gnumake... no
checking for gmake... no
checking for make... make
checking which GC to use... boehm
checking which GC path to use... none specified
checking how to run the C preprocessor... clang -E
checking for grep that handles long lines and -e... /bin/grep
checking for egrep... /bin/grep -E
checking for ANSI C header files... yes
checking for sys/types.h... yes
checking for sys/stat.h... yes
checking for stdlib.h... yes
checking for string.h... yes
checking for memory.h... yes
checking for strings.h... yes
checking for inttypes.h... yes
checking for stdint.h... yes
checking for unistd.h... yes
checking for GC_malloc in -lgc... yes
checking if we should disable C compiler warnings for generated code... no
checking that generated files are newer than configure... done
configure: creating ./config.status
config.status: creating Makefile
config.status: creating sources/jamfiles/Makefile
config.status: creating sources/jamfiles/config.jam
config.status: creating sources/lib/run-time/Makefile
config.status: executing depfiles commands
make[1]: Leaving directory '/usr/local/src/opendylan/opendylan-2014.1'
debian/rules override_dh_auto_build
make[1]: Entering directory '/usr/local/src/opendylan/opendylan-2014.1'
PATH=/usr/local/src/opendylan/opendylan-2014.1.bin/bin:$PATH make
make[2]: Entering directory '/usr/local/src/opendylan/opendylan-2014.1'
make 3-stage-bootstrap-reentry \
BOOTSTRAP_2_COMPILER="/usr/local/src/opendylan/opendylan-2014.1/Bootstrap.1/bin/dylan-compiler -build -verbose"
make[3]: Entering directory '/usr/local/src/opendylan/opendylan-2014.1'
mkdir /usr/local/src/opendylan/opendylan-2014.1/Bootstrap.1
mkdir /usr/local/src/opendylan/opendylan-2014.1/Bootstrap.1/bin
mkdir /usr/local/src/opendylan/opendylan-2014.1/Bootstrap.1/lib
mkdir /usr/local/src/opendylan/opendylan-2014.1/Bootstrap.1/lib/runtime
mkdir /usr/local/src/opendylan/opendylan-2014.1/Bootstrap.1/build
mkdir /usr/local/src/opendylan/opendylan-2014.1/Bootstrap.1/build/logs
mkdir /usr/local/src/opendylan/opendylan-2014.1/sources/bootstrap1-registry
cp -r /usr/local/src/opendylan/opendylan-2014.1/sources/registry/generic /usr/local/src/opendylan/opendylan-2014.1/sources/bootstrap1-registry
cp -r /usr/local/src/opendylan/opendylan-2014.1/sources/registry/x86_64-linux /usr/local/src/opendylan/opendylan-2014.1/sources/bootstrap1-registry
for lib in dylan functional-extensions machine-word byte-vector threads transcendentals functional-dylan common-extensions common-dylan unix-portability c-ffi bit-vector bit-set collectors plists set table-extensions collections streams standard-io print format format-out io date file-system operating-system locators settings system generic-arithmetic big-integers duim-utilities duim-geometry duim-dcs duim-sheets duim-graphics duim-layouts duim-gadgets duim-frames duim-core duim-extended-geometry duim-gadget-panes duim winsock2 sockets network midi deuce duim-deuce com ole ole-server sql odbc-ffi sql-odbc corba-dylan corba-protocol dylan-orb iop-protocol ir-protocol ir-stubs orb-connections orb-core orb-iiop orb-ir orb-poa orb-streams orb-utilities portableserver-protocol naming-protocol naming-stubs naming-client; do \
rm -f /usr/local/src/opendylan/opendylan-2014.1/sources/bootstrap1-registry/generic/$lib; \
rm -f /usr/local/src/opendylan/opendylan-2014.1/sources/bootstrap1-registry/x86_64-linux/$lib; \
done
Building Open Dylan bootstrap stage 1...
make[4]: Entering directory '/usr/local/src/opendylan/opendylan-2014.1/sources/jamfiles'
mkdir -p /usr/local/src/opendylan/opendylan-2014.1/Bootstrap.1/share/opendylan/build-scripts
cp config.jam /usr/local/src/opendylan/opendylan-2014.1/sources/jamfiles/mini-jambase.jam /usr/local/src/opendylan/opendylan-2014.1/sources/jamfiles/posix-build.jam /usr/local/src/opendylan/opendylan-2014.1/sources/jamfiles/shared-darwin-build.jam /usr/local/src/opendylan/opendylan-2014.1/sources/jamfiles/x86-darwin-build.jam /usr/local/src/opendylan/opendylan-2014.1/sources/jamfiles/x86_64-darwin-build.jam /usr/local/src/opendylan/opendylan-2014.1/sources/jamfiles/x86-freebsd-build.jam /usr/local/src/opendylan/opendylan-2014.1/sources/jamfiles/x86_64-freebsd-build.jam /usr/local/src/opendylan/opendylan-2014.1/sources/jamfiles/x86-linux-build.jam /usr/local/src/opendylan/opendylan-2014.1/sources/jamfiles/x86_64-linux-build.jam /usr/local/src/opendylan/opendylan-2014.1/sources/jamfiles/arm-linux-build.jam /usr/local/src/opendylan/opendylan-2014.1/Bootstrap.1/share/opendylan/build-scripts
make[4]: Leaving directory '/usr/local/src/opendylan/opendylan-2014.1/sources/jamfiles'
make[4]: Entering directory '/usr/local/src/opendylan/opendylan-2014.1/sources/lib/run-time'
mkdir -p obj-x86_64-linux-c
clang -m64 -fPIC -D_REENTRANT=1 -D_GNU_SOURCE -DOPEN_DYLAN_PLATFORM_LINUX -DOPEN_DYLAN_PLATFORM_UNIX -DOPEN_DYLAN_ARCH_X86_64 -Wall -O -g -DGC_USE_BOEHM -DGC_THREADS -I/usr/local/src/opendylan/opendylan-2014.1/sources/lib/run-time -MMD -c -o obj-x86_64-linux-c/break.o /usr/local/src/opendylan/opendylan-2014.1/sources/lib/run-time/break.c
mkdir -p obj-x86_64-linux-c
clang -m64 -fPIC -D_REENTRANT=1 -D_GNU_SOURCE -DOPEN_DYLAN_PLATFORM_LINUX -DOPEN_DYLAN_PLATFORM_UNIX -DOPEN_DYLAN_ARCH_X86_64 -Wall -O -g -DGC_USE_BOEHM -DGC_THREADS -I/usr/local/src/opendylan/opendylan-2014.1/sources/lib/run-time -MMD -c -o obj-x86_64-linux-c/collector.o /usr/local/src/opendylan/opendylan-2014.1/sources/lib/run-time/collector.c
mkdir -p obj-x86_64-linux-c
clang -m64 -fPIC -D_REENTRANT=1 -D_GNU_SOURCE -DOPEN_DYLAN_PLATFORM_LINUX -DOPEN_DYLAN_PLATFORM_UNIX -DOPEN_DYLAN_ARCH_X86_64 -Wall -O -g -DGC_USE_BOEHM -DGC_THREADS -I/usr/local/src/opendylan/opendylan-2014.1/sources/lib/run-time -MMD -c -o obj-x86_64-linux-c/debug-print.o /usr/local/src/opendylan/opendylan-2014.1/sources/lib/run-time/debug-print.c
mkdir -p obj-x86_64-linux-c
clang -m64 -fPIC -D_REENTRANT=1 -D_GNU_SOURCE -DOPEN_DYLAN_PLATFORM_LINUX -DOPEN_DYLAN_PLATFORM_UNIX -DOPEN_DYLAN_ARCH_X86_64 -Wall -O -g -DGC_USE_BOEHM -DGC_THREADS -I/usr/local/src/opendylan/opendylan-2014.1/sources/lib/run-time -MMD -c -o obj-x86_64-linux-c/trace.o /usr/local/src/opendylan/opendylan-2014.1/sources/lib/run-time/trace.c
mkdir -p obj-x86_64-linux-c
clang -m64 -fPIC -D_REENTRANT=1 -D_GNU_SOURCE -DOPEN_DYLAN_PLATFORM_LINUX -DOPEN_DYLAN_PLATFORM_UNIX -DOPEN_DYLAN_ARCH_X86_64 -Wall -O -g -DGC_USE_BOEHM -DGC_THREADS -I/usr/local/src/opendylan/opendylan-2014.1/sources/lib/run-time -MMD -c -o obj-x86_64-linux-c/unix-spy-interfaces.o /usr/local/src/opendylan/opendylan-2014.1/sources/lib/run-time/unix-spy-interfaces.c
mkdir -p obj-x86_64-linux-c
clang -m64 -fPIC -D_REENTRANT=1 -D_GNU_SOURCE -DOPEN_DYLAN_PLATFORM_LINUX -DOPEN_DYLAN_PLATFORM_UNIX -DOPEN_DYLAN_ARCH_X86_64 -Wall -O -g -DGC_USE_BOEHM -DGC_THREADS -I/usr/local/src/opendylan/opendylan-2014.1/sources/lib/run-time -MMD -c -o obj-x86_64-linux-c/unix-support.o /usr/local/src/opendylan/opendylan-2014.1/sources/lib/run-time/unix-support.c
mkdir -p obj-x86_64-linux-c
clang -m64 -fPIC -D_REENTRANT=1 -D_GNU_SOURCE -DOPEN_DYLAN_PLATFORM_LINUX -DOPEN_DYLAN_PLATFORM_UNIX -DOPEN_DYLAN_ARCH_X86_64 -Wall -O -g -DGC_USE_BOEHM -DGC_THREADS -I/usr/local/src/opendylan/opendylan-2014.1/sources/lib/run-time -MMD -c -o obj-x86_64-linux-c/c-run-time.o /usr/local/src/opendylan/opendylan-2014.1/sources/lib/run-time/c-run-time.c
/usr/local/src/opendylan/opendylan-2014.1/sources/lib/run-time/c-run-time.c:545:36: warning: unused function 'signature_values' [-Wunused-function]
INLINE dylan_simple_object_vector* signature_values(dylan_signature* sig) {
^
/usr/local/src/opendylan/opendylan-2014.1/sources/lib/run-time/c-run-time.c:549:20: warning: unused function 'signature_rest_value' [-Wunused-function]
INLINE dylan_value signature_rest_value(dylan_signature* sig) {
^
/usr/local/src/opendylan/opendylan-2014.1/sources/lib/run-time/c-run-time.c:597:20: warning: unused function 'signature_make_properties' [-Wunused-function]
INLINE dylan_value signature_make_properties
^
/usr/local/src/opendylan/opendylan-2014.1/sources/lib/run-time/c-run-time.c:618:13: warning: unused function 'function_mep' [-Wunused-function]
INLINE DLFN function_mep(dylan_simple_method* function) {
^
/usr/local/src/opendylan/opendylan-2014.1/sources/lib/run-time/c-run-time.c:642:12: warning: unused function 'function_number_values' [-Wunused-function]
INLINE int function_number_values(dylan_simple_method* function) {
^
/usr/local/src/opendylan/opendylan-2014.1/sources/lib/run-time/c-run-time.c:646:12: warning: unused function 'function_key_p' [-Wunused-function]
INLINE int function_key_p(dylan_simple_method* function) {
^
/usr/local/src/opendylan/opendylan-2014.1/sources/lib/run-time/c-run-time.c:654:12: warning: unused function 'function_rest_p' [-Wunused-function]
INLINE int function_rest_p(dylan_simple_method* function) {
^
/usr/local/src/opendylan/opendylan-2014.1/sources/lib/run-time/c-run-time.c:663:12: warning: unused function 'function_rest_value_p' [-Wunused-function]
INLINE int function_rest_value_p(dylan_simple_method* function) {
^
/usr/local/src/opendylan/opendylan-2014.1/sources/lib/run-time/c-run-time.c:667:12: warning: unused function 'function_next_p' [-Wunused-function]
INLINE int function_next_p(dylan_simple_method* function) {
^
/usr/local/src/opendylan/opendylan-2014.1/sources/lib/run-time/c-run-time.c:1418:13: warning: unused function 'process_keyword_parameters_into_with_checking' [-Wunused-function]
INLINE void process_keyword_parameters_into_with_checking
^
10 warnings generated.
mkdir -p obj-x86_64-linux-c
clang -m64 -fPIC -D_REENTRANT=1 -D_GNU_SOURCE -DOPEN_DYLAN_PLATFORM_LINUX -DOPEN_DYLAN_PLATFORM_UNIX -DOPEN_DYLAN_ARCH_X86_64 -Wall -O -g -DGC_USE_BOEHM -DGC_THREADS -I/usr/local/src/opendylan/opendylan-2014.1/sources/lib/run-time -MMD -c -o obj-x86_64-linux-c/c-support.o /usr/local/src/opendylan/opendylan-2014.1/sources/lib/run-time/c-support.c
mkdir -p obj-x86_64-linux-c
clang -m64 -fPIC -D_REENTRANT=1 -D_GNU_SOURCE -DOPEN_DYLAN_PLATFORM_LINUX -DOPEN_DYLAN_PLATFORM_UNIX -DOPEN_DYLAN_ARCH_X86_64 -Wall -O -g -DGC_USE_BOEHM -DGC_THREADS -I/usr/local/src/opendylan/opendylan-2014.1/sources/lib/run-time -MMD -c -o obj-x86_64-linux-c/c-primitives-debug.o /usr/local/src/opendylan/opendylan-2014.1/sources/lib/run-time/c-primitives-debug.c
mkdir -p obj-x86_64-linux-c
clang -m64 -fPIC -D_REENTRANT=1 -D_GNU_SOURCE -DOPEN_DYLAN_PLATFORM_LINUX -DOPEN_DYLAN_PLATFORM_UNIX -DOPEN_DYLAN_ARCH_X86_64 -Wall -O -g -DGC_USE_BOEHM -DGC_THREADS -I/usr/local/src/opendylan/opendylan-2014.1/sources/lib/run-time -MMD -c -o obj-x86_64-linux-c/c-primitives-math.o /usr/local/src/opendylan/opendylan-2014.1/sources/lib/run-time/c-primitives-math.c
mkdir -p obj-x86_64-linux-c
clang -m64 -fPIC -D_REENTRANT=1 -D_GNU_SOURCE -DOPEN_DYLAN_PLATFORM_LINUX -DOPEN_DYLAN_PLATFORM_UNIX -DOPEN_DYLAN_ARCH_X86_64 -Wall -O -g -DGC_USE_BOEHM -DGC_THREADS -I/usr/local/src/opendylan/opendylan-2014.1/sources/lib/run-time -MMD -c -o obj-x86_64-linux-c/c-run-time-nlx.o /usr/local/src/opendylan/opendylan-2014.1/sources/lib/run-time/c-run-time-nlx.c
mkdir -p obj-x86_64-linux-c
clang -m64 -fPIC -D_REENTRANT=1 -D_GNU_SOURCE -DOPEN_DYLAN_PLATFORM_LINUX -DOPEN_DYLAN_PLATFORM_UNIX -DOPEN_DYLAN_ARCH_X86_64 -Wall -O -g -DGC_USE_BOEHM -DGC_THREADS -I/usr/local/src/opendylan/opendylan-2014.1/sources/lib/run-time -MMD -c -o obj-x86_64-linux-c/posix-threads.o /usr/local/src/opendylan/opendylan-2014.1/sources/lib/run-time/posix-threads.c
/usr/local/src/opendylan/opendylan-2014.1/sources/lib/run-time/posix-threads.c:1693:12: warning: unused function 'priority_map' [-Wunused-function]
static int priority_map(int dylan_priority)
^
/usr/local/src/opendylan/opendylan-2014.1/sources/lib/run-time/posix-threads.c:243:35: warning: unused function 'get_current_thread_handle' [-Wunused-function]
PURE_FUNCTION static inline void *get_current_thread_handle(void)
^
2 warnings generated.
ar -rcs obj-x86_64-linux-c/libdylan-c-runtime.a obj-x86_64-linux-c/break.o obj-x86_64-linux-c/collector.o obj-x86_64-linux-c/debug-print.o obj-x86_64-linux-c/trace.o obj-x86_64-linux-c/unix-spy-interfaces.o obj-x86_64-linux-c/unix-support.o obj-x86_64-linux-c/c-run-time.o obj-x86_64-linux-c/c-support.o obj-x86_64-linux-c/c-primitives-debug.o obj-x86_64-linux-c/c-primitives-math.o obj-x86_64-linux-c/c-run-time-nlx.o obj-x86_64-linux-c/posix-threads.o
mkdir -p /usr/local/src/opendylan/opendylan-2014.1/Bootstrap.1/lib/runtime/c-x86_64-linux
mkdir -p /usr/local/src/opendylan/opendylan-2014.1/Bootstrap.1/include/opendylan
cp -fp obj-x86_64-linux-c/libdylan-c-runtime.a /usr/local/src/opendylan/opendylan-2014.1/Bootstrap.1/lib/runtime/c-x86_64-linux
cp -fp /usr/local/src/opendylan/opendylan-2014.1/sources/lib/run-time/trace.h /usr/local/src/opendylan/opendylan-2014.1/Bootstrap.1/include/opendylan
cp -fp /usr/local/src/opendylan/opendylan-2014.1/sources/lib/run-time/run-time.h /usr/local/src/opendylan/opendylan-2014.1/Bootstrap.1/include/opendylan
make[4]: Leaving directory '/usr/local/src/opendylan/opendylan-2014.1/sources/lib/run-time'
Building commands...
/usr/local/src/opendylan/opendylan-2014.1.bin/sources/dylan/collection.dylan:341-344: Warning - Multiple applicable copy-down methods for method map-as-one (type :: subclass(<vector>), function :: <function>, collection :: <explicit-key-collection>, #next next-method :: <object>) => (new-collection :: <vector>), picking one at random
/usr/local/src/opendylan/opendylan-2014.1.bin/sources/dylan/collection.dylan:346-349: Warning - Multiple applicable copy-down methods for method map-as-one (type :: singleton(<list>), function :: <function>, collection :: <explicit-key-collection>, #next next-method :: <object>) => (new-collection :: <vector>), picking one at random
/usr/local/src/opendylan/opendylan-2014.1.bin/sources/dylan/collection.dylan:415-417: Warning - Multiple applicable copy-down methods for method map-into-stretchy-one (fun :: <function>, target :: <mutable-collection>, coll :: <sequence>, #next next-method :: <object>) => (target :: <mutable-collection>), picking one at random
/usr/local/src/opendylan/opendylan-2014.1.bin/sources/dylan/collection.dylan:588-590: Warning - Multiple applicable copy-down methods for method map-into-rigid-one (fun :: <function>, target :: <mutable-collection>, coll :: <list>, #next next-method :: <object>) => (target :: <mutable-collection>), picking one at random
/usr/local/src/opendylan/opendylan-2014.1.bin/sources/dylan/collection.dylan:591-593: Warning - Multiple applicable copy-down methods for method map-into-rigid-one (fun :: <function>, target :: <mutable-collection>, coll :: <simple-object-vector>, #next next-method :: <object>) => (target :: <mutable-collection>), picking one at random
/usr/local/src/opendylan/opendylan-2014.1.bin/sources/dylan/collection.dylan:664-666: Warning - Multiple applicable copy-down methods for method map-into-rigid-one (fun :: <function>, target :: <mutable-sequence>, coll :: <list>, #next next-method :: <object>) => (target :: <mutable-collection>), picking one at random
/usr/local/src/opendylan/opendylan-2014.1.bin/sources/dylan/collection.dylan:667-669: Warning - Multiple applicable copy-down methods for method map-into-rigid-one (fun :: <function>, target :: <mutable-sequence>, coll :: <simple-object-vector>, #next next-method :: <object>) => (target :: <mutable-collection>), picking one at random
/usr/local/src/opendylan/opendylan-2014.1.bin/sources/dylan/stretchy-vector.dylan:664-666: Warning - Multiple applicable copy-down methods for method map-into-rigid-one (fun :: <function>, target :: <mutable-collection>, coll :: <stretchy-object-vector>, #next next-method :: <object>) => (target :: <mutable-collection>), picking one at random
/usr/local/src/opendylan/opendylan-2014.1.bin/sources/dylan/stretchy-vector.dylan:668-670: Warning - Multiple applicable copy-down methods for method map-into-rigid-one (fun :: <function>, target :: <mutable-sequence>, coll :: <stretchy-object-vector>, #next next-method :: <object>) => (target :: <mutable-collection>), picking one at random
/usr/local/src/opendylan/opendylan-2014.1.bin/sources/dylan/deque.dylan:680-683: Warning - Multiple applicable copy-down methods for method map-as-one (type :: singleton(<deque>), function :: <function>, collection :: <infinite-range>, #next next-method :: <object>) => (new-collection :: <vector>), picking one at random
/usr/local/src/opendylan/opendylan-2014.1.bin/sources/dylan/deque.dylan:684-687: Warning - Multiple applicable copy-down methods for method map-as-one (type :: singleton(<object-deque>), function :: <function>, collection :: <infinite-range>, #next next-method :: <object>) => (new-collection :: <vector>), picking one at random
/usr/local/src/opendylan/opendylan-2014.1.bin/sources/dylan/deque.dylan:689-692: Warning - Multiple applicable copy-down methods for method map-as-one (type :: singleton(<deque>), function :: <function>, collection :: <explicit-key-collection>, #next next-method :: <object>) => (new-collection :: <vector>), picking one at random
/usr/local/src/opendylan/opendylan-2014.1.bin/sources/dylan/deque.dylan:694-697: Warning - Multiple applicable copy-down methods for method map-as-one (type :: singleton(<object-deque>), function :: <function>, collection :: <explicit-key-collection>, #next next-method :: <object>) => (new-collection :: <vector>), picking one at random
/usr/local/src/opendylan/opendylan-2014.1.bin/sources/dylan/range.dylan:879-881: Warning - Multiple applicable copy-down methods for method map-as-one (type :: singleton(<list>), function :: <function>, collection :: <infinite-range>, #next next-method :: <object>) => (new-collection :: <vector>), picking one at random
/usr/local/src/opendylan/opendylan-2014.1.bin/sources/dylan/table.dylan:873: Serious warning - Invalid type for argument new-key in call to entry-key-setter (new-key :: <object>, v :: <entry-keys>, index :: <integer>) => (new-key :: <object>): <raw-pointer> supplied, <object> expected.
/usr/local/src/opendylan/opendylan-2014.1.bin/sources/dylan/table.dylan:873: Serious warning - Invalid type for argument new-key in call to entry-key-setter (new-key :: <object>, v :: <entry-keys>, index :: <integer>) => (new-key :: <object>): <raw-pointer> supplied, <object> expected.
/usr/local/src/opendylan/opendylan-2014.1.bin/sources/dylan/table.dylan:873: Serious warning - Invalid type for argument new-key in call to entry-key-setter (new-key :: <object>, v :: <entry-keys>, index :: <integer>) => (new-key :: <object>): <raw-pointer> supplied, <object> expected.
16 W, 3 SW, 0 E (177.492 seconds)
Building walker...
/usr/local/src/opendylan/opendylan-2014.1.bin/sources/collections/bit-set.dylan:428-433: Warning - Result type check can fail - values(<raw-machine-word>) inferred, values(<object>) expected.
/usr/local/src/opendylan/opendylan-2014.1.bin/sources/collections/bit-set.dylan:423-426: Warning - Result type check can fail - values(<raw-address>) inferred, values(<object>) expected.
2 W, 0 SW, 0 E (54.894 seconds)
Building dfmc-mangling... 0 W, 0 SW, 0 E (5.312 seconds)
Building variable-search...
/usr/local/src/opendylan/opendylan-2014.1/sources/lib/variable-search/unix-variable-value.dylan:44: Warning - Result type check can fail - values(<raw-pointer>) inferred, values(<object>) expected.
1 W, 0 SW, 0 E (2.348 seconds)
Building dood...
/usr/local/src/opendylan/opendylan-2014.1/sources/lib/dood/object.dylan:405: Warning - Type check can fail - singleton(#f :: <boolean>) inferred, <class> expected.
/usr/local/src/opendylan/opendylan-2014.1/sources/lib/dood/object.dylan:405: Warning - Type check can fail - <byte-character> inferred, <class> expected.
/usr/local/src/opendylan/opendylan-2014.1/sources/lib/dood/object.dylan:405: Warning - Type check can fail - <integer> inferred, <class> expected.
3 W, 0 SW, 0 E (68.906 seconds)
Building source-records... 0 W, 0 SW, 0 E (4.480 seconds)
Building ppml... 0 W, 0 SW, 0 E (5.252 seconds)
Building dfmc-common... 0 W, 0 SW, 0 E (15.162 seconds)
Building file-source-records... 0 W, 0 SW, 0 E (5.198 seconds)
Building release-info... 0 W, 0 SW, 0 E (7.893 seconds)
Building channels... 0 W, 0 SW, 0 E (2.910 seconds)
Building memory-manager... 0 W, 0 SW, 0 E (2.705 seconds)
Building cl... 0 W, 0 SW, 0 E (9.552 seconds)
Building environment-protocols... 0 W, 0 SW, 0 E (45.491 seconds)
Building parser-run-time... 0 W, 0 SW, 0 E (3.742 seconds)
Building jam... 0 W, 0 SW, 0 E (23.176 seconds)
Building build-system... 0 W, 0 SW, 0 E (4.714 seconds)
Building environment-manager... 0 W, 0 SW, 0 E (6.562 seconds)
Building environment-reports... 0 W, 0 SW, 0 E (18.100 seconds)
Building source-control-manager... 0 W, 0 SW, 0 E (4.428 seconds)
Building dfmc-conditions... 0 W, 0 SW, 0 E (6.353 seconds)
Building dfmc-reader... 0 W, 0 SW, 0 E (61.289 seconds)
Building dfmc-macro-expander... 0 W, 0 SW, 0 E (26.784 seconds)
Building dfmc-namespace... 0 W, 0 SW, 0 E (38.377 seconds)
Building dfmc-definitions... 0 W, 0 SW, 0 E (60.844 seconds)
Building dfmc-modeling... 0 W, 0 SW, 0 E (93.496 seconds)
Building dfmc-flow-graph... 0 W, 0 SW, 0 E (35.815 seconds)
Building dfmc-core... 0 W, 0 SW, 0 E (3.352 seconds)
Building dfmc-typist... 0 W, 0 SW, 0 E (22.529 seconds)
Building dfmc-conversion... 0 W, 0 SW, 0 E (59.780 seconds)
Building dfmc-c-ffi... 0 W, 0 SW, 0 E (54.033 seconds)
Building dfmc-back-end-protocol... 0 W, 0 SW, 0 E (3.296 seconds)
Building dfmc-back-end... 0 W, 0 SW, 0 E (23.291 seconds)
Building dfmc-optimization... 0 W, 0 SW, 0 E (40.177 seconds)
Building dfmc-linker... 0 W, 0 SW, 0 E (3.940 seconds)
Building dfmc-management... 0 W, 0 SW, 0 E (22.908 seconds)
Building dfmc-browser-support... 0 W, 0 SW, 0 E (11.669 seconds)
Building projects... 0 W, 0 SW, 0 E (16.802 seconds)
Building registry-projects... 0 W, 0 SW, 0 E (7.153 seconds)
Building tools-interface... 0 W, 0 SW, 0 E (5.054 seconds)
Building user-projects... 0 W, 0 SW, 0 E (18.162 seconds)
Building dfmc-debug-back-end... 0 W, 0 SW, 0 E (14.402 seconds)
Building dfmc-environment-database... 0 W, 0 SW, 0 E (17.072 seconds)
Building dfmc-environment-projects... 0 W, 0 SW, 0 E (13.460 seconds)
Building environment-commands... 0 W, 0 SW, 0 E (26.918 seconds)
Building environment-internal-commands... 0 W, 0 SW, 0 E (7.814 seconds)
Building dfmc-c-back-end... 0 W, 0 SW, 0 E (15.319 seconds)
Building dfmc-c-linker... 0 W, 0 SW, 0 E (7.514 seconds)
Building llvm...
/usr/local/src/opendylan/opendylan-2014.1/sources/lib/llvm/bitcode.dylan:13: Warning - The binding $ABBREV-DEFINE-ABBREV is defined but not referenced or exported.
/usr/local/src/opendylan/opendylan-2014.1/sources/lib/llvm/bitcode.dylan:186-192: Warning - The binding write-char6 is defined but not referenced or exported.
/usr/local/src/opendylan/opendylan-2014.1/sources/lib/llvm/bitcode.dylan:208-209: Warning - The binding block-name is defined but not referenced or exported.
/usr/local/src/opendylan/opendylan-2014.1/sources/lib/llvm/bitcode.dylan:298-302: Warning - The binding $BLOCKINFO_BLOCK is defined but not referenced or exported.
4 W, 0 SW, 0 E (43.367 seconds)
Building dfmc-llvm-back-end...
/usr/local/src/opendylan/opendylan-2014.1/sources/dfmc/llvm-back-end/llvm-entry-points.dylan:316-320: Warning - The binding op--odd-keyword-arguments-error is defined but not referenced or exported.
/usr/local/src/opendylan/opendylan-2014.1/sources/dfmc/llvm-back-end/llvm-emit-code.dylan:55-62: Warning - The binding without-persistent-temporaries is defined but not referenced or exported.
2 W, 0 SW, 0 E (110.884 seconds)
Building dfmc-llvm-linker... 0 W, 0 SW, 0 E (8.263 seconds)
Building dfmc-back-end-implementations... 0 W, 0 SW, 0 E (3.983 seconds)
Building dylan-compiler... 0 W, 0 SW, 0 E (9.105 seconds)
mkdir /usr/local/src/opendylan/opendylan-2014.1/Bootstrap.2
mkdir /usr/local/src/opendylan/opendylan-2014.1/Bootstrap.2/bin
mkdir /usr/local/src/opendylan/opendylan-2014.1/Bootstrap.2/lib
mkdir /usr/local/src/opendylan/opendylan-2014.1/Bootstrap.2/lib/runtime
mkdir /usr/local/src/opendylan/opendylan-2014.1/Bootstrap.2/build
mkdir /usr/local/src/opendylan/opendylan-2014.1/Bootstrap.2/build/logs
Building Open Dylan bootstrap stage 2...
make[4]: Entering directory '/usr/local/src/opendylan/opendylan-2014.1/sources/jamfiles'
mkdir -p /usr/local/src/opendylan/opendylan-2014.1/Bootstrap.2/share/opendylan/build-scripts
cp config.jam /usr/local/src/opendylan/opendylan-2014.1/sources/jamfiles/mini-jambase.jam /usr/local/src/opendylan/opendylan-2014.1/sources/jamfiles/posix-build.jam /usr/local/src/opendylan/opendylan-2014.1/sources/jamfiles/shared-darwin-build.jam /usr/local/src/opendylan/opendylan-2014.1/sources/jamfiles/x86-darwin-build.jam /usr/local/src/opendylan/opendylan-2014.1/sources/jamfiles/x86_64-darwin-build.jam /usr/local/src/opendylan/opendylan-2014.1/sources/jamfiles/x86-freebsd-build.jam /usr/local/src/opendylan/opendylan-2014.1/sources/jamfiles/x86_64-freebsd-build.jam /usr/local/src/opendylan/opendylan-2014.1/sources/jamfiles/x86-linux-build.jam /usr/local/src/opendylan/opendylan-2014.1/sources/jamfiles/x86_64-linux-build.jam /usr/local/src/opendylan/opendylan-2014.1/sources/jamfiles/arm-linux-build.jam /usr/local/src/opendylan/opendylan-2014.1/Bootstrap.2/share/opendylan/build-scripts
make[4]: Leaving directory '/usr/local/src/opendylan/opendylan-2014.1/sources/jamfiles'
make[4]: Entering directory '/usr/local/src/opendylan/opendylan-2014.1/sources/lib/run-time'
mkdir -p /usr/local/src/opendylan/opendylan-2014.1/Bootstrap.2/lib/runtime/c-x86_64-linux
mkdir -p /usr/local/src/opendylan/opendylan-2014.1/Bootstrap.2/include/opendylan
cp -fp obj-x86_64-linux-c/libdylan-c-runtime.a /usr/local/src/opendylan/opendylan-2014.1/Bootstrap.2/lib/runtime/c-x86_64-linux
cp -fp /usr/local/src/opendylan/opendylan-2014.1/sources/lib/run-time/trace.h /usr/local/src/opendylan/opendylan-2014.1/Bootstrap.2/include/opendylan
cp -fp /usr/local/src/opendylan/opendylan-2014.1/sources/lib/run-time/run-time.h /usr/local/src/opendylan/opendylan-2014.1/Bootstrap.2/include/opendylan
make[4]: Leaving directory '/usr/local/src/opendylan/opendylan-2014.1/sources/lib/run-time'
Building dylan...
/usr/local/src/opendylan/opendylan-2014.1/sources/dylan/collection.dylan:341-344: Warning - Multiple applicable copy-down methods for method map-as-one (type :: subclass(<vector>), function :: <function>, collection :: <explicit-key-collection>, #next next-method :: <object>) => (new-collection :: <vector>), picking one at random
/usr/local/src/opendylan/opendylan-2014.1/sources/dylan/collection.dylan:346-349: Warning - Multiple applicable copy-down methods for method map-as-one (type :: singleton(<list>), function :: <function>, collection :: <explicit-key-collection>, #next next-method :: <object>) => (new-collection :: <vector>), picking one at random
/usr/local/src/opendylan/opendylan-2014.1/sources/dylan/collection.dylan:415-417: Warning - Multiple applicable copy-down methods for method map-into-stretchy-one (fun :: <function>, target :: <mutable-collection>, coll :: <sequence>, #next next-method :: <object>) => (target :: <mutable-collection>), picking one at random
/usr/local/src/opendylan/opendylan-2014.1/sources/dylan/collection.dylan:588-590: Warning - Multiple applicable copy-down methods for method map-into-rigid-one (fun :: <function>, target :: <mutable-collection>, coll :: <list>, #next next-method :: <object>) => (target :: <mutable-collection>), picking one at random
/usr/local/src/opendylan/opendylan-2014.1/sources/dylan/collection.dylan:591-593: Warning - Multiple applicable copy-down methods for method map-into-rigid-one (fun :: <function>, target :: <mutable-collection>, coll :: <simple-object-vector>, #next next-method :: <object>) => (target :: <mutable-collection>), picking one at random
/usr/local/src/opendylan/opendylan-2014.1/sources/dylan/collection.dylan:664-666: Warning - Multiple applicable copy-down methods for method map-into-rigid-one (fun :: <function>, target :: <mutable-sequence>, coll :: <list>, #next next-method :: <object>) => (target :: <mutable-collection>), picking one at random
/usr/local/src/opendylan/opendylan-2014.1/sources/dylan/collection.dylan:667-669: Warning - Multiple applicable copy-down methods for method map-into-rigid-one (fun :: <function>, target :: <mutable-sequence>, coll :: <simple-object-vector>, #next next-method :: <object>) => (target :: <mutable-collection>), picking one at random
/usr/local/src/opendylan/opendylan-2014.1/sources/dylan/stretchy-vector.dylan:664-666: Warning - Multiple applicable copy-down methods for method map-into-rigid-one (fun :: <function>, target :: <mutable-collection>, coll :: <stretchy-object-vector>, #next next-method :: <object>) => (target :: <mutable-collection>), picking one at random
/usr/local/src/opendylan/opendylan-2014.1/sources/dylan/stretchy-vector.dylan:668-670: Warning - Multiple applicable copy-down methods for method map-into-rigid-one (fun :: <function>, target :: <mutable-sequence>, coll :: <stretchy-object-vector>, #next next-method :: <object>) => (target :: <mutable-collection>), picking one at random
/usr/local/src/opendylan/opendylan-2014.1/sources/dylan/deque.dylan:680-683: Warning - Multiple applicable copy-down methods for method map-as-one (type :: singleton(<deque>), function :: <function>, collection :: <infinite-range>, #next next-method :: <object>) => (new-collection :: <vector>), picking one at random
/usr/local/src/opendylan/opendylan-2014.1/sources/dylan/deque.dylan:684-687: Warning - Multiple applicable copy-down methods for method map-as-one (type :: singleton(<object-deque>), function :: <function>, collection :: <infinite-range>, #next next-method :: <object>) => (new-collection :: <vector>), picking one at random
/usr/local/src/opendylan/opendylan-2014.1/sources/dylan/deque.dylan:689-692: Warning - Multiple applicable copy-down methods for method map-as-one (type :: singleton(<deque>), function :: <function>, collection :: <explicit-key-collection>, #next next-method :: <object>) => (new-collection :: <vector>), picking one at random
/usr/local/src/opendylan/opendylan-2014.1/sources/dylan/deque.dylan:694-697: Warning - Multiple applicable copy-down methods for method map-as-one (type :: singleton(<object-deque>), function :: <function>, collection :: <explicit-key-collection>, #next next-method :: <object>) => (new-collection :: <vector>), picking one at random
/usr/local/src/opendylan/opendylan-2014.1/sources/dylan/range.dylan:879-881: Warning - Multiple applicable copy-down methods for method map-as-one (type :: singleton(<list>), function :: <function>, collection :: <infinite-range>, #next next-method :: <object>) => (new-collection :: <vector>), picking one at random
/usr/local/src/opendylan/opendylan-2014.1/sources/dylan/table.dylan:873: Serious warning - Invalid type for argument new-key in call to entry-key-setter (new-key :: <object>, v :: <entry-keys>, index :: <integer>) => (new-key :: <object>): <raw-pointer> supplied, <object> expected.
/usr/local/src/opendylan/opendylan-2014.1/sources/dylan/table.dylan:873: Serious warning - Invalid type for argument new-key in call to entry-key-setter (new-key :: <object>, v :: <entry-keys>, index :: <integer>) => (new-key :: <object>): <raw-pointer> supplied, <object> expected.
/usr/local/src/opendylan/opendylan-2014.1/sources/dylan/table.dylan:873: Serious warning - Invalid type for argument new-key in call to entry-key-setter (new-key :: <object>, v :: <entry-keys>, index :: <integer>) => (new-key :: <object>): <raw-pointer> supplied, <object> expected.
16 W, 3 SW, 0 E (122.984 seconds)
Building common-dylan... 0 W, 0 SW, 0 E (18.247 seconds)
Building io... 0 W, 0 SW, 0 E (30.348 seconds)
Building system... 0 W, 0 SW, 0 E (27.106 seconds)
Building commands... 0 W, 0 SW, 0 E (3.586 seconds)
Building collections...
/usr/local/src/opendylan/opendylan-2014.1/sources/collections/bit-set.dylan:428-433: Warning - Result type check can fail - values(<raw-machine-word>) inferred, values(<object>) expected.
/usr/local/src/opendylan/opendylan-2014.1/sources/collections/bit-set.dylan:423-426: Warning - Result type check can fail - values(<raw-address>) inferred, values(<object>) expected.
2 W, 0 SW, 0 E (9.153 seconds)
Building walker... 0 W, 0 SW, 0 E (6.124 seconds)
Building dfmc-mangling... 0 W, 0 SW, 0 E (4.426 seconds)
Building variable-search...
/usr/local/src/opendylan/opendylan-2014.1/sources/lib/variable-search/unix-variable-value.dylan:44: Warning - Result type check can fail - values(<raw-pointer>) inferred, values(<object>) expected.
1 W, 0 SW, 0 E (1.959 seconds)
Building dood...
/usr/local/src/opendylan/opendylan-2014.1/sources/lib/dood/object.dylan:405: Warning - Type check can fail - singleton(#f :: <boolean>) inferred, <class> expected.
/usr/local/src/opendylan/opendylan-2014.1/sources/lib/dood/object.dylan:405: Warning - Type check can fail - <byte-character> inferred, <class> expected.
/usr/local/src/opendylan/opendylan-2014.1/sources/lib/dood/object.dylan:405: Warning - Type check can fail - <integer> inferred, <class> expected.
3 W, 0 SW, 0 E (27.355 seconds)
Building source-records... 0 W, 0 SW, 0 E (4.419 seconds)
Building ppml... 0 W, 0 SW, 0 E (4.418 seconds)
Building dfmc-common... 0 W, 0 SW, 0 E (11.911 seconds)
Building file-source-records... 0 W, 0 SW, 0 E (4.266 seconds)
Building release-info... 0 W, 0 SW, 0 E (6.553 seconds)
Building channels... 0 W, 0 SW, 0 E (2.486 seconds)
Building memory-manager... 0 W, 0 SW, 0 E (2.104 seconds)
Building cl... 0 W, 0 SW, 0 E (7.527 seconds)
Building environment-protocols... 0 W, 0 SW, 0 E (40.788 seconds)
Building parser-run-time... 0 W, 0 SW, 0 E (3.391 seconds)
Building jam... 0 W, 0 SW, 0 E (22.136 seconds)
Building build-system... 0 W, 0 SW, 0 E (4.406 seconds)
Building environment-manager... 0 W, 0 SW, 0 E (7.081 seconds)
Building environment-reports... 0 W, 0 SW, 0 E (16.656 seconds)
Building source-control-manager... 0 W, 0 SW, 0 E (4.733 seconds)
Building dfmc-conditions... 0 W, 0 SW, 0 E (6.715 seconds)
Building generic-arithmetic... 0 W, 0 SW, 0 E (3.205 seconds)
Building big-integers... 0 W, 0 SW, 0 E (10.949 seconds)
Building dfmc-reader... 0 W, 0 SW, 0 E (69.113 seconds)
Building dfmc-macro-expander... 0 W, 0 SW, 0 E (28.275 seconds)
Building dfmc-namespace... 0 W, 0 SW, 0 E (40.875 seconds)
Building dfmc-definitions... 0 W, 0 SW, 0 E (63.400 seconds)
Building dfmc-modeling... 0 W, 0 SW, 0 E (102.815 seconds)
Building dfmc-flow-graph... 0 W, 0 SW, 0 E (34.472 seconds)
Building dfmc-core... 0 W, 0 SW, 0 E (3.333 seconds)
Building dfmc-typist... 0 W, 0 SW, 0 E (20.470 seconds)
Building dfmc-conversion... 0 W, 0 SW, 0 E (50.677 seconds)
Building dfmc-c-ffi... 0 W, 0 SW, 0 E (43.222 seconds)
Building dfmc-back-end-protocol... 0 W, 0 SW, 0 E (2.941 seconds)
Building dfmc-back-end... 0 W, 0 SW, 0 E (18.614 seconds)
Building dfmc-optimization... 0 W, 0 SW, 0 E (30.482 seconds)
Building dfmc-linker... 0 W, 0 SW, 0 E (3.944 seconds)
Building dfmc-management... 0 W, 0 SW, 0 E (16.939 seconds)
Building dfmc-browser-support... 0 W, 0 SW, 0 E (8.921 seconds)
Building projects... 0 W, 0 SW, 0 E (14.328 seconds)
Building registry-projects... 0 W, 0 SW, 0 E (6.245 seconds)
Building tools-interface... 0 W, 0 SW, 0 E (4.209 seconds)
Building user-projects... 0 W, 0 SW, 0 E (14.365 seconds)
Building dfmc-debug-back-end... 0 W, 0 SW, 0 E (11.915 seconds)
Building dfmc-environment-database... 0 W, 0 SW, 0 E (14.315 seconds)
Building dfmc-environment-projects... 0 W, 0 SW, 0 E (11.401 seconds)
Building environment-commands... 0 W, 0 SW, 0 E (22.141 seconds)
Building environment-internal-commands... 0 W, 0 SW, 0 E (7.409 seconds)
Building dfmc-c-back-end... 0 W, 0 SW, 0 E (12.664 seconds)
Building dfmc-c-linker... 0 W, 0 SW, 0 E (7.199 seconds)
Building llvm...
/usr/local/src/opendylan/opendylan-2014.1/sources/lib/llvm/bitcode.dylan:13: Warning - The binding $ABBREV-DEFINE-ABBREV is defined but not referenced or exported.
/usr/local/src/opendylan/opendylan-2014.1/sources/lib/llvm/bitcode.dylan:186-192: Warning - The binding write-char6 is defined but not referenced or exported.
/usr/local/src/opendylan/opendylan-2014.1/sources/lib/llvm/bitcode.dylan:208-209: Warning - The binding block-name is defined but not referenced or exported.
/usr/local/src/opendylan/opendylan-2014.1/sources/lib/llvm/bitcode.dylan:298-302: Warning - The binding $BLOCKINFO_BLOCK is defined but not referenced or exported.
4 W, 0 SW, 0 E (36.479 seconds)
Building dfmc-llvm-back-end...
/usr/local/src/opendylan/opendylan-2014.1/sources/dfmc/llvm-back-end/llvm-entry-points.dylan:316-320: Warning - The binding op--odd-keyword-arguments-error is defined but not referenced or exported.
/usr/local/src/opendylan/opendylan-2014.1/sources/dfmc/llvm-back-end/llvm-emit-code.dylan:55-62: Warning - The binding without-persistent-temporaries is defined but not referenced or exported.
2 W, 0 SW, 0 E (107.956 seconds)
Building dfmc-llvm-linker... 0 W, 0 SW, 0 E (7.438 seconds)
Building dfmc-back-end-implementations... 0 W, 0 SW, 0 E (4.198 seconds)
Building dylan-compiler... 0 W, 0 SW, 0 E (9.437 seconds)
mkdir /usr/local/src/opendylan/opendylan-2014.1/Bootstrap.3
mkdir /usr/local/src/opendylan/opendylan-2014.1/Bootstrap.3/bin
mkdir /usr/local/src/opendylan/opendylan-2014.1/Bootstrap.3/lib
mkdir /usr/local/src/opendylan/opendylan-2014.1/Bootstrap.3/lib/runtime
mkdir /usr/local/src/opendylan/opendylan-2014.1/Bootstrap.3/build
mkdir /usr/local/src/opendylan/opendylan-2014.1/Bootstrap.3/build/logs
Building Open Dylan bootstrap stage 3...
make[4]: Entering directory '/usr/local/src/opendylan/opendylan-2014.1/sources/jamfiles'
mkdir -p /usr/local/src/opendylan/opendylan-2014.1/Bootstrap.3/share/opendylan/build-scripts
cp config.jam /usr/local/src/opendylan/opendylan-2014.1/sources/jamfiles/mini-jambase.jam /usr/local/src/opendylan/opendylan-2014.1/sources/jamfiles/posix-build.jam /usr/local/src/opendylan/opendylan-2014.1/sources/jamfiles/shared-darwin-build.jam /usr/local/src/opendylan/opendylan-2014.1/sources/jamfiles/x86-darwin-build.jam /usr/local/src/opendylan/opendylan-2014.1/sources/jamfiles/x86_64-darwin-build.jam /usr/local/src/opendylan/opendylan-2014.1/sources/jamfiles/x86-freebsd-build.jam /usr/local/src/opendylan/opendylan-2014.1/sources/jamfiles/x86_64-freebsd-build.jam /usr/local/src/opendylan/opendylan-2014.1/sources/jamfiles/x86-linux-build.jam /usr/local/src/opendylan/opendylan-2014.1/sources/jamfiles/x86_64-linux-build.jam /usr/local/src/opendylan/opendylan-2014.1/sources/jamfiles/arm-linux-build.jam /usr/local/src/opendylan/opendylan-2014.1/Bootstrap.3/share/opendylan/build-scripts
make[4]: Leaving directory '/usr/local/src/opendylan/opendylan-2014.1/sources/jamfiles'
make[4]: Entering directory '/usr/local/src/opendylan/opendylan-2014.1/sources/lib/run-time'
mkdir -p /usr/local/src/opendylan/opendylan-2014.1/Bootstrap.3/lib/runtime/c-x86_64-linux
mkdir -p /usr/local/src/opendylan/opendylan-2014.1/Bootstrap.3/include/opendylan
cp -fp obj-x86_64-linux-c/libdylan-c-runtime.a /usr/local/src/opendylan/opendylan-2014.1/Bootstrap.3/lib/runtime/c-x86_64-linux
cp -fp /usr/local/src/opendylan/opendylan-2014.1/sources/lib/run-time/trace.h /usr/local/src/opendylan/opendylan-2014.1/Bootstrap.3/include/opendylan
cp -fp /usr/local/src/opendylan/opendylan-2014.1/sources/lib/run-time/run-time.h /usr/local/src/opendylan/opendylan-2014.1/Bootstrap.3/include/opendylan
make[4]: Leaving directory '/usr/local/src/opendylan/opendylan-2014.1/sources/lib/run-time'
Building dylan...
/usr/local/src/opendylan/opendylan-2014.1/sources/dylan/collection.dylan:341-344: Warning - Multiple applicable copy-down methods for method map-as-one (type :: subclass(<vector>), function :: <function>, collection :: <explicit-key-collection>, #next next-method :: <object>) => (new-collection :: <vector>), picking one at random
/usr/local/src/opendylan/opendylan-2014.1/sources/dylan/collection.dylan:346-349: Warning - Multiple applicable copy-down methods for method map-as-one (type :: singleton(<list>), function :: <function>, collection :: <explicit-key-collection>, #next next-method :: <object>) => (new-collection :: <vector>), picking one at random
/usr/local/src/opendylan/opendylan-2014.1/sources/dylan/collection.dylan:415-417: Warning - Multiple applicable copy-down methods for method map-into-stretchy-one (fun :: <function>, target :: <mutable-collection>, coll :: <sequence>, #next next-method :: <object>) => (target :: <mutable-collection>), picking one at random
/usr/local/src/opendylan/opendylan-2014.1/sources/dylan/collection.dylan:588-590: Warning - Multiple applicable copy-down methods for method map-into-rigid-one (fun :: <function>, target :: <mutable-collection>, coll :: <list>, #next next-method :: <object>) => (target :: <mutable-collection>), picking one at random
/usr/local/src/opendylan/opendylan-2014.1/sources/dylan/collection.dylan:591-593: Warning - Multiple applicable copy-down methods for method map-into-rigid-one (fun :: <function>, target :: <mutable-collection>, coll :: <simple-object-vector>, #next next-method :: <object>) => (target :: <mutable-collection>), picking one at random
/usr/local/src/opendylan/opendylan-2014.1/sources/dylan/collection.dylan:664-666: Warning - Multiple applicable copy-down methods for method map-into-rigid-one (fun :: <function>, target :: <mutable-sequence>, coll :: <list>, #next next-method :: <object>) => (target :: <mutable-collection>), picking one at random
/usr/local/src/opendylan/opendylan-2014.1/sources/dylan/collection.dylan:667-669: Warning - Multiple applicable copy-down methods for method map-into-rigid-one (fun :: <function>, target :: <mutable-sequence>, coll :: <simple-object-vector>, #next next-method :: <object>) => (target :: <mutable-collection>), picking one at random
/usr/local/src/opendylan/opendylan-2014.1/sources/dylan/stretchy-vector.dylan:664-666: Warning - Multiple applicable copy-down methods for method map-into-rigid-one (fun :: <function>, target :: <mutable-collection>, coll :: <stretchy-object-vector>, #next next-method :: <object>) => (target :: <mutable-collection>), picking one at random
/usr/local/src/opendylan/opendylan-2014.1/sources/dylan/stretchy-vector.dylan:668-670: Warning - Multiple applicable copy-down methods for method map-into-rigid-one (fun :: <function>, target :: <mutable-sequence>, coll :: <stretchy-object-vector>, #next next-method :: <object>) => (target :: <mutable-collection>), picking one at random
/usr/local/src/opendylan/opendylan-2014.1/sources/dylan/deque.dylan:680-683: Warning - Multiple applicable copy-down methods for method map-as-one (type :: singleton(<deque>), function :: <function>, collection :: <infinite-range>, #next next-method :: <object>) => (new-collection :: <vector>), picking one at random
/usr/local/src/opendylan/opendylan-2014.1/sources/dylan/deque.dylan:684-687: Warning - Multiple applicable copy-down methods for method map-as-one (type :: singleton(<object-deque>), function :: <function>, collection :: <infinite-range>, #next next-method :: <object>) => (new-collection :: <vector>), picking one at random
/usr/local/src/opendylan/opendylan-2014.1/sources/dylan/deque.dylan:689-692: Warning - Multiple applicable copy-down methods for method map-as-one (type :: singleton(<deque>), function :: <function>, collection :: <explicit-key-collection>, #next next-method :: <object>) => (new-collection :: <vector>), picking one at random
/usr/local/src/opendylan/opendylan-2014.1/sources/dylan/deque.dylan:694-697: Warning - Multiple applicable copy-down methods for method map-as-one (type :: singleton(<object-deque>), function :: <function>, collection :: <explicit-key-collection>, #next next-method :: <object>) => (new-collection :: <vector>), picking one at random
/usr/local/src/opendylan/opendylan-2014.1/sources/dylan/range.dylan:879-881: Warning - Multiple applicable copy-down methods for method map-as-one (type :: singleton(<list>), function :: <function>, collection :: <infinite-range>, #next next-method :: <object>) => (new-collection :: <vector>), picking one at random
/usr/local/src/opendylan/opendylan-2014.1/sources/dylan/table.dylan:873: Serious warning - Invalid type for argument new-key in call to entry-key-setter (new-key :: <object>, v :: <entry-keys>, index :: <integer>) => (new-key :: <object>): <raw-pointer> supplied, <object> expected.
/usr/local/src/opendylan/opendylan-2014.1/sources/dylan/table.dylan:873: Serious warning - Invalid type for argument new-key in call to entry-key-setter (new-key :: <object>, v :: <entry-keys>, index :: <integer>) => (new-key :: <object>): <raw-pointer> supplied, <object> expected.
/usr/local/src/opendylan/opendylan-2014.1/sources/dylan/table.dylan:873: Serious warning - Invalid type for argument new-key in call to entry-key-setter (new-key :: <object>, v :: <entry-keys>, index :: <integer>) => (new-key :: <object>): <raw-pointer> supplied, <object> expected.
16 W, 3 SW, 0 E (144.611 seconds)
Building common-dylan... 0 W, 0 SW, 0 E (23.078 seconds)
Building io... 0 W, 0 SW, 0 E (34.550 seconds)
Building system... 0 W, 0 SW, 0 E (30.323 seconds)
Building commands... 0 W, 0 SW, 0 E (3.674 seconds)
Building collections...
/usr/local/src/opendylan/opendylan-2014.1/sources/collections/bit-set.dylan:428-433: Warning - Result type check can fail - values(<raw-machine-word>) inferred, values(<object>) expected.
/usr/local/src/opendylan/opendylan-2014.1/sources/collections/bit-set.dylan:423-426: Warning - Result type check can fail - values(<raw-address>) inferred, values(<object>) expected.
2 W, 0 SW, 0 E (10.323 seconds)
Building walker... 0 W, 0 SW, 0 E (6.838 seconds)
Building dfmc-mangling... 0 W, 0 SW, 0 E (4.260 seconds)
Building variable-search...
/usr/local/src/opendylan/opendylan-2014.1/sources/lib/variable-search/unix-variable-value.dylan:44: Warning - Result type check can fail - values(<raw-pointer>) inferred, values(<object>) expected.
1 W, 0 SW, 0 E (2.249 seconds)
Building dood...
/usr/local/src/opendylan/opendylan-2014.1/sources/lib/dood/object.dylan:405: Warning - Type check can fail - singleton(#f :: <boolean>) inferred, <class> expected.
/usr/local/src/opendylan/opendylan-2014.1/sources/lib/dood/object.dylan:405: Warning - Type check can fail - <byte-character> inferred, <class> expected.
/usr/local/src/opendylan/opendylan-2014.1/sources/lib/dood/object.dylan:405: Warning - Type check can fail - <integer> inferred, <class> expected.
3 W, 0 SW, 0 E (32.361 seconds)
Building source-records... 0 W, 0 SW, 0 E (4.157 seconds)
Building ppml... 0 W, 0 SW, 0 E (4.501 seconds)
Building dfmc-common... 0 W, 0 SW, 0 E (12.752 seconds)
Building file-source-records... 0 W, 0 SW, 0 E (4.398 seconds)
Building release-info... 0 W, 0 SW, 0 E (6.710 seconds)
Building channels... 0 W, 0 SW, 0 E (2.452 seconds)
Building memory-manager... 0 W, 0 SW, 0 E (2.183 seconds)
Building cl... 0 W, 0 SW, 0 E (8.001 seconds)
Building environment-protocols... 0 W, 0 SW, 0 E (37.830 seconds)
Building parser-run-time... 0 W, 0 SW, 0 E (3.291 seconds)
Building jam... 0 W, 0 SW, 0 E (19.378 seconds)
Building build-system... 0 W, 0 SW, 0 E (3.827 seconds)
Building environment-manager... 0 W, 0 SW, 0 E (6.032 seconds)
Building environment-reports... 0 W, 0 SW, 0 E (15.352 seconds)
Building source-control-manager... 0 W, 0 SW, 0 E (4.226 seconds)
Building dfmc-conditions... 0 W, 0 SW, 0 E (5.470 seconds)
Building generic-arithmetic... 0 W, 0 SW, 0 E (2.812 seconds)
Building big-integers... 0 W, 0 SW, 0 E (8.338 seconds)
Building dfmc-reader... 0 W, 0 SW, 0 E (59.144 seconds)
Building dfmc-macro-expander... 0 W, 0 SW, 0 E (21.836 seconds)
Building dfmc-namespace... 0 W, 0 SW, 0 E (31.053 seconds)
Building dfmc-definitions... 0 W, 0 SW, 0 E (54.674 seconds)
Building dfmc-modeling... 0 W, 0 SW, 0 E (93.881 seconds)
Building dfmc-flow-graph... 0 W, 0 SW, 0 E (34.208 seconds)
Building dfmc-core... 0 W, 0 SW, 0 E (3.190 seconds)
Building dfmc-typist... 0 W, 0 SW, 0 E (21.309 seconds)
Building dfmc-conversion... 0 W, 0 SW, 0 E (57.636 seconds)
Building dfmc-c-ffi... 0 W, 0 SW, 0 E (48.468 seconds)
Building dfmc-back-end-protocol... 0 W, 0 SW, 0 E (3.062 seconds)
Building dfmc-back-end... 0 W, 0 SW, 0 E (23.298 seconds)
Building dfmc-optimization... 0 W, 0 SW, 0 E (36.510 seconds)
Building dfmc-linker... 0 W, 0 SW, 0 E (3.680 seconds)
Building dfmc-management... 0 W, 0 SW, 0 E (19.349 seconds)
Building dfmc-browser-support... 0 W, 0 SW, 0 E (11.222 seconds)
Building projects... 0 W, 0 SW, 0 E (15.673 seconds)
Building registry-projects... 0 W, 0 SW, 0 E (6.635 seconds)
Building tools-interface... 0 W, 0 SW, 0 E (4.773 seconds)
Building user-projects... 0 W, 0 SW, 0 E (16.179 seconds)
Building dfmc-debug-back-end... 0 W, 0 SW, 0 E (14.318 seconds)
Building dfmc-environment-database... 0 W, 0 SW, 0 E (16.564 seconds)
Building dfmc-environment-projects... 0 W, 0 SW, 0 E (12.694 seconds)
Building environment-commands... 0 W, 0 SW, 0 E (24.413 seconds)
Building environment-internal-commands... 0 W, 0 SW, 0 E (7.593 seconds)
Building dfmc-c-back-end... 0 W, 0 SW, 0 E (13.954 seconds)
Building dfmc-c-linker... 0 W, 0 SW, 0 E (7.261 seconds)
Building llvm...
/usr/local/src/opendylan/opendylan-2014.1/sources/lib/llvm/bitcode.dylan:13: Warning - The binding $ABBREV-DEFINE-ABBREV is defined but not referenced or exported.
/usr/local/src/opendylan/opendylan-2014.1/sources/lib/llvm/bitcode.dylan:186-192: Warning - The binding write-char6 is defined but not referenced or exported.
/usr/local/src/opendylan/opendylan-2014.1/sources/lib/llvm/bitcode.dylan:208-209: Warning - The binding block-name is defined but not referenced or exported.
/usr/local/src/opendylan/opendylan-2014.1/sources/lib/llvm/bitcode.dylan:298-302: Warning - The binding $BLOCKINFO_BLOCK is defined but not referenced or exported.
4 W, 0 SW, 0 E (38.115 seconds)
Building dfmc-llvm-back-end...
/usr/local/src/opendylan/opendylan-2014.1/sources/dfmc/llvm-back-end/llvm-entry-points.dylan:316-320: Warning - The binding op--odd-keyword-arguments-error is defined but not referenced or exported.
/usr/local/src/opendylan/opendylan-2014.1/sources/dfmc/llvm-back-end/llvm-emit-code.dylan:55-62: Warning - The binding without-persistent-temporaries is defined but not referenced or exported.
2 W, 0 SW, 0 E (102.201 seconds)
Building dfmc-llvm-linker... 0 W, 0 SW, 0 E (6.416 seconds)
Building dfmc-back-end-implementations... 0 W, 0 SW, 0 E (3.440 seconds)
Building dylan-compiler... 0 W, 0 SW, 0 E (8.397 seconds)
Building grammar-compiler... 0 W, 0 SW, 0 E (6.738 seconds)
Building parser-generator... 0 W, 0 SW, 0 E (3.389 seconds)
Building parser-compiler... 0 W, 0 SW, 0 E (2.127 seconds)
Building c-ffi... 0 W, 0 SW, 0 E (12.550 seconds)
Building network... 0 W, 0 SW, 0 E (18.496 seconds)
Building lisp-reader... 0 W, 0 SW, 0 E (1.938 seconds)
Building dswank... 0 W, 0 SW, 0 E (8.768 seconds)
Building strings... 0 W, 0 SW, 0 E (4.281 seconds)
Building make-dylan-app... 0 W, 0 SW, 0 E (2.729 seconds)
make[3]: Leaving directory '/usr/local/src/opendylan/opendylan-2014.1'
make[2]: Leaving directory '/usr/local/src/opendylan/opendylan-2014.1'
make[1]: Leaving directory '/usr/local/src/opendylan/opendylan-2014.1'
fakeroot debian/rules binary
#dh binary --with autoreconf
dh binary
dh_testroot
dh_prep
debian/rules override_dh_auto_install
make[1]: Entering directory '/usr/local/src/opendylan/opendylan-2014.1'
PATH=/usr/local/src/opendylan/opendylan-2014.1.bin/bin:$PATH make install
make[2]: Entering directory '/usr/local/src/opendylan/opendylan-2014.1'
make 3-stage-bootstrap-reentry \
BOOTSTRAP_2_COMPILER="/usr/local/src/opendylan/opendylan-2014.1/Bootstrap.1/bin/dylan-compiler -build -verbose"
make[3]: Entering directory '/usr/local/src/opendylan/opendylan-2014.1'
Building Open Dylan bootstrap stage 3...
make[4]: Entering directory '/usr/local/src/opendylan/opendylan-2014.1/sources/jamfiles'
mkdir -p /usr/local/src/opendylan/opendylan-2014.1/Bootstrap.3/share/opendylan/build-scripts
cp config.jam /usr/local/src/opendylan/opendylan-2014.1/sources/jamfiles/mini-jambase.jam /usr/local/src/opendylan/opendylan-2014.1/sources/jamfiles/posix-build.jam /usr/local/src/opendylan/opendylan-2014.1/sources/jamfiles/shared-darwin-build.jam /usr/local/src/opendylan/opendylan-2014.1/sources/jamfiles/x86-darwin-build.jam /usr/local/src/opendylan/opendylan-2014.1/sources/jamfiles/x86_64-darwin-build.jam /usr/local/src/opendylan/opendylan-2014.1/sources/jamfiles/x86-freebsd-build.jam /usr/local/src/opendylan/opendylan-2014.1/sources/jamfiles/x86_64-freebsd-build.jam /usr/local/src/opendylan/opendylan-2014.1/sources/jamfiles/x86-linux-build.jam /usr/local/src/opendylan/opendylan-2014.1/sources/jamfiles/x86_64-linux-build.jam /usr/local/src/opendylan/opendylan-2014.1/sources/jamfiles/arm-linux-build.jam /usr/local/src/opendylan/opendylan-2014.1/Bootstrap.3/share/opendylan/build-scripts
make[4]: Leaving directory '/usr/local/src/opendylan/opendylan-2014.1/sources/jamfiles'
make[4]: Entering directory '/usr/local/src/opendylan/opendylan-2014.1/sources/lib/run-time'
cp -fp obj-x86_64-linux-c/libdylan-c-runtime.a /usr/local/src/opendylan/opendylan-2014.1/Bootstrap.3/lib/runtime/c-x86_64-linux
cp -fp /usr/local/src/opendylan/opendylan-2014.1/sources/lib/run-time/trace.h /usr/local/src/opendylan/opendylan-2014.1/Bootstrap.3/include/opendylan
cp -fp /usr/local/src/opendylan/opendylan-2014.1/sources/lib/run-time/run-time.h /usr/local/src/opendylan/opendylan-2014.1/Bootstrap.3/include/opendylan
make[4]: Leaving directory '/usr/local/src/opendylan/opendylan-2014.1/sources/lib/run-time'
make[3]: Leaving directory '/usr/local/src/opendylan/opendylan-2014.1'
Preparing to install Open Dylan...
Copying sources...
cp: cannot create directory ‘/usr/local/sources’: Permission denied
Makefile:328: recipe for target 'install-stage' failed
make[2]: *** [install-stage] Error 1
make[2]: Leaving directory '/usr/local/src/opendylan/opendylan-2014.1'
debian/rules:42: recipe for target 'override_dh_auto_install' failed
make[1]: *** [override_dh_auto_install] Error 2
make[1]: Leaving directory '/usr/local/src/opendylan/opendylan-2014.1'
debian/rules:23: recipe for target 'binary' failed
make: *** [binary] Error 2
dpkg-buildpackage: error: fakeroot debian/rules binary gave error exit status 2
Sign up for free to join this conversation on GitHub. Already have an account? Sign in to comment
You can’t perform that action at this time.