Skip to content

Instantly share code, notes, and snippets.

Created Feb 25, 2014
Embed
What would you like to do?
C:\tmp\native-platform-master>gradle -v
------------------------------------------------------------
Gradle 1.10
------------------------------------------------------------
Build time: 2013-12-17 09:28:15 UTC
Build number: none
Revision: 36ced393628875ff15575fa03d16c1349ffe8bb6
Groovy: 1.8.6
Ant: Apache Ant(TM) version 1.9.2 compiled on July 8 2013
Ivy: 2.2.0
JVM: 1.6.0_65 (Sun Microsystems Inc. 20.65-b04)
OS: Windows 7 6.1 amd64
C:\tmp\native-platform-master>gradlew --debug
10:20:51.111 [DEBUG] [org.gradle.internal.nativeplatform.services.NativeServices] Unable to initialize native-platform. Failure: net.rubygrapefruit.platform.NativeException: Failed to load native library 'native-platform.dll' for Windows 7 amd64.
caused by: java.lang.UnsatisfiedLinkError: C:\data\projects\.gradle\native\17\windows-amd64\native-platform.dll: Access is denied
10:20:52.720 [INFO] [org.gradle.BuildLogger] Starting Build
10:20:52.723 [DEBUG] [org.gradle.BuildLogger] Gradle user home: C:\data\projects\.gradle
10:20:52.725 [DEBUG] [org.gradle.BuildLogger] Current dir: C:\tmp\native-platform-master
10:20:52.727 [DEBUG] [org.gradle.BuildLogger] Settings file: null
10:20:52.730 [DEBUG] [org.gradle.BuildLogger] Build file: null
10:20:52.846 [DEBUG] [org.gradle.initialization.buildsrc.BuildSourceBuilder] Starting to build the build sources.
10:20:52.885 [DEBUG] [org.gradle.initialization.buildsrc.BuildSourceBuilder] Gradle source dir does not exist. We leave.
10:20:52.909 [DEBUG] [org.gradle.initialization.DefaultGradlePropertiesLoader] Found env project properties: []
10:20:52.933 [DEBUG] [org.gradle.initialization.DefaultGradlePropertiesLoader] Found system project properties: []
10:20:53.629 [DEBUG] [org.gradle.api.internal.artifacts.mvnsettings.DefaultLocalMavenRepositoryLocator] No local repository in Settings file defined. Using default path: \\chca6002.eur.beluni.net\A867180$\.m2\repository
10:20:54.026 [DEBUG] [org.gradle.cache.internal.DefaultFileLockManager] Waiting to acquire shared lock on buildscript class cache for settings file 'C:\tmp\native-platform-master\settings.gradle' (C:\data\projects\.gradle\caches\1.12-20140127015041+0
000\scripts\settings_2l86dqj4h8kpr4c51qg7ar5ckt\SettingsScript\buildscript).
10:20:54.051 [DEBUG] [org.gradle.cache.internal.DefaultFileLockManager] Lock acquired.
10:20:54.148 [DEBUG] [org.gradle.cache.internal.DefaultFileLockManager] Waiting to acquire shared lock on no_buildscript class cache for settings file 'C:\tmp\native-platform-master\settings.gradle' (C:\data\projects\.gradle\caches\1.12-2014012701504
1+0000\scripts\settings_2l86dqj4h8kpr4c51qg7ar5ckt\SettingsScript\no_buildscript).
10:20:54.170 [DEBUG] [org.gradle.cache.internal.DefaultFileLockManager] Lock acquired.
10:20:54.400 [DEBUG] [org.gradle.initialization.ScriptEvaluatingSettingsProcessor] Timing: Processing settings took: 1.447 secs
10:20:54.438 [INFO] [org.gradle.BuildLogger] Settings evaluated using settings file 'C:\tmp\native-platform-master\settings.gradle'.
10:20:54.699 [DEBUG] [org.gradle.initialization.ProjectPropertySettingBuildLoader] Looking for project properties from: C:\tmp\native-platform-master\gradle.properties
10:20:54.727 [DEBUG] [org.gradle.initialization.ProjectPropertySettingBuildLoader] project property file does not exists. We continue!
10:20:54.786 [DEBUG] [org.gradle.initialization.ProjectPropertySettingBuildLoader] Looking for project properties from: C:\tmp\native-platform-master\test-app\gradle.properties
10:20:54.812 [DEBUG] [org.gradle.initialization.ProjectPropertySettingBuildLoader] project property file does not exists. We continue!
10:20:54.853 [INFO] [org.gradle.BuildLogger] Projects loaded. Root project using build file 'C:\tmp\native-platform-master\build.gradle'.
10:20:54.882 [INFO] [org.gradle.BuildLogger] Included projects: [root project 'native-platform', project ':testApp']
10:20:55.376 [INFO] [org.gradle.configuration.project.BuildScriptProcessor] Evaluating root project 'native-platform' using build file 'C:\tmp\native-platform-master\build.gradle'.
10:20:55.412 [DEBUG] [org.gradle.cache.internal.DefaultFileLockManager] Waiting to acquire shared lock on buildscript class cache for build file 'C:\tmp\native-platform-master\build.gradle' (C:\data\projects\.gradle\caches\1.12-20140127015041+0000\sc
ripts\build_66achbgh6pdjkrgfdop4489uok\ProjectScript\buildscript).
10:20:55.437 [DEBUG] [org.gradle.cache.internal.DefaultFileLockManager] Lock acquired.
10:20:55.496 [DEBUG] [org.gradle.cache.internal.DefaultFileLockManager] Waiting to acquire shared lock on no_buildscript class cache for build file 'C:\tmp\native-platform-master\build.gradle' (C:\data\projects\.gradle\caches\1.12-20140127015041+0000
\scripts\build_66achbgh6pdjkrgfdop4489uok\ProjectScript\no_buildscript).
10:20:55.519 [DEBUG] [org.gradle.cache.internal.DefaultFileLockManager] Lock acquired.
10:20:56.879 [DEBUG] [org.gradle.configuration.project.BuildScriptProcessor] Timing: Running the build script took 1.482 secs
10:20:56.927 [ERROR] [org.gradle.BuildExceptionReporter]
10:20:56.949 [ERROR] [org.gradle.BuildExceptionReporter] FAILURE: Build failed with an exception.
10:20:56.974 [ERROR] [org.gradle.BuildExceptionReporter]
10:20:56.994 [ERROR] [org.gradle.BuildExceptionReporter] * Where:
10:20:57.010 [ERROR] [org.gradle.BuildExceptionReporter] Build file 'C:\tmp\native-platform-master\build.gradle' line: 2
10:20:57.028 [ERROR] [org.gradle.BuildExceptionReporter]
10:20:57.046 [ERROR] [org.gradle.BuildExceptionReporter] * What went wrong:
10:20:57.064 [ERROR] [org.gradle.BuildExceptionReporter] A problem occurred evaluating root project 'native-platform'.
10:20:57.081 [ERROR] [org.gradle.BuildExceptionReporter] > Could not create plugin of type 'MicrosoftVisualCppPlugin'.
10:20:57.102 [ERROR] [org.gradle.BuildExceptionReporter]
10:20:57.117 [ERROR] [org.gradle.BuildExceptionReporter] * Exception is:
10:20:57.134 [ERROR] [org.gradle.BuildExceptionReporter] org.gradle.api.GradleScriptException: A problem occurred evaluating root project 'native-platform'.
10:20:57.153 [ERROR] [org.gradle.BuildExceptionReporter] at org.gradle.groovy.scripts.internal.DefaultScriptRunnerFactory$ScriptRunnerImpl.run(DefaultScriptRunnerFactory.java:54)
10:20:57.171 [ERROR] [org.gradle.BuildExceptionReporter] at org.gradle.configuration.DefaultScriptPluginFactory$ScriptPluginImpl.apply(DefaultScriptPluginFactory.java:172)
10:20:57.188 [ERROR] [org.gradle.BuildExceptionReporter] at org.gradle.configuration.project.BuildScriptProcessor.execute(BuildScriptProcessor.java:38)
10:20:57.205 [ERROR] [org.gradle.BuildExceptionReporter] at org.gradle.configuration.project.BuildScriptProcessor.execute(BuildScriptProcessor.java:25)
10:20:57.224 [ERROR] [org.gradle.BuildExceptionReporter] at org.gradle.configuration.project.ConfigureActionsProjectEvaluator.evaluate(ConfigureActionsProjectEvaluator.java:34)
10:20:57.243 [ERROR] [org.gradle.BuildExceptionReporter] at org.gradle.configuration.project.LifecycleProjectEvaluator.evaluate(LifecycleProjectEvaluator.java:55)
10:20:57.263 [ERROR] [org.gradle.BuildExceptionReporter] at org.gradle.api.internal.project.AbstractProject.evaluate(AbstractProject.java:507)
10:20:57.283 [ERROR] [org.gradle.BuildExceptionReporter] at org.gradle.api.internal.project.AbstractProject.evaluate(AbstractProject.java:82)
10:20:57.301 [ERROR] [org.gradle.BuildExceptionReporter] at org.gradle.configuration.DefaultBuildConfigurer.configure(DefaultBuildConfigurer.java:31)
10:20:57.321 [ERROR] [org.gradle.BuildExceptionReporter] at org.gradle.initialization.DefaultGradleLauncher.doBuildStages(DefaultGradleLauncher.java:142)
10:20:57.341 [ERROR] [org.gradle.BuildExceptionReporter] at org.gradle.initialization.DefaultGradleLauncher.doBuild(DefaultGradleLauncher.java:113)
10:20:57.361 [ERROR] [org.gradle.BuildExceptionReporter] at org.gradle.initialization.DefaultGradleLauncher.run(DefaultGradleLauncher.java:81)
10:20:57.384 [ERROR] [org.gradle.BuildExceptionReporter] at org.gradle.launcher.exec.InProcessBuildActionExecuter$DefaultBuildController.run(InProcessBuildActionExecuter.java:64)
10:20:57.402 [ERROR] [org.gradle.BuildExceptionReporter] at org.gradle.launcher.cli.ExecuteBuildAction.run(ExecuteBuildAction.java:33)
10:20:57.422 [ERROR] [org.gradle.BuildExceptionReporter] at org.gradle.launcher.cli.ExecuteBuildAction.run(ExecuteBuildAction.java:24)
10:20:57.441 [ERROR] [org.gradle.BuildExceptionReporter] at org.gradle.launcher.exec.InProcessBuildActionExecuter.execute(InProcessBuildActionExecuter.java:35)
10:20:57.461 [ERROR] [org.gradle.BuildExceptionReporter] at org.gradle.launcher.exec.InProcessBuildActionExecuter.execute(InProcessBuildActionExecuter.java:26)
10:20:57.478 [ERROR] [org.gradle.BuildExceptionReporter] at org.gradle.launcher.cli.RunBuildAction.run(RunBuildAction.java:50)
10:20:57.494 [ERROR] [org.gradle.BuildExceptionReporter] at org.gradle.internal.Actions$RunnableActionAdapter.execute(Actions.java:171)
10:20:57.512 [ERROR] [org.gradle.BuildExceptionReporter] at org.gradle.launcher.cli.CommandLineActionFactory$ParseAndBuildAction.execute(CommandLineActionFactory.java:201)
10:20:57.525 [ERROR] [org.gradle.BuildExceptionReporter] at org.gradle.launcher.cli.CommandLineActionFactory$ParseAndBuildAction.execute(CommandLineActionFactory.java:174)
10:20:57.544 [ERROR] [org.gradle.BuildExceptionReporter] at org.gradle.launcher.cli.CommandLineActionFactory$WithLogging.execute(CommandLineActionFactory.java:170)
10:20:57.565 [ERROR] [org.gradle.BuildExceptionReporter] at org.gradle.launcher.cli.CommandLineActionFactory$WithLogging.execute(CommandLineActionFactory.java:139)
10:20:57.582 [ERROR] [org.gradle.BuildExceptionReporter] at org.gradle.launcher.cli.ExceptionReportingAction.execute(ExceptionReportingAction.java:33)
10:20:57.644 [ERROR] [org.gradle.BuildExceptionReporter] at org.gradle.launcher.cli.ExceptionReportingAction.execute(ExceptionReportingAction.java:22)
10:20:57.663 [ERROR] [org.gradle.BuildExceptionReporter] at org.gradle.launcher.Main.doAction(Main.java:46)
10:20:57.685 [ERROR] [org.gradle.BuildExceptionReporter] at org.gradle.launcher.bootstrap.EntryPoint.run(EntryPoint.java:45)
10:20:57.704 [ERROR] [org.gradle.BuildExceptionReporter] at org.gradle.launcher.Main.main(Main.java:37)
10:20:57.723 [ERROR] [org.gradle.BuildExceptionReporter] at org.gradle.launcher.bootstrap.ProcessBootstrap.runNoExit(ProcessBootstrap.java:50)
10:20:57.742 [ERROR] [org.gradle.BuildExceptionReporter] at org.gradle.launcher.bootstrap.ProcessBootstrap.run(ProcessBootstrap.java:32)
10:20:57.760 [ERROR] [org.gradle.BuildExceptionReporter] at org.gradle.launcher.GradleMain.main(GradleMain.java:23)
10:20:57.781 [ERROR] [org.gradle.BuildExceptionReporter] at org.gradle.wrapper.BootstrapMainStarter.start(BootstrapMainStarter.java:33)
10:20:57.801 [ERROR] [org.gradle.BuildExceptionReporter] at org.gradle.wrapper.WrapperExecutor.execute(WrapperExecutor.java:130)
10:20:57.817 [ERROR] [org.gradle.BuildExceptionReporter] at org.gradle.wrapper.GradleWrapperMain.main(GradleWrapperMain.java:48)
10:20:57.834 [ERROR] [org.gradle.BuildExceptionReporter] Caused by: org.gradle.api.plugins.PluginInstantiationException: Could not create plugin of type 'MicrosoftVisualCppPlugin'.
10:20:57.853 [ERROR] [org.gradle.BuildExceptionReporter] at org.gradle.api.internal.plugins.DefaultPluginRegistry.loadPlugin(DefaultPluginRegistry.java:67)
10:20:57.870 [ERROR] [org.gradle.BuildExceptionReporter] at org.gradle.api.internal.plugins.DefaultPluginContainer.providePlugin(DefaultPluginContainer.java:103)
10:20:57.891 [ERROR] [org.gradle.BuildExceptionReporter] at org.gradle.api.internal.plugins.DefaultPluginContainer.addPluginInternal(DefaultPluginContainer.java:68)
10:20:57.913 [ERROR] [org.gradle.BuildExceptionReporter] at org.gradle.api.internal.plugins.DefaultPluginContainer.apply(DefaultPluginContainer.java:38)
10:20:57.942 [ERROR] [org.gradle.BuildExceptionReporter] at org.gradle.nativebinaries.toolchain.internal.plugins.StandardToolChainsPlugin.apply(StandardToolChainsPlugin.java:30)
10:20:57.969 [ERROR] [org.gradle.BuildExceptionReporter] at org.gradle.nativebinaries.toolchain.internal.plugins.StandardToolChainsPlugin.apply(StandardToolChainsPlugin.java:28)
10:20:57.994 [ERROR] [org.gradle.BuildExceptionReporter] at org.gradle.api.internal.plugins.DefaultPluginContainer.providePlugin(DefaultPluginContainer.java:104)
10:20:58.016 [ERROR] [org.gradle.BuildExceptionReporter] at org.gradle.api.internal.plugins.DefaultPluginContainer.addPluginInternal(DefaultPluginContainer.java:68)
10:20:58.033 [ERROR] [org.gradle.BuildExceptionReporter] at org.gradle.api.internal.plugins.DefaultPluginContainer.apply(DefaultPluginContainer.java:38)
10:20:58.053 [ERROR] [org.gradle.BuildExceptionReporter] at org.gradle.api.plugins.PluginContainer$apply.call(Unknown Source)
10:20:58.074 [ERROR] [org.gradle.BuildExceptionReporter] at org.gradle.nativebinaries.language.cpp.plugins.CppPlugin.apply(CppPlugin.groovy:32)
10:20:58.095 [ERROR] [org.gradle.BuildExceptionReporter] at org.gradle.nativebinaries.language.cpp.plugins.CppPlugin.apply(CppPlugin.groovy)
10:20:58.112 [ERROR] [org.gradle.BuildExceptionReporter] at org.gradle.api.internal.plugins.DefaultPluginContainer.providePlugin(DefaultPluginContainer.java:104)
10:20:58.132 [ERROR] [org.gradle.BuildExceptionReporter] at org.gradle.api.internal.plugins.DefaultPluginContainer.addPluginInternal(DefaultPluginContainer.java:68)
10:20:58.148 [ERROR] [org.gradle.BuildExceptionReporter] at org.gradle.api.internal.plugins.DefaultPluginContainer.apply(DefaultPluginContainer.java:34)
10:20:58.168 [ERROR] [org.gradle.BuildExceptionReporter] at org.gradle.api.internal.plugins.DefaultObjectConfigurationAction.applyPlugin(DefaultObjectConfigurationAction.java:101)
10:20:58.187 [ERROR] [org.gradle.BuildExceptionReporter] at org.gradle.api.internal.plugins.DefaultObjectConfigurationAction.access$200(DefaultObjectConfigurationAction.java:32)
10:20:58.206 [ERROR] [org.gradle.BuildExceptionReporter] at org.gradle.api.internal.plugins.DefaultObjectConfigurationAction$3.run(DefaultObjectConfigurationAction.java:72)
10:20:58.225 [ERROR] [org.gradle.BuildExceptionReporter] at org.gradle.api.internal.plugins.DefaultObjectConfigurationAction.execute(DefaultObjectConfigurationAction.java:114)
10:20:58.244 [ERROR] [org.gradle.BuildExceptionReporter] at org.gradle.api.internal.project.AbstractPluginAware.apply(AbstractPluginAware.java:39)
10:20:58.263 [ERROR] [org.gradle.BuildExceptionReporter] at org.gradle.api.Project$apply.call(Unknown Source)
10:20:58.283 [ERROR] [org.gradle.BuildExceptionReporter] at org.gradle.api.internal.project.ProjectScript.apply(ProjectScript.groovy:34)
10:20:58.303 [ERROR] [org.gradle.BuildExceptionReporter] at org.gradle.api.Script$apply.callCurrent(Unknown Source)
10:20:58.323 [ERROR] [org.gradle.BuildExceptionReporter] at build_66achbgh6pdjkrgfdop4489uok.run(C:\tmp\native-platform-master\build.gradle:2)
10:20:58.344 [ERROR] [org.gradle.BuildExceptionReporter] at org.gradle.groovy.scripts.internal.DefaultScriptRunnerFactory$ScriptRunnerImpl.run(DefaultScriptRunnerFactory.java:52)
10:20:58.361 [ERROR] [org.gradle.BuildExceptionReporter] ... 33 more
10:20:58.378 [ERROR] [org.gradle.BuildExceptionReporter] Caused by: org.gradle.internal.service.ServiceCreationException: Could not create service of type SystemInfo using NativeServices.createSystemInfo().
10:20:58.396 [ERROR] [org.gradle.BuildExceptionReporter] at org.gradle.internal.service.DefaultServiceRegistry$FactoryMethodService.invokeMethod(DefaultServiceRegistry.java:634)
10:20:58.416 [ERROR] [org.gradle.BuildExceptionReporter] at org.gradle.internal.service.DefaultServiceRegistry$FactoryService.create(DefaultServiceRegistry.java:588)
10:20:58.437 [ERROR] [org.gradle.BuildExceptionReporter] at org.gradle.internal.service.DefaultServiceRegistry$ManagedObjectProvider.getInstance(DefaultServiceRegistry.java:430)
10:20:58.456 [ERROR] [org.gradle.BuildExceptionReporter] at org.gradle.internal.service.DefaultServiceRegistry$SingletonService.get(DefaultServiceRegistry.java:470)
10:20:58.478 [ERROR] [org.gradle.BuildExceptionReporter] at org.gradle.internal.service.DefaultServiceRegistry.doGet(DefaultServiceRegistry.java:291)
10:20:58.497 [ERROR] [org.gradle.BuildExceptionReporter] at org.gradle.internal.service.DefaultServiceRegistry.get(DefaultServiceRegistry.java:279)
10:20:58.517 [ERROR] [org.gradle.BuildExceptionReporter] at org.gradle.internal.service.DefaultServiceRegistry$ParentServices.getService(DefaultServiceRegistry.java:842)
10:20:58.536 [ERROR] [org.gradle.BuildExceptionReporter] at org.gradle.internal.service.DefaultServiceRegistry$CompositeProvider.getService(DefaultServiceRegistry.java:787)
10:20:58.553 [ERROR] [org.gradle.BuildExceptionReporter] at org.gradle.internal.service.DefaultServiceRegistry$CompositeProvider.getService(DefaultServiceRegistry.java:787)
10:20:58.573 [ERROR] [org.gradle.BuildExceptionReporter] at org.gradle.internal.service.DefaultServiceRegistry$DefaultLookupContext.find(DefaultServiceRegistry.java:977)
10:20:58.590 [ERROR] [org.gradle.BuildExceptionReporter] at org.gradle.internal.service.DefaultServiceRegistry.doGet(DefaultServiceRegistry.java:289)
10:20:58.609 [ERROR] [org.gradle.BuildExceptionReporter] at org.gradle.internal.service.DefaultServiceRegistry.get(DefaultServiceRegistry.java:279)
10:20:58.627 [ERROR] [org.gradle.BuildExceptionReporter] at org.gradle.internal.service.DefaultServiceRegistry$ParentServices.getService(DefaultServiceRegistry.java:842)
10:20:58.645 [ERROR] [org.gradle.BuildExceptionReporter] at org.gradle.internal.service.DefaultServiceRegistry$CompositeProvider.getService(DefaultServiceRegistry.java:787)
10:20:58.661 [ERROR] [org.gradle.BuildExceptionReporter] at org.gradle.internal.service.DefaultServiceRegistry$CompositeProvider.getService(DefaultServiceRegistry.java:787)
10:20:58.678 [ERROR] [org.gradle.BuildExceptionReporter] at org.gradle.internal.service.DefaultServiceRegistry$DefaultLookupContext.find(DefaultServiceRegistry.java:977)
10:20:58.696 [ERROR] [org.gradle.BuildExceptionReporter] at org.gradle.internal.service.DefaultServiceRegistry$FactoryService.bind(DefaultServiceRegistry.java:562)
10:20:58.709 [ERROR] [org.gradle.BuildExceptionReporter] at org.gradle.internal.service.DefaultServiceRegistry$SingletonService.prepare(DefaultServiceRegistry.java:475)
10:20:58.722 [ERROR] [org.gradle.BuildExceptionReporter] at org.gradle.internal.service.DefaultServiceRegistry$SingletonService.getService(DefaultServiceRegistry.java:488)
10:20:58.732 [ERROR] [org.gradle.BuildExceptionReporter] at org.gradle.internal.service.DefaultServiceRegistry$OwnServices.getService(DefaultServiceRegistry.java:379)
10:20:58.741 [ERROR] [org.gradle.BuildExceptionReporter] at org.gradle.internal.service.DefaultServiceRegistry$CompositeProvider.getService(DefaultServiceRegistry.java:787)
10:20:58.750 [ERROR] [org.gradle.BuildExceptionReporter] at org.gradle.internal.service.DefaultServiceRegistry$DefaultLookupContext.find(DefaultServiceRegistry.java:977)
10:20:58.758 [ERROR] [org.gradle.BuildExceptionReporter] at org.gradle.internal.service.DefaultServiceRegistry.doGet(DefaultServiceRegistry.java:289)
10:20:58.767 [ERROR] [org.gradle.BuildExceptionReporter] at org.gradle.internal.service.DefaultServiceRegistry.get(DefaultServiceRegistry.java:279)
10:20:58.776 [ERROR] [org.gradle.BuildExceptionReporter] at org.gradle.internal.service.DefaultServiceRegistry$ParentServices.getService(DefaultServiceRegistry.java:842)
10:20:58.784 [ERROR] [org.gradle.BuildExceptionReporter] at org.gradle.internal.service.DefaultServiceRegistry$CompositeProvider.getService(DefaultServiceRegistry.java:787)
10:20:58.799 [ERROR] [org.gradle.BuildExceptionReporter] at org.gradle.internal.service.DefaultServiceRegistry$CompositeProvider.getService(DefaultServiceRegistry.java:787)
10:20:58.810 [ERROR] [org.gradle.BuildExceptionReporter] at org.gradle.internal.service.DefaultServiceRegistry$DefaultLookupContext.find(DefaultServiceRegistry.java:977)
10:20:58.825 [ERROR] [org.gradle.BuildExceptionReporter] at org.gradle.internal.service.DefaultServiceRegistry.doGet(DefaultServiceRegistry.java:289)
10:20:58.837 [ERROR] [org.gradle.BuildExceptionReporter] at org.gradle.internal.service.DefaultServiceRegistry.get(DefaultServiceRegistry.java:279)
10:20:58.849 [ERROR] [org.gradle.BuildExceptionReporter] at org.gradle.internal.service.DefaultServiceRegistry$ParentServices.getService(DefaultServiceRegistry.java:842)
10:20:58.860 [ERROR] [org.gradle.BuildExceptionReporter] at org.gradle.internal.service.DefaultServiceRegistry$CompositeProvider.getService(DefaultServiceRegistry.java:787)
10:20:58.872 [ERROR] [org.gradle.BuildExceptionReporter] at org.gradle.internal.service.DefaultServiceRegistry$CompositeProvider.getService(DefaultServiceRegistry.java:787)
10:20:58.883 [ERROR] [org.gradle.BuildExceptionReporter] at org.gradle.internal.service.DefaultServiceRegistry$DefaultLookupContext.find(DefaultServiceRegistry.java:977)
10:20:58.895 [ERROR] [org.gradle.BuildExceptionReporter] at org.gradle.internal.service.DefaultServiceRegistry.doGet(DefaultServiceRegistry.java:289)
10:20:58.903 [ERROR] [org.gradle.BuildExceptionReporter] at org.gradle.internal.service.DefaultServiceRegistry.get(DefaultServiceRegistry.java:279)
10:20:58.911 [ERROR] [org.gradle.BuildExceptionReporter] at org.gradle.api.internal.DependencyInjectingInstantiator.convertParameters(DependencyInjectingInstantiator.java:87)
10:20:58.920 [ERROR] [org.gradle.BuildExceptionReporter] at org.gradle.api.internal.DependencyInjectingInstantiator.newInstance(DependencyInjectingInstantiator.java:60)
10:20:58.929 [ERROR] [org.gradle.BuildExceptionReporter] at org.gradle.api.internal.plugins.DefaultPluginRegistry.loadPlugin(DefaultPluginRegistry.java:65)
10:20:58.937 [ERROR] [org.gradle.BuildExceptionReporter] ... 57 more
10:20:58.946 [ERROR] [org.gradle.BuildExceptionReporter] Caused by: net.rubygrapefruit.platform.NativeException: Failed to load native integration SystemInfo.
10:20:58.959 [ERROR] [org.gradle.BuildExceptionReporter] at net.rubygrapefruit.platform.Native.get(Native.java:89)
10:20:58.967 [ERROR] [org.gradle.BuildExceptionReporter] at org.gradle.internal.nativeplatform.services.NativeServices.createSystemInfo(NativeServices.java:155)
10:20:58.976 [ERROR] [org.gradle.BuildExceptionReporter] at org.gradle.internal.reflect.JavaMethod.invoke(JavaMethod.java:63)
10:20:58.984 [ERROR] [org.gradle.BuildExceptionReporter] at org.gradle.internal.service.DefaultServiceRegistry.invoke(DefaultServiceRegistry.java:319)
10:20:58.992 [ERROR] [org.gradle.BuildExceptionReporter] at org.gradle.internal.service.DefaultServiceRegistry.access$1200(DefaultServiceRegistry.java:53)
10:20:59.003 [ERROR] [org.gradle.BuildExceptionReporter] at org.gradle.internal.service.DefaultServiceRegistry$FactoryMethodService.invokeMethod(DefaultServiceRegistry.java:632)
10:20:59.017 [ERROR] [org.gradle.BuildExceptionReporter] ... 95 more
10:20:59.034 [ERROR] [org.gradle.BuildExceptionReporter] Caused by: java.lang.UnsatisfiedLinkError: net.rubygrapefruit.platform.internal.jni.NativeLibraryFunctions.getSystemInfo(Lnet/rubygrapefruit/platform/internal/MutableSystemInfo;Lnet/rubygrapefr
uit/platform/internal/FunctionResult;)V
10:20:59.050 [ERROR] [org.gradle.BuildExceptionReporter] at net.rubygrapefruit.platform.internal.jni.NativeLibraryFunctions.getSystemInfo(Native Method)
10:20:59.063 [ERROR] [org.gradle.BuildExceptionReporter] at net.rubygrapefruit.platform.internal.DefaultSystemInfo.<init>(DefaultSystemInfo.java:28)
10:20:59.078 [ERROR] [org.gradle.BuildExceptionReporter] at net.rubygrapefruit.platform.internal.Platform$Windows.get(Platform.java:112)
10:20:59.091 [ERROR] [org.gradle.BuildExceptionReporter] at net.rubygrapefruit.platform.Native.get(Native.java:85)
10:20:59.105 [ERROR] [org.gradle.BuildExceptionReporter] ... 100 more
10:20:59.119 [ERROR] [org.gradle.BuildExceptionReporter]
10:20:59.131 [LIFECYCLE] [org.gradle.BuildResultLogger]
10:20:59.142 [LIFECYCLE] [org.gradle.BuildResultLogger] BUILD FAILED
10:20:59.156 [LIFECYCLE] [org.gradle.BuildResultLogger]
10:20:59.170 [LIFECYCLE] [org.gradle.BuildResultLogger] Total time: 8.797 secs
10:20:59.184 [DEBUG] [org.gradle.cache.internal.DefaultFileLockManager] Releasing lock on buildscript class cache for settings file 'C:\tmp\native-platform-master\settings.gradle' (C:\data\projects\.gradle\caches\1.12-20140127015041+0000\scripts\sett
ings_2l86dqj4h8kpr4c51qg7ar5ckt\SettingsScript\buildscript).
10:20:59.201 [DEBUG] [org.gradle.cache.internal.DefaultFileLockManager] Releasing lock on no_buildscript class cache for settings file 'C:\tmp\native-platform-master\settings.gradle' (C:\data\projects\.gradle\caches\1.12-20140127015041+0000\scripts\s
ettings_2l86dqj4h8kpr4c51qg7ar5ckt\SettingsScript\no_buildscript).
10:20:59.214 [DEBUG] [org.gradle.cache.internal.DefaultFileLockManager] Releasing lock on buildscript class cache for build file 'C:\tmp\native-platform-master\build.gradle' (C:\data\projects\.gradle\caches\1.12-20140127015041+0000\scripts\build_66ac
hbgh6pdjkrgfdop4489uok\ProjectScript\buildscript).
10:20:59.226 [DEBUG] [org.gradle.cache.internal.DefaultFileLockManager] Releasing lock on no_buildscript class cache for build file 'C:\tmp\native-platform-master\build.gradle' (C:\data\projects\.gradle\caches\1.12-20140127015041+0000\scripts\build_6
6achbgh6pdjkrgfdop4489uok\ProjectScript\no_buildscript).
10:20:59.242 [DEBUG] [org.gradle.cache.internal.DefaultCacheAccess] Cache artifact cache (C:\data\projects\.gradle\caches\modules-2) was closed 0 times.
10:20:59.256 [DEBUG] [org.gradle.api.internal.tasks.compile.daemon.CompilerDaemonManager] Stopping 0 compiler daemon(s).
10:20:59.268 [INFO] [org.gradle.api.internal.tasks.compile.daemon.CompilerDaemonManager] Stopped 0 compiler daemon(s).
10:20:59.282 [DEBUG] [org.gradle.api.internal.artifacts.ivyservice.ivyresolve.memcache.InMemoryDependencyMetadataCache] In-memory dependency metadata cache closed. Repos cached: 0, cache instances: 0, modules served from cache: 0, artifacts: 0
10:20:59.292 [DEBUG] [org.gradle.api.internal.artifacts.ivyservice.resolveengine.store.ResolutionResultsStoreFactory] Deleted 0 resolution results binary files in 0.0 secs
C:\tmp\native-platform-master>
Sign up for free to join this conversation on GitHub. Already have an account? Sign in to comment