Skip to content

Instantly share code, notes, and snippets.

Embed
What would you like to do?
XBuild Engine Version 3.0.11.0
Mono, Version 3.0.11.0
Copyright (C) Marek Sieradzki 2005-2008, Novell 2008-2011.
Loading default tasks for ToolsVersion: 2.0 from /Library/Frameworks/Mono.framework/Versions/3.0.11/lib/mono/2.0/Microsoft.Common.tasks
Build started 6/12/2013 12:00:22 PM.
__________________________________________________
Extension path '/Users/nischal/.config/xbuild/tasks' not found, ignoring.
Extension path '/Users/nischal/.config/xbuild/tasks' not found, ignoring.
Loading default tasks for ToolsVersion: 4.0 from /Library/Frameworks/Mono.framework/Versions/3.0.11/lib/mono/4.0/Microsoft.Common.tasks
/Users/nischal/Projects/AndroidsA/AndroidsA/AndroidsA.csproj: Importing project /Library/Frameworks/Mono.framework/External/xbuild/Novell/Novell.MonoDroid.CSharp.targets from extension path /Library/Frameworks/Mono.framework/External/xbuild
/Library/Frameworks/Mono.framework/External/xbuild/Novell/Novell.MonoDroid.CSharp.targets: Importing project /Library/Frameworks/Mono.framework/External/xbuild/Xamarin/Android/Xamarin.Android.CSharp.targets from extension path /Library/Frameworks/Mono.framework/External/xbuild
/Library/Frameworks/Mono.framework/External/xbuild/Xamarin/Android/Xamarin.Android.CSharp.targets: Importing project /Library/Frameworks/Mono.framework/Versions/3.0.11/lib/mono/4.0/Microsoft.CSharp.Targets
/Library/Frameworks/Mono.framework/Versions/3.0.11/lib/mono/4.0/Microsoft.CSharp.Targets: Importing project /Library/Frameworks/Mono.framework/Versions/3.0.11/lib/mono/4.0/Microsoft.Common.targets
Extension path '/Users/nischal/.config/xbuild/tasks' not found, ignoring.
Extension path '/Users/nischal/.config/xbuild/tasks' not found, ignoring.
Extension path '/Users/nischal/.config/xbuild/tasks' not found, ignoring.
Extension path '/Users/nischal/.config/xbuild/tasks' not found, ignoring.
/Library/Frameworks/Mono.framework/External/xbuild/Xamarin/Android/Xamarin.Android.CSharp.targets: Importing project /Library/Frameworks/Mono.framework/External/xbuild/Xamarin/Android/Xamarin.Android.Common.targets
Extension path '/Users/nischal/.config/xbuild/tasks' not found, ignoring.
Extension path '/Users/nischal/.config/xbuild/tasks' not found, ignoring.
Extension path '/Users/nischal/.config/xbuild/tasks' not found, ignoring.
Extension path '/Users/nischal/.config/xbuild/tasks' not found, ignoring.
Extension path '/Users/nischal/.config/xbuild/tasks' not found, ignoring.
Extension path '/Users/nischal/.config/xbuild/tasks' not found, ignoring.
Extension path '/Users/nischal/.config/xbuild/tasks' not found, ignoring.
Extension path '/Users/nischal/.config/xbuild/tasks' not found, ignoring.
Extension path '/Users/nischal/.config/xbuild/tasks' not found, ignoring.
Extension path '/Users/nischal/.config/xbuild/tasks' not found, ignoring.
Project "/Users/nischal/Projects/AndroidsA/AndroidsA.sln" (Install target(s)):
Initial Properties:
_ = /usr/bin/xbuild
__CF_USER_TEXT_ENCODING = 0x1F5:0:0
Apple_PubSub_Socket_Render = /tmp/launch-0z3ohJ/Render
Apple_Ubiquity_Message = /tmp/launch-lziyAF/Apple_Ubiquity_Message
COMMAND_MODE = unix2003
Configuration = Release
DISPLAY = /tmp/launch-EAskSr/org.x:0
HOME = /Users/nischal
LANG = en_US.UTF-8
LOGNAME = nischal
MSBuildBinPath = /Library/Frameworks/Mono.framework/Versions/3.0.11/lib/mono/4.0
MSBuildExtensionsPath = /Library/Frameworks/Mono.framework/External/xbuild
MSBuildExtensionsPath32 = /Library/Frameworks/Mono.framework/External/xbuild
MSBuildExtensionsPath64 = /Library/Frameworks/Mono.framework/External/xbuild
MSBuildProjectDefaultTargets = Build
MSBuildProjectDirectory = /Users/nischal/Projects/AndroidsA
MSBuildProjectExtension = .sln
MSBuildProjectFile = AndroidsA.sln
MSBuildProjectFullPath = /Users/nischal/Projects/AndroidsA/AndroidsA.sln
MSBuildProjectName = AndroidsA
MSBuildThisFile = AndroidsA.sln
MSBuildThisFileDirectory = /Users/nischal/Projects/AndroidsA/
MSBuildThisFileDirectoryNoRoot = Users/nischal/Projects/AndroidsA/
MSBuildThisFileExtension = .sln
MSBuildThisFileFullPath = /Users/nischal/Projects/AndroidsA/AndroidsA.sln
MSBuildThisFileName = AndroidsA
MSBuildToolsPath = /Library/Frameworks/Mono.framework/Versions/3.0.11/lib/mono/4.0
MSBuildToolsRoot = /Library/Frameworks/Mono.framework/Versions/3.0.11/lib/mono
MSBuildToolsVersion = 4.0
OS = Unix
PATH = /Library/Frameworks/Python.framework/Versions/3.3/bin:/usr/bin:/bin:/usr/sbin:/sbin:/usr/local/bin:/usr/X11/bin
PWD = /Users/nischal/Projects/AndroidsA
SHELL = /bin/bash
SHLVL = 1
SSH_AUTH_SOCK = /tmp/launch-59GVII/Listeners
TERM = xterm-256color
TERM_PROGRAM = Apple_Terminal
TERM_PROGRAM_VERSION = 303.2
TERM_SESSION_ID = D0C804A5-B630-414E-A647-2C2964F9AAAA
TMPDIR = /var/folders/hh/vnw0qs3d5r19tqh5wrj2yj380000gn/T/
USER = nischal
Initial Items:
Extension path '/Users/nischal/.config/xbuild/tasks' not found, ignoring.
Extension path '/Users/nischal/.config/xbuild/tasks' not found, ignoring.
Extension path '/Users/nischal/.config/xbuild/tasks' not found, ignoring.
Extension path '/Users/nischal/.config/xbuild/tasks' not found, ignoring.
Target ValidateSolutionConfiguration:
Task "Message"
Using task Message from Microsoft.Build.Tasks.Message, Microsoft.Build.Tasks.v4.0, Version=4.0.0.0, Culture=neutral, PublicKeyToken=b03f5f7f11d50a3a
Building solution configuration "Release|Any CPU".
Done executing task "Message"
Done building target "ValidateSolutionConfiguration" in project "/Users/nischal/Projects/AndroidsA/AndroidsA.sln".
/Users/nischal/Projects/AndroidsA/AndroidsA.sln: error : Target named 'Install' not found in the project.
Done building project "/Users/nischal/Projects/AndroidsA/AndroidsA.sln".-- FAILED
Target perfomance summary:
21.161 ms ValidateSolutionConfiguration 1 calls
Tasks perfomance summary:
14.301 ms Message 1 calls
Build FAILED.
Errors:
/Users/nischal/Projects/AndroidsA/AndroidsA.sln (Install) ->
/Users/nischal/Projects/AndroidsA/AndroidsA.sln: error : Target named 'Install' not found in the project.
0 Warning(s)
1 Error(s)
Time Elapsed 00:00:00.2390360
Sign up for free to join this conversation on GitHub. Already have an account? Sign in to comment
You can’t perform that action at this time.