Skip to content

Instantly share code, notes, and snippets.

Embed
What would you like to do?
Building Solution: CFNetwork (Debug)
Building: AsyncTests.Framework (Debug)
Performing main compilation...
/Library/Frameworks/Mono.framework/Versions/3.0.4/bin/mcs /noconfig "/r:/Library/Frameworks/Mono.framework/Versions/3.0.4/lib/mono/4.5/mscorlib.dll" -nostdlib "/out:/Users/jatin/Desktop/mac-samples-master/CFNetwork/AsyncTests.Framework/bin/Debug/AsyncTests.Framework.dll" "/r:/Library/Frameworks/Mono.framework/Versions/3.0.4/lib/mono/4.5/System.dll" "/r:/Library/Frameworks/Mono.framework/Versions/3.0.4/lib/mono/4.5/System.Core.dll" "/r:/Library/Frameworks/Mono.framework/Versions/3.0.4/lib/mono/4.5/System.Xml.dll" "/r:/Library/Frameworks/Mono.framework/Versions/3.0.4/lib/mono/mono-addins/Mono.Addins.dll" "/r:/Library/Frameworks/Mono.framework/Versions/3.0.4/lib/mono/4.5/System.Configuration.dll" "/r:/Library/Frameworks/Mono.framework/Versions/3.0.4/lib/mono/2.0/nunit.framework.dll" /nologo /warn:4 /debug:full /optimize- /codepage:utf8 "/define:DEBUG" /t:library "/Users/jatin/Desktop/mac-samples-master/CFNetwork/AsyncTests.Framework/AssemblyInfo.cs" "/Users/jatin/Desktop/mac-samples-master/CFNetwork/AsyncTests.Framework/AsyncTests.Framework/TestCase.cs" "/Users/jatin/Desktop/mac-samples-master/CFNetwork/AsyncTests.Framework/AsyncTests.Framework/TestContext.cs" "/Users/jatin/Desktop/mac-samples-master/CFNetwork/AsyncTests.Framework/AsyncTests.Framework/TestError.cs" "/Users/jatin/Desktop/mac-samples-master/CFNetwork/AsyncTests.Framework/AsyncTests.Framework/TestFixture.cs" "/Users/jatin/Desktop/mac-samples-master/CFNetwork/AsyncTests.Framework/AsyncTests.Framework/TestResult.cs" "/Users/jatin/Desktop/mac-samples-master/CFNetwork/AsyncTests.Framework/AsyncTests.Framework/TestResultCollection.cs" "/Users/jatin/Desktop/mac-samples-master/CFNetwork/AsyncTests.Framework/AsyncTests.Framework/TestResultItem.cs" "/Users/jatin/Desktop/mac-samples-master/CFNetwork/AsyncTests.Framework/AsyncTests.Framework/TestResultText.cs" "/Users/jatin/Desktop/mac-samples-master/CFNetwork/AsyncTests.Framework/AsyncTests.Framework/TestSuccess.cs" "/Users/jatin/Desktop/mac-samples-master/CFNetwork/AsyncTests.Framework/AsyncTests.Framework/TestSuite.cs" "/Users/jatin/Desktop/mac-samples-master/CFNetwork/AsyncTests.Framework/AsyncTests.Framework/ITestFramework.cs" "/Users/jatin/Desktop/mac-samples-master/CFNetwork/AsyncTests.Framework/AsyncTests.Framework/ITestHost.cs" "/Users/jatin/Desktop/mac-samples-master/CFNetwork/AsyncTests.Framework/AsyncTests.Framework/AsyncTestAttribute.cs" "/Users/jatin/Desktop/mac-samples-master/CFNetwork/AsyncTests.Framework/AsyncTests.Framework/AsyncTestFixtureAttribute.cs" "/Users/jatin/Desktop/mac-samples-master/CFNetwork/AsyncTests.Framework/AsyncTests.Framework/Simple/SimpleTestContext.cs" "/Users/jatin/Desktop/mac-samples-master/CFNetwork/AsyncTests.Framework/AsyncTests.Framework/Simple/SimpleTestFramework.cs" "/Users/jatin/Desktop/mac-samples-master/CFNetwork/AsyncTests.Framework/AsyncTests.Framework/TestResultWithErrors.cs" "/Users/jatin/Desktop/mac-samples-master/CFNetwork/AsyncTests.Framework/AsyncTests.Framework/TestErrorException.cs" "/Users/jatin/Desktop/mac-samples-master/CFNetwork/AsyncTests.Framework/AsyncTests.Framework/ResultVisitor.cs" "/Users/jatin/Desktop/mac-samples-master/CFNetwork/AsyncTests.Framework/AsyncTests.Framework/ITestCategory.cs" "/Users/jatin/Desktop/mac-samples-master/CFNetwork/AsyncTests.Framework/AsyncTests.Framework/TestCategoryAttribute.cs" "/Users/jatin/Desktop/mac-samples-master/CFNetwork/AsyncTests.Framework/AsyncTests.Framework/AllTestsCategory.cs" "/Users/jatin/Desktop/mac-samples-master/CFNetwork/AsyncTests.Framework/AsyncTests.Framework/ITestCategoryFilter.cs" "/Users/jatin/Desktop/mac-samples-master/CFNetwork/AsyncTests.Framework/AsyncTests.Framework/NotWorkingAttribute.cs" "/Users/jatin/Desktop/mac-samples-master/CFNetwork/AsyncTests.Framework/AsyncTests.Framework/ExperimentalAttribute.cs" "/Users/jatin/Desktop/mac-samples-master/CFNetwork/AsyncTests.Framework/AsyncTests.Framework/DebugAttribute.cs" "/Users/jatin/Desktop/mac-samples-master/CFNetwork/AsyncTests.Framework/AsyncTests.Framework/AsyncTestSetUpAttribute.cs" "/Users/jatin/Desktop/mac-samples-master/CFNetwork/AsyncTests.Framework/AsyncTests.Framework/AsyncTestTearDownAttribute.cs" "/Users/jatin/Desktop/mac-samples-master/CFNetwork/AsyncTests.Framework/AsyncTests.Framework/ITestRunner.cs" "/Users/jatin/Desktop/mac-samples-master/CFNetwork/AsyncTests.Framework/AsyncTests.Framework/Simple/SimpleTestRunner.cs" "/Users/jatin/Desktop/mac-samples-master/CFNetwork/AsyncTests.Framework/AsyncTests.Framework/ProxyTestRunner.cs" "/Users/jatin/Desktop/mac-samples-master/CFNetwork/AsyncTests.Framework/AsyncTests.Framework/ThreadingMode.cs" "/Users/jatin/Desktop/mac-samples-master/CFNetwork/AsyncTests.Framework/AsyncTests.Framework/ThreadingModeProxyRunner.cs" "/Users/jatin/Desktop/mac-samples-master/CFNetwork/AsyncTests.Framework/AsyncTests.Framework/ConfigurableTestCategoryAttribute.cs" "/Users/jatin/Desktop/mac-samples-master/CFNetwork/AsyncTests.Framework/AsyncTests.Framework/TestConfiguration.cs" "/Users/jatin/Desktop/mac-samples-master/CFNetwork/AsyncTests.Framework/AsyncTests.Framework/TestWarningAttribute.cs" "/Users/jatin/Desktop/mac-samples-master/CFNetwork/AsyncTests.Framework/AsyncTests.Framework/TestWarning.cs" "/Users/jatin/Desktop/mac-samples-master/CFNetwork/AsyncTests.Framework/AsyncTests.Framework/TestStatus.cs"
Build complete -- 0 errors, 0 warnings
Building: AsyncTests.HttpClientTests (Debug)
Performing main compilation...
/Library/Frameworks/Mono.framework/Versions/3.0.4/bin/mcs /noconfig "/r:/Library/Frameworks/Mono.framework/Versions/3.0.4/lib/mono/4.5/mscorlib.dll" -nostdlib "/out:/Users/jatin/Desktop/mac-samples-master/CFNetwork/AsyncTests.HttpClientTests/bin/Debug/AsyncTests.HttpClientTests.dll" "/r:/Library/Frameworks/Mono.framework/Versions/3.0.4/lib/mono/4.5/System.dll" "/r:/Library/Frameworks/Mono.framework/Versions/3.0.4/lib/mono/4.5/System.Core.dll" "/r:/Library/Frameworks/Mono.framework/Versions/3.0.4/lib/mono/4.5/System.Xml.dll" "/r:/Library/Frameworks/Mono.framework/Versions/3.0.4/lib/mono/2.0/nunit.framework.dll" "/r:/Library/Frameworks/Mono.framework/Versions/3.0.4/lib/mono/mono-addins/Mono.Addins.dll" "/r:/Library/Frameworks/Mono.framework/Versions/3.0.4/lib/mono/4.5/System.Configuration.dll" "/r:/Users/jatin/Desktop/mac-samples-master/CFNetwork/AsyncTests.Framework/bin/Debug/AsyncTests.Framework.dll" /nologo /warn:4 /debug:full /optimize- /codepage:utf8 "/define:DEBUG" /t:library "/Users/jatin/Desktop/mac-samples-master/CFNetwork/AsyncTests.HttpClientTests/AssemblyInfo.cs" "/Users/jatin/Desktop/mac-samples-master/CFNetwork/AsyncTests.HttpClientTests/Test/Redirection.cs" "/Users/jatin/Desktop/mac-samples-master/CFNetwork/AsyncTests.HttpClientTests/Test/ServerError.cs" "/Users/jatin/Desktop/mac-samples-master/CFNetwork/AsyncTests.HttpClientTests/Test/HttpClientTests.cs" "/Users/jatin/Desktop/mac-samples-master/CFNetwork/AsyncTests.HttpClientTests/Test/Authentication.cs" "/Users/jatin/Desktop/mac-samples-master/CFNetwork/AsyncTests.HttpClientTests/Test/Simple.cs" "/Users/jatin/Desktop/mac-samples-master/CFNetwork/AsyncTests.HttpClientTests/Test/Timeout.cs" "/Users/jatin/Desktop/mac-samples-master/CFNetwork/AsyncTests.HttpClientTests/Test/LargeDownload.cs" "/Users/jatin/Desktop/mac-samples-master/CFNetwork/AsyncTests.HttpClientTests/Test/Post.cs" "/Users/jatin/Desktop/mac-samples-master/CFNetwork/AsyncTests.HttpClientTests/Test/WebService.cs" "/Users/jatin/Desktop/mac-samples-master/CFNetwork/AsyncTests.HttpClientTests/Test/WebDav.cs" "/Users/jatin/Desktop/mac-samples-master/CFNetwork/AsyncTests.HttpClientTests/Test/WebDavConfiguration.cs" "/Users/jatin/Desktop/mac-samples-master/CFNetwork/AsyncTests.HttpClientTests/Test/RandomDataStream.cs" "/Users/jatin/Desktop/mac-samples-master/CFNetwork/AsyncTests.HttpClientTests/Addin/HttpClientTestAttribute.cs" "/Users/jatin/Desktop/mac-samples-master/CFNetwork/AsyncTests.HttpClientTests/Addin/HttpClientTestContext.cs" "/Users/jatin/Desktop/mac-samples-master/CFNetwork/AsyncTests.HttpClientTests/Addin/HttpClientTestFixtureAttribute.cs" "/Users/jatin/Desktop/mac-samples-master/CFNetwork/AsyncTests.HttpClientTests/Addin/HttpClientTestTarget.cs" "/Users/jatin/Desktop/mac-samples-master/CFNetwork/AsyncTests.HttpClientTests/Addin/IHttpClientHandler.cs" "/Users/jatin/Desktop/mac-samples-master/CFNetwork/AsyncTests.HttpClientTests/Addin/HttpClientTestFramework.cs" "/Users/jatin/Desktop/mac-samples-master/CFNetwork/AsyncTests.HttpClientTests/Addin/HttpClientTestHost.cs" "/Users/jatin/Desktop/mac-samples-master/CFNetwork/AsyncTests.HttpClientTests/Addin/RequestHandlerAttribute.cs" "/Users/jatin/Desktop/mac-samples-master/CFNetwork/AsyncTests.HttpClientTests/Addin/Server.cs" "/Users/jatin/Desktop/mac-samples-master/CFNetwork/AsyncTests.HttpClientTests/Addin/ServerContext.cs" "/Users/jatin/Desktop/mac-samples-master/CFNetwork/AsyncTests.HttpClientTests/Addin/DefaultTestCategory.cs" "/Users/jatin/Desktop/mac-samples-master/CFNetwork/AsyncTests.HttpClientTests/Addin/DefaultTestRunner.cs" "/Users/jatin/Desktop/mac-samples-master/CFNetwork/AsyncTests.HttpClientTests/Addin/ExtensionTestRunner.cs"
Compilation failed: 26 error(s), 0 warnings
/Users/jatin/Desktop/mac-samples-master/CFNetwork/AsyncTests.HttpClientTests/Test/Redirection.cs(35,18): error CS0234: The type or namespace name `Http' does not exist in the namespace `System.Net'. Are you missing `System.Net.Http' assembly reference?
/Users/jatin/Desktop/mac-samples-master/CFNetwork/AsyncTests.HttpClientTests/Test/ServerError.cs(35,18): error CS0234: The type or namespace name `Http' does not exist in the namespace `System.Net'. Are you missing `System.Net.Http' assembly reference?
/Users/jatin/Desktop/mac-samples-master/CFNetwork/AsyncTests.HttpClientTests/Test/HttpClientTests.cs(36,18): error CS0234: The type or namespace name `Http' does not exist in the namespace `System.Net'. Are you missing `System.Net.Http' assembly reference?
/Users/jatin/Desktop/mac-samples-master/CFNetwork/AsyncTests.HttpClientTests/Test/HttpClientTests.cs(37,18): error CS0234: The type or namespace name `Http' does not exist in the namespace `System.Net'. Are you missing `System.Net.Http' assembly reference?
/Users/jatin/Desktop/mac-samples-master/CFNetwork/AsyncTests.HttpClientTests/Test/Authentication.cs(35,18): error CS0234: The type or namespace name `Http' does not exist in the namespace `System.Net'. Are you missing `System.Net.Http' assembly reference?
/Users/jatin/Desktop/mac-samples-master/CFNetwork/AsyncTests.HttpClientTests/Test/Simple.cs(35,18): error CS0234: The type or namespace name `Http' does not exist in the namespace `System.Net'. Are you missing `System.Net.Http' assembly reference?
/Users/jatin/Desktop/mac-samples-master/CFNetwork/AsyncTests.HttpClientTests/Test/Timeout.cs(35,18): error CS0234: The type or namespace name `Http' does not exist in the namespace `System.Net'. Are you missing `System.Net.Http' assembly reference?
/Users/jatin/Desktop/mac-samples-master/CFNetwork/AsyncTests.HttpClientTests/Test/LargeDownload.cs(35,18): error CS0234: The type or namespace name `Http' does not exist in the namespace `System.Net'. Are you missing `System.Net.Http' assembly reference?
/Users/jatin/Desktop/mac-samples-master/CFNetwork/AsyncTests.HttpClientTests/Test/Post.cs(37,18): error CS0234: The type or namespace name `Http' does not exist in the namespace `System.Net'. Are you missing `System.Net.Http' assembly reference?
/Users/jatin/Desktop/mac-samples-master/CFNetwork/AsyncTests.HttpClientTests/Test/Post.cs(38,18): error CS0234: The type or namespace name `Http' does not exist in the namespace `System.Net'. Are you missing `System.Net.Http' assembly reference?
/Users/jatin/Desktop/mac-samples-master/CFNetwork/AsyncTests.HttpClientTests/Test/WebService.cs(37,18): error CS0234: The type or namespace name `Http' does not exist in the namespace `System.Net'. Are you missing `System.Net.Http' assembly reference?
/Users/jatin/Desktop/mac-samples-master/CFNetwork/AsyncTests.HttpClientTests/Test/WebService.cs(38,18): error CS0234: The type or namespace name `Http' does not exist in the namespace `System.Net'. Are you missing `System.Net.Http' assembly reference?
/Users/jatin/Desktop/mac-samples-master/CFNetwork/AsyncTests.HttpClientTests/Test/WebDav.cs(36,18): error CS0234: The type or namespace name `Http' does not exist in the namespace `System.Net'. Are you missing `System.Net.Http' assembly reference?
/Users/jatin/Desktop/mac-samples-master/CFNetwork/AsyncTests.HttpClientTests/Test/WebDav.cs(37,18): error CS0234: The type or namespace name `Http' does not exist in the namespace `System.Net'. Are you missing `System.Net.Http' assembly reference?
/Users/jatin/Desktop/mac-samples-master/CFNetwork/AsyncTests.HttpClientTests/Addin/HttpClientTestContext.cs(33,18): error CS0234: The type or namespace name `Http' does not exist in the namespace `System.Net'. Are you missing `System.Net.Http' assembly reference?
/Users/jatin/Desktop/mac-samples-master/CFNetwork/AsyncTests.HttpClientTests/Addin/IHttpClientHandler.cs(30,18): error CS0234: The type or namespace name `Http' does not exist in the namespace `System.Net'. Are you missing `System.Net.Http' assembly reference?
/Users/jatin/Desktop/mac-samples-master/CFNetwork/AsyncTests.HttpClientTests/Addin/Server.cs(34,18): error CS0234: The type or namespace name `Http' does not exist in the namespace `System.Net'. Are you missing `System.Net.Http' assembly reference?
/Users/jatin/Desktop/mac-samples-master/CFNetwork/AsyncTests.HttpClientTests/Addin/ServerContext.cs(33,18): error CS0234: The type or namespace name `Http' does not exist in the namespace `System.Net'. Are you missing `System.Net.Http' assembly reference?
/Users/jatin/Desktop/mac-samples-master/CFNetwork/AsyncTests.HttpClientTests/Addin/DefaultTestRunner.cs(30,18): error CS0234: The type or namespace name `Http' does not exist in the namespace `System.Net'. Are you missing `System.Net.Http' assembly reference?
/Users/jatin/Desktop/mac-samples-master/CFNetwork/AsyncTests.HttpClientTests/Addin/ExtensionTestRunner.cs(30,18): error CS0234: The type or namespace name `Http' does not exist in the namespace `System.Net'. Are you missing `System.Net.Http' assembly reference?
/Users/jatin/Desktop/mac-samples-master/CFNetwork/AsyncTests.HttpClientTests/Addin/HttpClientTestContext.cs(40,10): error CS0246: The type or namespace name `HttpClient' could not be found. Are you missing an assembly reference?
/Users/jatin/Desktop/mac-samples-master/CFNetwork/AsyncTests.HttpClientTests/Addin/HttpClientTestContext.cs(45,10): error CS0246: The type or namespace name `HttpClientHandler' could not be found. Are you missing an assembly reference?
/Users/jatin/Desktop/mac-samples-master/CFNetwork/AsyncTests.HttpClientTests/Addin/IHttpClientHandler.cs(44,3): error CS0246: The type or namespace name `HttpClientHandler' could not be found. Are you missing an assembly reference?
/Users/jatin/Desktop/mac-samples-master/CFNetwork/AsyncTests.HttpClientTests/Addin/Server.cs(342,41): error CS0246: The type or namespace name `HttpResponseMessage' could not be found. Are you missing an assembly reference?
/Users/jatin/Desktop/mac-samples-master/CFNetwork/AsyncTests.HttpClientTests/Addin/Server.cs(359,38): error CS0246: The type or namespace name `HttpResponseMessage' could not be found. Are you missing an assembly reference?
/Users/jatin/Desktop/mac-samples-master/CFNetwork/AsyncTests.HttpClientTests/Addin/ServerContext.cs(96,43): error CS0246: The type or namespace name `HttpResponseMessage' could not be found. Are you missing an assembly reference?
Build complete -- 26 errors, 1 warning
---------------------- Done ----------------------
The reference 'System.Net.Http' is not valid for the target framework of the project.
Build: 26 errors, 1 warning
Sign up for free to join this conversation on GitHub. Already have an account? Sign in to comment