Skip to content

Instantly share code, notes, and snippets.

Embed
What would you like to do?
Building: fdhdhjkf (Debug)
Build started 5/24/2013 7:36:26 PM.
__________________________________________________
Project "/Users/imac/Projects/fdhdhjkf/fdhdhjkf/fdhdhjkf.csproj" (Build target(s)):
Target _CheckProjectItems:
CheckProjectItems Task
NativeLibraries:
JavaLibraries:
JavaSourceFiles:
Target _ComputeAndroidAssetsPaths:
ResourceFiles:
IntermediateFiles:
Target _GenerateAndroidAssetsDir:
No output files were specified for target _GenerateAndroidAssetsDir, skipping.
Target _ComputeAndroidResourcePaths:
ResourceFiles:
Resources/layout/Main.axml
Resources/values/Strings.xml
Resources/drawable/Icon.png
IntermediateFiles:
Target _GenerateAndroidResourceDir:
Skipping target "_GenerateAndroidResourceDir" because its outputs are up-to-date.
Target _ResolveMonoAndroidSdks:
MonoAndroid Tools: /Library/Frameworks/Xamarin.Android.framework/Versions/Current/lib/mandroid/
MonoAndroid Framework: /Library/Frameworks/Xamarin.Android.framework/Versions/Current/lib/mandroid/platforms/android-8;/Library/Frameworks/Xamarin.Android.framework/Versions/Current/lib/mono/2.1
MonoAndroid Binaries: /Library/Frameworks/Xamarin.Android.framework/Versions/Current/bin/
Android NDK:
Android SDK: /Users/imac/Library/Developer/Xamarin/android-sdk-mac_x86/
Java SDK: /usr/
Target _ValidateAndroidPackageProperties:
GetAndroidPackageName Task
ManifestFile:
AssemblyName: fdhdhjkf
PackageName: fdhdhjkf.fdhdhjkf
Target _BuildDependencies:
Resolved library outputs:
Target _ExtractLibraryProjectImports:
Assemblies:
/Library/Frameworks/Xamarin.Android.framework/Versions/Current/lib/mono/2.1/System.dll
/Library/Frameworks/Xamarin.Android.framework/Versions/Current/lib/mono/2.1/System.Xml.dll
/Library/Frameworks/Xamarin.Android.framework/Versions/Current/lib/mandroid/platforms/android-8/Mono.Android.dll
/Library/Frameworks/Xamarin.Android.framework/Versions/Current/lib/mono/2.1/System.Core.dll
Jars:
ResolvedResourceDirectories:
Target _GetLibraryImports:
NativeLibraries:
Jars:
Target _CheckDuplicateJavaLibraries:
JavaSourceFiles:
JavaLibraries:
Target _UpdateAndroidResgen:
Skipping target "_UpdateAndroidResgen" because its outputs are up-to-date.
Target PrepareForBuild:
Configuration: Debug Platform: AnyCPU
Target GenerateSatelliteAssemblies:
No input files were specified for target GenerateSatelliteAssemblies, skipping.
Target CoreCompile:
Tool /Library/Frameworks/Xamarin.Android.framework/Versions/Current/bin/smcs execution started with arguments: /noconfig /debug+ /optimize- /out:obj/Debug/fdhdhjkf.dll MainActivity.cs Resources/Resource.designer.cs Properties/AssemblyInfo.cs /target:library /define:"DEBUG;__ANDROID__;__ANDROID_1__;__ANDROID_2__;__ANDROID_3__;__ANDROID_4__;__ANDROID_5__;__ANDROID_6__;__ANDROID_7__;__ANDROID_8__" /reference:/Library/Frameworks/Xamarin.Android.framework/Versions/Current/lib/mono/2.1/System.dll /reference:/Library/Frameworks/Xamarin.Android.framework/Versions/Current/lib/mono/2.1/System.Xml.dll /reference:/Library/Frameworks/Xamarin.Android.framework/Versions/Current/lib/mandroid/platforms/android-8/Mono.Android.dll /reference:/Library/Frameworks/Xamarin.Android.framework/Versions/Current/lib/mono/2.1/System.Core.dll /warn:4
MainActivity.cs(18,24): error CS1525: Unexpected symbol `<'
MainActivity.cs(18,30): error CS1525: Unexpected symbol `class'
MainActivity.cs(19,38): error CS1525: Unexpected symbol `private'
MainActivity.cs(19,47): error CS1547: Keyword `void' cannot be used in this context
MainActivity.cs(19,68): error CS1525: Unexpected symbol `('
MainActivity.cs(19,94): error CS1525: Unexpected symbol `e'
MainActivity.cs(24,25): error CS1519: Unexpected symbol `<' in class, struct, or interface member declaration
MainActivity.cs(24,31): error CS1519: Unexpected symbol `>' in class, struct, or interface member declaration
MainActivity.cs(25,45): error CS1001: Unexpected symbol `)', expecting identifier
MainActivity.cs(25,30): error CS1520: Class, struct, or interface method must have a return type
MainActivity.cs(28,60): error CS1001: Unexpected symbol `)', expecting identifier
MainActivity.cs(28,25): error CS1520: Class, struct, or interface method must have a return type
MainActivity.cs(34,39): error CS1519: Unexpected symbol `+=' in class, struct, or interface member declaration
MainActivity.cs(34,50): error CS1519: Unexpected symbol `{' in class, struct, or interface member declaration
MainActivity.cs(35,45): error CS1519: Unexpected symbol `=' in class, struct, or interface member declaration
MainActivity.cs(35,53): error CS1519: Unexpected symbol `.' in class, struct, or interface member declaration
MainActivity.cs(35,63): error CS1525: Unexpected symbol `{0} clicks!'
MainActivity.cs(35,54): error CS1520: Class, struct, or interface method must have a return type
MainActivity.cs(38,24): error CS1525: Unexpected symbol `<'
MainActivity.cs(38,35): error CS1525: Unexpected symbol `='
MainActivity.cs(46,8): error CS1525: Unexpected symbol `}'
Task "Csc" execution -- FAILED
Done building target "CoreCompile" in project "/Users/imac/Projects/fdhdhjkf/fdhdhjkf/fdhdhjkf.csproj".-- FAILED
Done building project "/Users/imac/Projects/fdhdhjkf/fdhdhjkf/fdhdhjkf.csproj".-- FAILED
Build FAILED.
Errors:
/Users/imac/Projects/fdhdhjkf/fdhdhjkf/fdhdhjkf.csproj (Build) ->
/Library/Frameworks/Mono.framework/Versions/2.10.12/lib/mono/4.0/Microsoft.CSharp.Targets (CoreCompile target) ->
MainActivity.cs(18,24): error CS1525: Unexpected symbol `<'
MainActivity.cs(18,30): error CS1525: Unexpected symbol `class'
MainActivity.cs(19,38): error CS1525: Unexpected symbol `private'
MainActivity.cs(19,47): error CS1547: Keyword `void' cannot be used in this context
MainActivity.cs(19,68): error CS1525: Unexpected symbol `('
MainActivity.cs(19,94): error CS1525: Unexpected symbol `e'
MainActivity.cs(24,25): error CS1519: Unexpected symbol `<' in class, struct, or interface member declaration
MainActivity.cs(24,31): error CS1519: Unexpected symbol `>' in class, struct, or interface member declaration
MainActivity.cs(25,45): error CS1001: Unexpected symbol `)', expecting identifier
MainActivity.cs(25,30): error CS1520: Class, struct, or interface method must have a return type
MainActivity.cs(28,60): error CS1001: Unexpected symbol `)', expecting identifier
MainActivity.cs(28,25): error CS1520: Class, struct, or interface method must have a return type
MainActivity.cs(34,39): error CS1519: Unexpected symbol `+=' in class, struct, or interface member declaration
MainActivity.cs(34,50): error CS1519: Unexpected symbol `{' in class, struct, or interface member declaration
MainActivity.cs(35,45): error CS1519: Unexpected symbol `=' in class, struct, or interface member declaration
MainActivity.cs(35,53): error CS1519: Unexpected symbol `.' in class, struct, or interface member declaration
MainActivity.cs(35,63): error CS1525: Unexpected symbol `{0} clicks!'
MainActivity.cs(35,54): error CS1520: Class, struct, or interface method must have a return type
MainActivity.cs(38,24): error CS1525: Unexpected symbol `<'
MainActivity.cs(38,35): error CS1525: Unexpected symbol `='
MainActivity.cs(46,8): error CS1525: Unexpected symbol `}'
0 Warning(s)
21 Error(s)
Time Elapsed 00:00:00.5953530
---------------------- Done ----------------------
Build: 21 errors, 0 warnings
Sign up for free to join this conversation on GitHub. Already have an account? Sign in to comment
You can’t perform that action at this time.