Skip to content

Instantly share code, notes, and snippets.

@banyan banyan/log.md
Last active Aug 29, 2015

Embed
What would you like to do?
> node-sass@1.1.0 install /jenkins/workspace/Tutor Client (deploy to edge)/node_modules/sass-brunch/node_modules/node-sass
> node build.js

`linux-x64-v8-3.14` exists; testing
make: Entering directory `/jenkins/workspace/Tutor Client (deploy to edge)/node_modules/sass-brunch/node_modules/node-sass/build'
  CXX(target) Release/obj.target/binding/binding.o
cc1plus: error: unrecognized command line option ‘-std=c++11’
cc1plus: error: unrecognized command line option ‘-std=c++11’
make: *** [Release/obj.target/binding/binding.o] Error 1
make: Leaving directory `/jenkins/workspace/Tutor Client (deploy to edge)/node_modules/sass-brunch/node_modules/node-sass/build'
gyp ERR! build error 
gyp ERR! stack Error: `make` failed with exit code: 2
gyp ERR! stack     at ChildProcess.onExit (/usr/lib/node_modules/npm/node_modules/node-gyp/lib/build.js:267:23)
gyp ERR! stack     at ChildProcess.emit (events.js:98:17)
gyp ERR! stack     at Process.ChildProcess._handle.onexit (child_process.js:810:12)
gyp ERR! System Linux 3.13.0-32-generic
gyp ERR! command "node" "/usr/lib/node_modules/npm/node_modules/node-gyp/bin/node-gyp.js" "rebuild"
gyp ERR! cwd /jenkins/workspace/Tutor Client (deploy to edge)/node_modules/sass-brunch/node_modules/node-sass
gyp ERR! node -v v0.10.32
gyp ERR! node-gyp -v v1.0.1
gyp ERR! not ok 
Build failed

npm ERR! node-sass@1.1.0 install: `node build.js`
npm ERR! Exit status 1
npm ERR! 
npm ERR! Failed at the node-sass@1.1.0 install script.
npm ERR! This is most likely a problem with the node-sass package,
npm ERR! not with npm itself.
npm ERR! Tell the author that this fails on your system:
npm ERR!     node build.js
npm ERR! You can get their info via:
npm ERR!     npm owner ls node-sass
npm ERR! There is likely additional logging output above.
npm ERR! System Linux 3.13.0-32-generic
npm ERR! command "/usr/bin/node" "/usr/bin/npm" "install"
npm ERR! cwd /jenkins/workspace/Tutor Client (deploy to edge)
npm ERR! node -v v0.10.32
npm ERR! npm -v 1.4.28
npm ERR! code ELIFECYCLE
> node-sass@1.1.1 install /jenkins/workspace/Tutor Client (deploy to edge)/node_modules/sass-brunch/node_modules/node-sass
> node build.js

`linux-x64-v8-3.14` exists; testing
make: Entering directory `/jenkins/workspace/Tutor Client (deploy to edge)/node_modules/sass-brunch/node_modules/node-sass/build'
  CXX(target) Release/obj.target/binding/binding.o
cc1plus: error: unrecognized command line option ‘-std=c++11’
cc1plus: error: unrecognized command line option ‘-std=c++11’
make: *** [Release/obj.target/binding/binding.o] Error 1
make: Leaving directory `/jenkins/workspace/Tutor Client (deploy to edge)/node_modules/sass-brunch/node_modules/node-sass/build'
gyp ERR! build error 
gyp ERR! stack Error: `make` failed with exit code: 2
gyp ERR! stack     at ChildProcess.onExit (/usr/lib/node_modules/npm/node_modules/node-gyp/lib/build.js:267:23)
gyp ERR! stack     at ChildProcess.emit (events.js:98:17)
gyp ERR! stack     at Process.ChildProcess._handle.onexit (child_process.js:810:12)
gyp ERR! System Linux 3.13.0-32-generic
gyp ERR! command "node" "/usr/lib/node_modules/npm/node_modules/node-gyp/bin/node-gyp.js" "rebuild"
gyp ERR! cwd /jenkins/workspace/Tutor Client (deploy to edge)/node_modules/sass-brunch/node_modules/node-sass
gyp ERR! node -v v0.10.32
gyp ERR! node-gyp -v v1.0.1
gyp ERR! not ok 
Build failed

npm ERR! node-sass@1.1.1 install: `node build.js`
npm ERR! Exit status 1
npm ERR! 
npm ERR! Failed at the node-sass@1.1.1 install script.
npm ERR! This is most likely a problem with the node-sass package,
npm ERR! not with npm itself.
npm ERR! Tell the author that this fails on your system:
npm ERR!     node build.js
npm ERR! You can get their info via:
npm ERR!     npm owner ls node-sass
npm ERR! There is likely additional logging output above.
npm ERR! System Linux 3.13.0-32-generic
npm ERR! command "/usr/bin/node" "/usr/bin/npm" "install"
npm ERR! cwd /jenkins/workspace/Tutor Client (deploy to edge)
npm ERR! node -v v0.10.32
npm ERR! npm -v 1.4.28
npm ERR! code ELIFECYCLE
npm ERR! not ok code 0
> node-sass@1.1.3 install /jenkins/workspace/Tutor Client (deploy to edge)/node_modules/sass-brunch/node_modules/node-sass
> node build.js

`linux-x64-v8-3.14` exists; testing
make: Entering directory `/jenkins/workspace/Tutor Client (deploy to edge)/node_modules/sass-brunch/node_modules/node-sass/build'
  CXX(target) Release/obj.target/binding/binding.o
cc1plus: error: unrecognized command line option ‘-std=c++11’
cc1plus: error: unrecognized command line option ‘-std=c++11’
make: *** [Release/obj.target/binding/binding.o] Error 1
make: Leaving directory `/jenkins/workspace/Tutor Client (deploy to edge)/node_modules/sass-brunch/node_modules/node-sass/build'
gyp ERR! build error 
gyp ERR! stack Error: `make` failed with exit code: 2
gyp ERR! stack     at ChildProcess.onExit (/usr/lib/node_modules/npm/node_modules/node-gyp/lib/build.js:267:23)
gyp ERR! stack     at ChildProcess.emit (events.js:98:17)
gyp ERR! stack     at Process.ChildProcess._handle.onexit (child_process.js:810:12)
gyp ERR! System Linux 3.13.0-32-generic
gyp ERR! command "node" "/usr/lib/node_modules/npm/node_modules/node-gyp/bin/node-gyp.js" "rebuild"
gyp ERR! cwd /jenkins/workspace/Tutor Client (deploy to edge)/node_modules/sass-brunch/node_modules/node-sass
gyp ERR! node -v v0.10.32
gyp ERR! node-gyp -v v1.0.1
gyp ERR! not ok 
Build failed

npm ERR! node-sass@1.1.3 install: `node build.js`
npm ERR! Exit status 1
npm ERR! 
npm ERR! Failed at the node-sass@1.1.3 install script.
npm ERR! This is most likely a problem with the node-sass package,
npm ERR! not with npm itself.
npm ERR! Tell the author that this fails on your system:
npm ERR!     node build.js
npm ERR! You can get their info via:
npm ERR!     npm owner ls node-sass
npm ERR! There is likely additional logging output above.
npm ERR! System Linux 3.13.0-32-generic
npm ERR! command "/usr/bin/node" "/usr/bin/npm" "install"
npm ERR! cwd /jenkins/workspace/Tutor Client (deploy to edge)
npm ERR! node -v v0.10.32
npm ERR! npm -v 1.4.28
npm ERR! code ELIFECYCLE
npm ERR! not ok code 0
Sign up for free to join this conversation on GitHub. Already have an account? Sign in to comment
You can’t perform that action at this time.