Skip to content

Instantly share code, notes, and snippets.

Embed
What would you like to do?
-- Looking for include file fpu_control.h
-- Looking for include file fpu_control.h - not found
-- Looking for include file grp.h
-- Looking for include file grp.h - found
-- Looking for include file ieeefp.h
-- Looking for include file ieeefp.h - not found
-- Looking for include file inttypes.h
-- Looking for include file inttypes.h - found
-- Looking for include file langinfo.h
-- Looking for include file langinfo.h - found
-- Looking for include file limits.h
-- Looking for include file limits.h - found
-- Looking for include file locale.h
-- Looking for include file locale.h - found
-- Looking for include file malloc.h
-- Looking for include file malloc.h - not found
-- Looking for include file memory.h
-- Looking for include file memory.h - found
-- Looking for include file ndir.h
-- Looking for include file ndir.h - not found
-- Looking for include file netinet/in.h
-- Looking for include file netinet/in.h - found
-- Looking for include file paths.h
[ 2%] Linking C static library libtimelib.a
-- Looking for include file paths.h - found
-- Looking for include file port.h
[ 2%] Built target timelib
-- Looking for include file port.h - not found
-- Looking for include file poll.h
-- Looking for include file poll.h - found
-- Looking for include file pwd.h
-- Looking for include file pwd.h - found
-- Looking for include file sched.h
-- Looking for include file sched.h - found
-- Looking for include file select.h
-- Looking for include file select.h - not found
-- Looking for include file semaphore.h
-- Looking for include file semaphore.h - found
-- Looking for include files sys/types.h, sys/dir.h
-- Looking for include files sys/types.h, sys/dir.h - found
-- Looking for include file sys/ndir.h
-- Looking for include file sys/ndir.h - not found
-- Looking for include file sys/pte.h
-- Looking for include file sys/pte.h - not found
-- Looking for include file stdlib.h
-- Looking for include file stdlib.h - found
-- Looking for include file strings.h
-- Looking for include file strings.h - found
-- Looking for include file string.h
-- Looking for include file string.h - found
-- Looking for include file synch.h
-- Looking for include file synch.h - not found
-- Looking for include file sysent.h
-- Looking for include file sysent.h - not found
-- Looking for include file sys/cdefs.h
-- Looking for include file sys/cdefs.h - found
-- Looking for include file sys/file.h
-- Looking for include file sys/file.h - found
-- Looking for include file sys/fpu.h
-- Looking for include file sys/fpu.h - not found
-- Looking for include file sys/ioctl.h
-- Looking for include file sys/ioctl.h - found
-- Looking for include file sys/ipc.h
-- Looking for include file sys/ipc.h - found
-- Looking for include file sys/malloc.h
-- Looking for include file sys/malloc.h - found
-- Looking for include file sys/mman.h
-- Looking for include file sys/mman.h - found
-- Looking for include file sys/prctl.h
-- Looking for include file sys/prctl.h - not found
-- Looking for include file sys/resource.h
-- Looking for include file sys/resource.h - found
-- Looking for include file sys/select.h
-- Looking for include file sys/select.h - found
-- Looking for include file sys/shm.h
-- Looking for include file sys/shm.h - found
-- Looking for include file sys/socket.h
-- Looking for include file sys/socket.h - found
-- Looking for include file sys/stat.h
-- Looking for include file sys/stat.h - found
-- Looking for include file sys/stream.h
-- Looking for include file sys/stream.h - not found
-- Looking for include file sys/termcap.h
-- Looking for include file sys/termcap.h - not found
-- Looking for include files time.h, sys/timeb.h
-- Looking for include files time.h, sys/timeb.h - found
-- Looking for include files curses.h, term.h
-- Looking for include files curses.h, term.h - found
-- Looking for include file asm/termbits.h
-- Looking for include file asm/termbits.h - not found
-- Looking for include file termbits.h
-- Looking for include file termbits.h - not found
-- Looking for include file termios.h
-- Looking for include file termios.h - found
-- Looking for include file termio.h
-- Looking for include file termio.h - not found
-- Looking for include file termcap.h
-- Looking for include file termcap.h - found
-- Looking for include file unistd.h
-- Looking for include file unistd.h - found
-- Looking for include file utime.h
-- Looking for include file utime.h - found
-- Looking for include file varargs.h
-- Looking for include file varargs.h - not found
-- Looking for include file sys/time.h
-- Looking for include file sys/time.h - found
-- Looking for include file sys/utime.h
-- Looking for include file sys/utime.h - not found
-- Looking for include file sys/wait.h
-- Looking for include file sys/wait.h - found
-- Looking for include file sys/param.h
-- Looking for include file sys/param.h - found
-- Looking for include file sys/vadvise.h
-- Looking for include file sys/vadvise.h - found
-- Looking for include file fnmatch.h
-- Looking for include file fnmatch.h - found
-- Looking for include file stdarg.h
-- Looking for include file stdarg.h - found
-- Looking for include files stdlib.h, sys/un.h
-- Looking for include files stdlib.h, sys/un.h - found
-- Looking for include file vis.h
-- Looking for include file vis.h - found
-- Looking for include file wchar.h
-- Looking for include file wchar.h - found
-- Looking for include file wctype.h
-- Looking for include file wctype.h - found
-- Looking for include file sasl/sasl.h
-- Looking for include file sasl/sasl.h - found
-- Looking for include file sys/devpoll.h
-- Looking for include file sys/devpoll.h - not found
-- Looking for include file signal.h
-- Looking for include file signal.h - found
-- Looking for include file sys/devpoll.h
-- Looking for include file sys/devpoll.h - not found
-- Looking for include file sys/epoll.h
-- Looking for include file sys/epoll.h - not found
-- Looking for include file sys/event.h
-- Looking for include file sys/event.h - found
-- Looking for include file sys/queue.h
-- Looking for include file sys/queue.h - found
-- Looking for TAILQ_FOREACH
-- Looking for TAILQ_FOREACH - found
-- Looking for include file sys/ptem.h
-- Looking for include file sys/ptem.h - not found
-- Performing Test HAVE_WERROR_FLAG
-- Performing Test HAVE_WERROR_FLAG - Success
-- Performing Test HAVE_PTHREAD_ONCE_INIT
-- Performing Test HAVE_PTHREAD_ONCE_INIT - Success
-- Looking for _aligned_malloc
-- Looking for _aligned_malloc - not found
-- Looking for _aligned_free
-- Looking for _aligned_free - not found
-- Looking for aio_read
-- Looking for aio_read - found
-- Looking for alarm
-- Looking for alarm - found
-- Looking for backtrace
-- Looking for backtrace - found
-- Looking for backtrace_symbols
-- Looking for backtrace_symbols - found
-- Looking for backtrace_symbols_fd
-- Looking for backtrace_symbols_fd - found
-- Looking for printstack
-- Looking for printstack - not found
-- Looking for bmove
-- Looking for bmove - not found
-- Looking for bsearch
-- Looking for bsearch - found
-- Looking for index
-- Looking for index - found
-- Looking for clock_gettime
-- Looking for clock_gettime - not found
-- Looking for cuserid
-- Looking for cuserid - not found
-- Looking for directio
-- Looking for directio - not found
-- Looking for _doprnt
-- Looking for _doprnt - not found
-- Looking for flockfile
-- Looking for flockfile - found
-- Looking for ftruncate
-- Looking for ftruncate - found
-- Looking for getline
-- Looking for getline - found
-- Looking for compress
-- Looking for compress - not found
-- Looking for crypt
-- Looking for crypt - found
-- Looking for dlerror
-- Looking for dlerror - found
-- Looking for dlopen
-- Looking for dlopen - found
-- Looking for fchmod
-- Looking for fchmod - found
-- Looking for fcntl
-- Looking for fcntl - found
-- Looking for fconvert
-- Looking for fconvert - not found
-- Looking for fdatasync
-- Looking for fdatasync - found
-- Looking for fdatasync
-- Looking for fdatasync - not found
-- Looking for fedisableexcept
-- Looking for fedisableexcept - not found
-- Looking for fpsetmask
-- Looking for fpsetmask - not found
-- Looking for fseeko
-- Looking for fseeko - found
-- Looking for fsync
-- Looking for fsync - found
-- Looking for getcwd
-- Looking for getcwd - found
-- Looking for gethostbyaddr_r
-- Looking for gethostbyaddr_r - not found
-- Looking for gethrtime
-- Looking for gethrtime - not found
-- Looking for getnameinfo
-- Looking for getnameinfo - found
-- Looking for getpass
-- Looking for getpass - found
-- Looking for getpassphrase
-- Looking for getpassphrase - not found
-- Looking for getpwnam
-- Looking for getpwnam - found
-- Looking for getpwuid
-- Looking for getpwuid - found
-- Looking for getrlimit
-- Looking for getrlimit - found
-- Looking for getrusage
-- Looking for getrusage - found
-- Looking for getwd
-- Looking for getwd - found
-- Looking for gmtime_r
-- Looking for gmtime_r - found
-- Looking for initgroups
-- Looking for initgroups - found
-- Looking for issetugid
-- Looking for issetugid - found
-- Looking for getuid
-- Looking for getuid - found
-- Looking for geteuid
-- Looking for geteuid - found
-- Looking for getgid
-- Looking for getgid - found
-- Looking for getegid
-- Looking for getegid - found
-- Looking for ldiv
-- Looking for ldiv - found
-- Looking for localtime_r
-- Looking for localtime_r - found
-- Looking for longjmp
-- Looking for longjmp - found
-- Looking for lstat
-- Looking for lstat - found
-- Looking for madvise
-- Looking for madvise - found
-- Looking for malloc_info
-- Looking for malloc_info - not found
-- Looking for memcpy
-- Looking for memcpy - found
-- Looking for memmove
-- Looking for memmove - found
-- Looking for mkstemp
-- Looking for mkstemp - found
-- Looking for mlock
-- Looking for mlock - found
-- Looking for mlockall
-- Looking for mlockall - found
-- Looking for mmap
-- Looking for mmap - found
-- Looking for mmap64
-- Looking for mmap64 - not found
-- Looking for perror
-- Looking for perror - found
-- Looking for poll
-- Looking for poll - found
-- Looking for port_create
-- Looking for port_create - not found
-- Looking for posix_fallocate
-- Looking for posix_fallocate - not found
-- Looking for posix_memalign
-- Looking for posix_memalign - found
-- Looking for pread
-- Looking for pread - found
-- Looking for pthread_attr_create
-- Looking for pthread_attr_create - not found
-- Looking for pthread_attr_getguardsize
-- Looking for pthread_attr_getguardsize - found
-- Looking for pthread_attr_getstacksize
-- Looking for pthread_attr_getstacksize - found
-- Looking for pthread_attr_setscope
-- Looking for pthread_attr_setscope - found
-- Looking for pthread_attr_setstacksize
-- Looking for pthread_attr_setstacksize - found
-- Looking for pthread_condattr_create
-- Looking for pthread_condattr_create - not found
-- Looking for pthread_condattr_setclock
-- Looking for pthread_condattr_setclock - not found
-- Looking for pthread_key_delete
-- Looking for pthread_key_delete - found
-- Looking for pthread_rwlock_rdlock
-- Looking for pthread_rwlock_rdlock - found
-- Looking for pthread_sigmask
-- Looking for pthread_sigmask - found
-- Looking for pthread_threadmask
-- Looking for pthread_threadmask - not found
-- Looking for pthread_yield_np
-- Looking for pthread_yield_np - found
-- Looking for putenv
-- Looking for putenv - found
-- Looking for readdir_r
-- Looking for readdir_r - found
-- Looking for readlink
-- Looking for readlink - found
-- Looking for re_comp
-- Looking for re_comp - not found
-- Looking for regcomp
-- Looking for regcomp - found
-- Looking for realpath
-- Looking for realpath - found
-- Looking for rename
-- Looking for rename - found
-- Looking for rwlock_init
-- Looking for rwlock_init - not found
-- Looking for sched_yield
-- Looking for sched_yield - found
-- Looking for setenv
-- Looking for setenv - found
-- Looking for setlocale
-- Looking for setlocale - found
-- Looking for setfd
-- Looking for setfd - not found
-- Looking for sigaction
-- Looking for sigaction - found
-- Looking for sigthreadmask
-- Looking for sigthreadmask - not found
-- Looking for sigwait
-- Looking for sigwait - found
-- Looking for sigaddset
-- Looking for sigaddset - found
-- Looking for sigemptyset
-- Looking for sigemptyset - found
-- Looking for sighold
-- Looking for sighold - found
-- Looking for sigset
-- Looking for sigset - found
-- Looking for sleep
-- Looking for sleep - found
-- Looking for snprintf
-- Looking for snprintf - found
-- Looking for stpcpy
-- Looking for stpcpy - found
-- Looking for strcoll
-- Looking for strcoll - found
-- Looking for strerror
-- Looking for strerror - found
-- Looking for strlcpy
-- Looking for strlcpy - found
-- Looking for strnlen
-- Looking for strnlen - found
-- Looking for strlcat
-- Looking for strlcat - found
-- Looking for strsignal
-- Looking for strsignal - found
-- Looking for fgetln
-- Looking for fgetln - found
-- Looking for strpbrk
-- Looking for strpbrk - found
-- Looking for strsep
-- Looking for strsep - found
-- Looking for strstr
-- Looking for strstr - found
-- Looking for strtok_r
-- Looking for strtok_r - found
-- Looking for strtol
-- Looking for strtol - found
-- Looking for strtoll
-- Looking for strtoll - found
-- Looking for strtoul
-- Looking for strtoul - found
-- Looking for strtoull
-- Looking for strtoull - found
-- Looking for strcasecmp
-- Looking for strcasecmp - found
-- Looking for strncasecmp
-- Looking for strncasecmp - found
-- Looking for strdup
-- Looking for strdup - found
-- Looking for shmat
-- Looking for shmat - found
-- Looking for shmctl
-- Looking for shmctl - found
-- Looking for shmdt
-- Looking for shmdt - found
-- Looking for shmget
-- Looking for shmget - found
-- Looking for tell
-- Looking for tell - not found
-- Looking for tempnam
-- Looking for tempnam - found
-- Looking for thr_setconcurrency
-- Looking for thr_setconcurrency - not found
-- Looking for thr_yield
-- Looking for thr_yield - not found
-- Looking for vasprintf
-- Looking for vasprintf - found
-- Looking for vsnprintf
-- Looking for vsnprintf - found
-- Looking for vprintf
-- Looking for vprintf - found
-- Looking for valloc
-- Looking for valloc - found
-- Looking for memalign
-- Looking for memalign - not found
-- Looking for chown
-- Looking for chown - found
-- Looking for nl_langinfo
-- Looking for nl_langinfo - found
-- Looking for ntohll
-- Looking for ntohll - not found
-- Looking for clock_gettime
-- Looking for clock_gettime - not found
-- Looking for epoll_create
-- Looking for epoll_create - not found
-- Looking for epoll_ctl
-- Looking for epoll_ctl - not found
-- Looking for inet_ntop
-- Looking for inet_ntop - found
-- Looking for kqueue
-- Looking for kqueue - found
-- Looking for kqueue
-- Looking for kqueue - found
-- Looking for signal
-- Looking for signal - found
-- Looking for timeradd
-- Looking for timeradd - found
-- Looking for timerclear
-- Looking for timerclear - found
-- Looking for timercmp
-- Looking for timercmp - found
-- Looking for timerisset
-- Looking for timerisset - found
-- Looking for timer_create
-- Looking for timer_create - not found
-- Looking for timer_settime
-- Looking for timer_settime - not found
-- Looking for include file time.h
-- Looking for include file time.h - found
-- Looking for include file sys/times.h
-- Looking for include file sys/times.h - found
-- Looking for include file asm/msr.h
-- Looking for include file asm/msr.h - not found
-- Looking for include file ia64intrin.h
-- Looking for include file ia64intrin.h - not found
-- Looking for times
-- Looking for times - found
-- Looking for gettimeofday
-- Looking for gettimeofday - found
-- Looking for read_real_time
-- Looking for read_real_time - not found
-- Looking for ftime
-- Looking for ftime - found
-- Looking for time
-- Looking for time - found
-- Looking for rdtscll
-- Looking for rdtscll - not found
-- Looking for madvise
-- Looking for madvise - found
-- Looking for tzname
-- Looking for tzname - found
-- Looking for lrand48
-- Looking for lrand48 - found
-- Looking for getpagesize
-- Looking for getpagesize - found
-- Looking for TIOCGWINSZ
-- Looking for TIOCGWINSZ - found
-- Looking for FIONREAD
-- Looking for FIONREAD - found
-- Looking for TIOCSTAT
-- Looking for TIOCSTAT - found
-- Looking for FIONREAD
-- Looking for FIONREAD - found
-- Looking for SIGEV_THREAD_ID
-- Looking for SIGEV_THREAD_ID - not found
-- Looking for SIGEV_PORT
-- Looking for SIGEV_PORT - not found
-- Looking for EVFILT_TIMER
-- Looking for EVFILT_TIMER - found
-- Looking for finite
-- Looking for finite - found
-- Looking for log2
-- Looking for log2 - found
-- Looking for isnan
-- Looking for isnan - found
-- Looking for rint
-- Looking for rint - found
-- Performing Test HAVE_ISINF
-- Performing Test HAVE_ISINF - Success
-- Performing Test HAVE_FESETROUND
-- Performing Test HAVE_FESETROUND - Success
-- Check size of sigset_t
-- Check size of sigset_t - done
-- Check size of mode_t
-- Check size of mode_t - done
-- Check size of char
-- Check size of char - done
-- Check size of short
-- Check size of short - done
-- Check size of int
-- Check size of int - done
-- Check size of long long
-- Check size of long long - done
-- Check size of off_t
-- Check size of off_t - done
-- Check size of uchar
-- Check size of uchar - failed
-- Check size of uint
-- Check size of uint - done
-- Check size of ulong
-- Check size of ulong - failed
-- Check size of int8
-- Check size of int8 - failed
-- Check size of uint8
-- Check size of uint8 - failed
-- Check size of int16
-- Check size of int16 - failed
-- Check size of uint16
-- Check size of uint16 - failed
-- Check size of int32
-- Check size of int32 - failed
-- Check size of uint32
-- Check size of uint32 - failed
-- Check size of u_int32_t
-- Check size of u_int32_t - done
-- Check size of int64
-- Check size of int64 - failed
-- Check size of uint64
-- Check size of uint64 - failed
-- Check size of time_t
-- Check size of time_t - done
-- Check size of bool
-- Check size of bool - failed
-- Check size of socklen_t
-- Check size of socklen_t - done
-- Performing Test TIME_T_UNSIGNED
-- Performing Test TIME_T_UNSIGNED - Failed
-- Performing Test HAVE_GETADDRINFO
-- Performing Test HAVE_GETADDRINFO - Success
-- Performing Test HAVE_SELECT
-- Performing Test HAVE_SELECT - Success
-- Performing Test HAVE_TIMESPEC_TS_SEC
-- Performing Test HAVE_TIMESPEC_TS_SEC - Failed
-- Performing Test QSORT_TYPE_IS_VOID
-- Performing Test QSORT_TYPE_IS_VOID - Success
-- Performing Test HAVE_SOCKET_SIZE_T_AS_socklen_t
-- Performing Test HAVE_SOCKET_SIZE_T_AS_socklen_t - Success
-- Performing Test HAVE_PTHREAD_YIELD_ZERO_ARG
-- Performing Test HAVE_PTHREAD_YIELD_ZERO_ARG - Failed
-- Checking stack direction : -1
-- Performing Test SIGNAL_RETURN_TYPE_IS_VOID
-- Performing Test SIGNAL_RETURN_TYPE_IS_VOID - Success
-- Looking for include files time.h, sys/time.h
-- Looking for include files time.h, sys/time.h - found
-- Looking for O_NONBLOCK
-- Looking for O_NONBLOCK - found
-- Performing Test C_HAS_inline
-- Performing Test C_HAS_inline - Success
-- Performing Test HAVE_PAUSE_INSTRUCTION
-- Performing Test HAVE_PAUSE_INSTRUCTION - Success
-- Looking for tcgetattr
-- Looking for tcgetattr - found
-- Performing Test HAVE_POSIX_SIGNALS
-- Performing Test HAVE_POSIX_SIGNALS - Success
-- Performing Test HAVE_BSS_START
-- Performing Test HAVE_BSS_START - Failed
-- Performing Test HAVE_WEAK_SYMBOL
-- Performing Test HAVE_WEAK_SYMBOL - Success
-- Performing Test HAVE_SOLARIS_STYLE_GETHOST
-- Performing Test HAVE_SOLARIS_STYLE_GETHOST - Failed
-- Performing Test HAVE_GCC_ATOMIC_BUILTINS
-- Performing Test HAVE_GCC_ATOMIC_BUILTINS - Success
-- Looking for netinet/in6.h
-- Looking for netinet/in6.h - not found
-- Check size of struct sockaddr_in6
-- Check size of struct sockaddr_in6 - done
-- Check size of struct in6_addr
-- Check size of struct in6_addr - done
-- Performing Test HAVE_SOCKADDR_STORAGE_SS_FAMILY
-- Performing Test HAVE_SOCKADDR_STORAGE_SS_FAMILY - Success
-- Performing Test HAVE_SOCKADDR_IN_SIN_LEN
-- Performing Test HAVE_SOCKADDR_IN_SIN_LEN - Success
-- Performing Test HAVE_SOCKADDR_IN6_SIN6_LEN
-- Performing Test HAVE_SOCKADDR_IN6_SIN6_LEN - Success
-- Performing Test STRUCT_DIRENT_HAS_D_INO
-- Performing Test STRUCT_DIRENT_HAS_D_INO - Success
-- Performing Test STRUCT_DIRENT_HAS_D_NAMLEN
-- Performing Test STRUCT_DIRENT_HAS_D_NAMLEN - Success
-- OPENSSL_INCLUDE_DIR = /usr/local/opt/openssl/include
-- OPENSSL_LIBRARY = /usr/local/opt/openssl/lib/libssl.dylib
-- CRYPTO_LIBRARY = /usr/local/opt/openssl/lib/libcrypto.dylib
-- OPENSSL_MAJOR_VERSION = 1
-- Looking for SHA512_DIGEST_LENGTH
-- Looking for SHA512_DIGEST_LENGTH - found
-- SSL_LIBRARIES = /usr/local/opt/openssl/lib/libssl.dylib;/usr/local/opt/openssl/lib/libcrypto.dylib
-- Check size of mbstate_t
-- Check size of mbstate_t - done
-- Performing Test HAVE_LANGINFO_CODESET
-- Performing Test HAVE_LANGINFO_CODESET - Success
-- Looking for mbrlen
-- Looking for mbrlen - found
-- Looking for mbscmp
-- Looking for mbscmp - not found
-- Looking for mbsrtowcs
-- Looking for mbsrtowcs - found
-- Looking for wcrtomb
-- Looking for wcrtomb - found
-- Looking for mbrtowc
-- Looking for mbrtowc - found
-- Looking for wcscoll
-- Looking for wcscoll - found
-- Looking for wcsdup
-- Looking for wcsdup - found
-- Looking for wcwidth
-- Looking for wcwidth - found
-- Looking for wctype
-- Looking for wctype - found
-- Looking for iswlower
-- Looking for iswlower - found
-- Looking for iswupper
-- Looking for iswupper - found
-- Looking for towlower
-- Looking for towlower - found
-- Looking for towupper
-- Looking for towupper - found
-- Looking for iswctype
-- Looking for iswctype - found
-- Check size of wchar_t
-- Check size of wchar_t - done
-- Check size of wctype_t
-- Check size of wctype_t - done
-- Check size of wint_t
-- Check size of wint_t - done
-- Found Curses: /usr/lib/libcurses.dylib
-- Looking for 3 include files stdio.h, ..., readline/history.h
-- Looking for 3 include files stdio.h, ..., readline/history.h - found
-- Performing Test edit_HAVE_HIST_ENTRY
-- Performing Test edit_HAVE_HIST_ENTRY - Success
-- Performing Test edit_USE_LIBEDIT_INTERFACE
-- Performing Test edit_USE_LIBEDIT_INTERFACE - Failed
-- Performing Test edit_USE_NEW_READLINE_INTERFACE
-- Performing Test edit_USE_NEW_READLINE_INTERFACE - Success
-- Using cmake version 3.4.1
-- Not building NDB
-- Library webscalesqlclient depends on OSLIBS /usr/local/opt/openssl/lib/libssl.dylib;/usr/local/opt/openssl/lib/libcrypto.dylib
-- CMAKE_BUILD_TYPE: RelWithDebInfo
-- COMPILE_DEFINITIONS: HAVE_CONFIG_H
-- CMAKE_C_FLAGS: -Wno-maybe-uninitialized -I/usr/local/opt/readline/include -L/usr/local/opt/readline/lib -msse4.2 -w -Wall -Wextra -Wformat-security -Wwrite-strings -std=c99
-- CMAKE_CXX_FLAGS: -I/usr/local/opt/readline/include -L/usr/local/opt/readline/lib -Wall -std=gnu++11 -stdlib=libc++ -fno-omit-frame-pointer -Woverloaded-virtual -Wno-deprecated -Wno-strict-aliasing -Wno-write-strings -Wno-invalid-offsetof -fno-operator-names -Wno-error=array-bounds -Wno-error=switch -Werror=format-security -Wno-unused-result -Wno-sign-compare -Wno-attributes -Wno-maybe-uninitialized -Wno-mismatched-tags -Wno-unknown-warning-option -Wno-return-type-c-linkage -Qunused-arguments -msse4.2 -Wall -Wextra -Wformat-security -Woverloaded-virtual -Wno-unused-parameter -Wno-null-conversion -Wno-unused-private-field -std=c++11
-- CMAKE_C_FLAGS_RELWITHDEBINFO: -O3 -g -fno-omit-frame-pointer -fno-strict-aliasing -DDBUG_OFF
-- CMAKE_CXX_FLAGS_RELWITHDEBINFO: -O3 -g -fno-omit-frame-pointer -fno-strict-aliasing -DDBUG_OFF
-- Configuring done
-- Generating done
-- Build files have been written to: /tmp/hhvm20151227-316-tfpd0y/hhvm-3.11.0/third-party/webscalesqlclient/mysql-5.6
[ 3%] Performing build step for 'webscalesqlclient'
Scanning dependencies of target gen_dtrace_header
Scanning dependencies of target zlib
[ 1%] Generating include/probes_mysql_dtrace.h, include/probes_mysql_nodtrace.h
[ 1%] Building C object zlib/CMakeFiles/zlib.dir/deflate.c.o
[ 1%] Building C object zlib/CMakeFiles/zlib.dir/adler32.c.o
[ 2%] Building C object zlib/CMakeFiles/zlib.dir/gzio.c.o
[ 2%] Building C object zlib/CMakeFiles/zlib.dir/compress.c.o
[ 4%] Building C object zlib/CMakeFiles/zlib.dir/crc32.c.o
Scanning dependencies of target vio
[ 4%] Building C object vio/CMakeFiles/vio.dir/vio.c.o
[ 4%] Building C object zlib/CMakeFiles/zlib.dir/infback.c.o
Scanning dependencies of target strings
[ 4%] Built target gen_dtrace_header
[ 4%] Building C object strings/CMakeFiles/strings.dir/bchange.c.o
[ 5%] Building C object vio/CMakeFiles/vio.dir/viosocket.c.o
[ 5%] Building C object vio/CMakeFiles/vio.dir/viossl.c.o
[ 7%] Building C object vio/CMakeFiles/vio.dir/viopipe.c.o
[ 7%] Building C object strings/CMakeFiles/strings.dir/bmove_upp.c.o
[ 7%] Building C object zlib/CMakeFiles/zlib.dir/inffast.c.o
[ 8%] Building C object strings/CMakeFiles/strings.dir/ctype-big5.c.o
[ 9%] Building C object zlib/CMakeFiles/zlib.dir/inflate.c.o
[ 9%] Building C object vio/CMakeFiles/vio.dir/vioshm.c.o
[ 9%] Building C object strings/CMakeFiles/strings.dir/ctype-bin.c.o
[ 9%] Building C object vio/CMakeFiles/vio.dir/viosslfactories.c.o
[ 9%] Building C object strings/CMakeFiles/strings.dir/ctype-cp932.c.o
[ 9%] Building C object zlib/CMakeFiles/zlib.dir/inftrees.c.o
[ 9%] Building C object zlib/CMakeFiles/zlib.dir/trees.c.o
[ 11%] Building C object strings/CMakeFiles/strings.dir/ctype-czech.c.o
[ 12%] Building C object zlib/CMakeFiles/zlib.dir/uncompr.c.o
[ 12%] Building C object strings/CMakeFiles/strings.dir/ctype-euc_kr.c.o
[ 14%] Building C object strings/CMakeFiles/strings.dir/ctype-eucjpms.c.o
[ 15%] Linking C static library libvio.a
[ 15%] Building C object strings/CMakeFiles/strings.dir/ctype-extra.c.o
[ 15%] Building C object zlib/CMakeFiles/zlib.dir/zutil.c.o
/Applications/Xcode.app/Contents/Developer/Toolchains/XcodeDefault.xctoolchain/usr/bin/ranlib: file: libvio.a(viopipe.c.o) has no symbols
/Applications/Xcode.app/Contents/Developer/Toolchains/XcodeDefault.xctoolchain/usr/bin/ranlib: file: libvio.a(vioshm.c.o) has no symbols
/Applications/Xcode.app/Contents/Developer/Toolchains/XcodeDefault.xctoolchain/usr/bin/ranlib: file: libvio.a(viopipe.c.o) has no symbols
/Applications/Xcode.app/Contents/Developer/Toolchains/XcodeDefault.xctoolchain/usr/bin/ranlib: file: libvio.a(vioshm.c.o) has no symbols
[ 15%] Built target vio
[ 15%] Building C object strings/CMakeFiles/strings.dir/ctype-gb2312.c.o
[ 16%] Building C object strings/CMakeFiles/strings.dir/ctype-gbk.c.o
[ 16%] Building C object strings/CMakeFiles/strings.dir/ctype-latin1.c.o
[ 16%] Building C object strings/CMakeFiles/strings.dir/ctype-mb.c.o
[ 18%] Building C object strings/CMakeFiles/strings.dir/ctype-simple.c.o
[ 19%] Linking C static library libzlib.a
[ 19%] Building C object strings/CMakeFiles/strings.dir/ctype-sjis.c.o
[ 19%] Building C object strings/CMakeFiles/strings.dir/ctype-tis620.c.o
[ 21%] Building C object strings/CMakeFiles/strings.dir/ctype-uca.c.o
[ 21%] Built target zlib
[ 21%] Building C object strings/CMakeFiles/strings.dir/ctype-ucs2.c.o
[ 22%] Building C object strings/CMakeFiles/strings.dir/ctype-ujis.c.o
[ 22%] Building C object strings/CMakeFiles/strings.dir/ctype-utf8.c.o
[ 22%] Building C object strings/CMakeFiles/strings.dir/ctype-win1250ch.c.o
[ 23%] Building C object strings/CMakeFiles/strings.dir/ctype.c.o
[ 23%] Building C object strings/CMakeFiles/strings.dir/decimal.c.o
[ 23%] Building C object strings/CMakeFiles/strings.dir/dtoa.c.o
[ 25%] Building C object strings/CMakeFiles/strings.dir/int2str.c.o
[ 25%] Building C object strings/CMakeFiles/strings.dir/is_prefix.c.o
[ 25%] Building C object strings/CMakeFiles/strings.dir/llstr.c.o
[ 26%] Building C object strings/CMakeFiles/strings.dir/longlong2str.c.o
[ 26%] Building C object strings/CMakeFiles/strings.dir/my_strtoll10.c.o
[ 28%] Building C object strings/CMakeFiles/strings.dir/my_vsnprintf.c.o
[ 28%] Building C object strings/CMakeFiles/strings.dir/str2int.c.o
[ 28%] Building C object strings/CMakeFiles/strings.dir/str_alloc.c.o
[ 29%] Building C object strings/CMakeFiles/strings.dir/strcend.c.o
[ 29%] Building C object strings/CMakeFiles/strings.dir/strend.c.o
[ 29%] Building C object strings/CMakeFiles/strings.dir/strfill.c.o
[ 30%] Building C object strings/CMakeFiles/strings.dir/strmake.c.o
[ 30%] Building C object strings/CMakeFiles/strings.dir/strmov.c.o
[ 30%] Building C object strings/CMakeFiles/strings.dir/strnmov.c.o
[ 32%] Building C object strings/CMakeFiles/strings.dir/strxmov.c.o
[ 32%] Building C object strings/CMakeFiles/strings.dir/strxnmov.c.o
[ 33%] Building C object strings/CMakeFiles/strings.dir/xml.c.o
[ 33%] Building C object strings/CMakeFiles/strings.dir/my_strchr.c.o
[ 33%] Building C object strings/CMakeFiles/strings.dir/strcont.c.o
[ 35%] Building C object strings/CMakeFiles/strings.dir/strappend.c.o
[ 35%] Linking C static library libstrings.a
/Applications/Xcode.app/Contents/Developer/Toolchains/XcodeDefault.xctoolchain/usr/bin/ranlib: file: libstrings.a(longlong2str.c.o) has no symbols
/Applications/Xcode.app/Contents/Developer/Toolchains/XcodeDefault.xctoolchain/usr/bin/ranlib: file: libstrings.a(longlong2str.c.o) has no symbols
[ 35%] Built target strings
Scanning dependencies of target mysys
[ 35%] Building C object mysys/CMakeFiles/mysys.dir/array.c.o
[ 35%] Building C object mysys/CMakeFiles/mysys.dir/mf_cache.c.o
[ 35%] Building C object mysys/CMakeFiles/mysys.dir/hash.c.o
[ 38%] Building C object mysys/CMakeFiles/mysys.dir/errors.c.o
[ 39%] Building C object mysys/CMakeFiles/mysys.dir/list.c.o
[ 35%] Building C object mysys/CMakeFiles/mysys.dir/charset.c.o
[ 35%] Building C object mysys/CMakeFiles/mysys.dir/checksum.c.o
[ 39%] Building C object mysys/CMakeFiles/mysys.dir/charset-def.c.o
[ 39%] Building C object mysys/CMakeFiles/mysys.dir/mf_dirname.c.o
[ 40%] Building C object mysys/CMakeFiles/mysys.dir/mf_fn_ext.c.o
[ 40%] Building C object mysys/CMakeFiles/mysys.dir/mf_format.c.o
[ 40%] Building C object mysys/CMakeFiles/mysys.dir/mf_getdate.c.o
[ 42%] Building C object mysys/CMakeFiles/mysys.dir/mf_iocache.c.o
[ 42%] Building C object mysys/CMakeFiles/mysys.dir/mf_iocache2.c.o
[ 42%] Building C object mysys/CMakeFiles/mysys.dir/mf_keycache.c.o
[ 43%] Building C object mysys/CMakeFiles/mysys.dir/mf_keycaches.c.o
[ 43%] Building C object mysys/CMakeFiles/mysys.dir/mf_loadpath.c.o
[ 45%] Building C object mysys/CMakeFiles/mysys.dir/mf_pack.c.o
[ 45%] Building C object mysys/CMakeFiles/mysys.dir/mf_path.c.o
[ 45%] Building C object mysys/CMakeFiles/mysys.dir/mf_qsort.c.o
[ 46%] Building C object mysys/CMakeFiles/mysys.dir/mf_qsort2.c.o
[ 46%] Building C object mysys/CMakeFiles/mysys.dir/mf_radix.c.o
[ 46%] Building C object mysys/CMakeFiles/mysys.dir/mf_same.c.o
[ 47%] Building C object mysys/CMakeFiles/mysys.dir/mf_sort.c.o
[ 47%] Building C object mysys/CMakeFiles/mysys.dir/mf_soundex.c.o
[ 47%] Building C object mysys/CMakeFiles/mysys.dir/mf_arr_appstr.c.o
[ 49%] Building C object mysys/CMakeFiles/mysys.dir/mf_tempdir.c.o
[ 49%] Building C object mysys/CMakeFiles/mysys.dir/mf_tempfile.c.o
[ 50%] Building C object mysys/CMakeFiles/mysys.dir/mf_unixpath.c.o
[ 50%] Building C object mysys/CMakeFiles/mysys.dir/mf_wcomp.c.o
[ 50%] Building C object mysys/CMakeFiles/mysys.dir/mulalloc.c.o
[ 52%] Building C object mysys/CMakeFiles/mysys.dir/my_access.c.o
[ 52%] Building C object mysys/CMakeFiles/mysys.dir/my_alloc.c.o
[ 52%] Building C object mysys/CMakeFiles/mysys.dir/my_bit.c.o
[ 53%] Building C object mysys/CMakeFiles/mysys.dir/my_bitmap.c.o
[ 53%] Building C object mysys/CMakeFiles/mysys.dir/my_chsize.c.o
[ 53%] Building C object mysys/CMakeFiles/mysys.dir/my_compress.c.o
[ 54%] Building C object mysys/CMakeFiles/mysys.dir/my_copy.c.o
[ 56%] Building C object mysys/CMakeFiles/mysys.dir/my_create.c.o
[ 56%] Building C object mysys/CMakeFiles/mysys.dir/my_delete.c.o
[ 56%] Building C object mysys/CMakeFiles/mysys.dir/my_div.c.o
[ 56%] Building C object mysys/CMakeFiles/mysys.dir/my_error.c.o
[ 57%] Building C object mysys/CMakeFiles/mysys.dir/my_file.c.o
[ 57%] Building C object mysys/CMakeFiles/mysys.dir/my_fopen.c.o
[ 57%] Building C object mysys/CMakeFiles/mysys.dir/my_fstream.c.o
[ 59%] Building C object mysys/CMakeFiles/mysys.dir/my_gethwaddr.c.o
[ 59%] Building C object mysys/CMakeFiles/mysys.dir/my_getsystime.c.o
[ 59%] Building C object mysys/CMakeFiles/mysys.dir/my_getwd.c.o
[ 60%] Building C object mysys/CMakeFiles/mysys.dir/my_compare.c.o
[ 60%] Building C object mysys/CMakeFiles/mysys.dir/my_init.c.o
[ 61%] Building C object mysys/CMakeFiles/mysys.dir/my_lib.c.o
[ 61%] Building C object mysys/CMakeFiles/mysys.dir/my_lock.c.o
[ 61%] Building C object mysys/CMakeFiles/mysys.dir/my_malloc.c.o
[ 63%] Building C object mysys/CMakeFiles/mysys.dir/my_mess.c.o
[ 63%] Building C object mysys/CMakeFiles/mysys.dir/my_mkdir.c.o
[ 63%] Building C object mysys/CMakeFiles/mysys.dir/my_mmap.c.o
[ 64%] Building C object mysys/CMakeFiles/mysys.dir/my_once.c.o
[ 64%] Building C object mysys/CMakeFiles/mysys.dir/my_open.c.o
[ 64%] Building C object mysys/CMakeFiles/mysys.dir/my_pread.c.o
[ 66%] Building C object mysys/CMakeFiles/mysys.dir/my_quick.c.o
[ 66%] Building C object mysys/CMakeFiles/mysys.dir/my_pthread.c.o
[ 67%] Building C object mysys/CMakeFiles/mysys.dir/my_read.c.o
[ 67%] Building C object mysys/CMakeFiles/mysys.dir/my_redel.c.o
[ 67%] Building C object mysys/CMakeFiles/mysys.dir/my_rename.c.o
[ 69%] Building C object mysys/CMakeFiles/mysys.dir/my_seek.c.o
[ 69%] Building C object mysys/CMakeFiles/mysys.dir/my_static.c.o
[ 69%] Building C object mysys/CMakeFiles/mysys.dir/my_sleep.c.o
[ 70%] Building C object mysys/CMakeFiles/mysys.dir/my_symlink.c.o
[ 70%] Building C object mysys/CMakeFiles/mysys.dir/my_symlink2.c.o
[ 71%] Building C object mysys/CMakeFiles/mysys.dir/my_thr_init.c.o
[ 71%] Building C object mysys/CMakeFiles/mysys.dir/my_sync.c.o
[ 71%] Building C object mysys/CMakeFiles/mysys.dir/my_write.c.o
[ 73%] Building C object mysys/CMakeFiles/mysys.dir/ptr_cmp.c.o
[ 73%] Building C object mysys/CMakeFiles/mysys.dir/queues.c.o
[ 73%] Building C object mysys/CMakeFiles/mysys.dir/stacktrace.c.o
[ 74%] Building C object mysys/CMakeFiles/mysys.dir/string.c.o
[ 74%] Building C object mysys/CMakeFiles/mysys.dir/thr_alarm.c.o
[ 74%] Building C object mysys/CMakeFiles/mysys.dir/thr_lock.c.o
[ 76%] Building C object mysys/CMakeFiles/mysys.dir/thr_mutex.c.o
[ 76%] Building C object mysys/CMakeFiles/mysys.dir/thr_rwlock.c.o
[ 77%] Building C object mysys/CMakeFiles/mysys.dir/tree.c.o
[ 77%] Building C object mysys/CMakeFiles/mysys.dir/typelib.c.o
[ 77%] Building C object mysys/CMakeFiles/mysys.dir/base64.c.o
[ 78%] Building C object mysys/CMakeFiles/mysys.dir/my_memmem.c.o
[ 78%] Building C object mysys/CMakeFiles/mysys.dir/my_getpagesize.c.o
[ 78%] Building C object mysys/CMakeFiles/mysys.dir/lf_alloc-pin.c.o
[ 80%] Building C object mysys/CMakeFiles/mysys.dir/lf_dynarray.c.o
[ 80%] Building C object mysys/CMakeFiles/mysys.dir/lf_hash.c.o
[ 80%] Building C object mysys/CMakeFiles/mysys.dir/my_atomic.c.o
[ 81%] Building C object mysys/CMakeFiles/mysys.dir/my_getncpus.c.o
[ 81%] Building C object mysys/CMakeFiles/mysys.dir/my_rdtsc.c.o
[ 83%] Building C object mysys/CMakeFiles/mysys.dir/waiting_threads.c.o
[ 83%] Building C object mysys/CMakeFiles/mysys.dir/psi_noop.c.o
[ 83%] Building C object mysys/CMakeFiles/mysys.dir/my_alarm.c.o
[ 84%] Building C object mysys/CMakeFiles/mysys.dir/kqueue_timers.c.o
[ 84%] Building C object mysys/CMakeFiles/mysys.dir/my_lockmem.c.o
[ 84%] Linking C static library libmysys.a
/Applications/Xcode.app/Contents/Developer/Toolchains/XcodeDefault.xctoolchain/usr/bin/ranlib: file: libmysys.a(thr_mutex.c.o) has no symbols
/Applications/Xcode.app/Contents/Developer/Toolchains/XcodeDefault.xctoolchain/usr/bin/ranlib: file: libmysys.a(my_getpagesize.c.o) has no symbols
/Applications/Xcode.app/Contents/Developer/Toolchains/XcodeDefault.xctoolchain/usr/bin/ranlib: file: libmysys.a(my_lockmem.c.o) has no symbols
/Applications/Xcode.app/Contents/Developer/Toolchains/XcodeDefault.xctoolchain/usr/bin/ranlib: file: libmysys.a(thr_mutex.c.o) has no symbols
/Applications/Xcode.app/Contents/Developer/Toolchains/XcodeDefault.xctoolchain/usr/bin/ranlib: file: libmysys.a(my_getpagesize.c.o) has no symbols
/Applications/Xcode.app/Contents/Developer/Toolchains/XcodeDefault.xctoolchain/usr/bin/ranlib: file: libmysys.a(my_lockmem.c.o) has no symbols
[ 84%] Built target mysys
Scanning dependencies of target dbug
[ 85%] Building C object dbug/CMakeFiles/dbug.dir/dbug.c.o
[ 85%] Linking C static library libdbug.a
[ 85%] Built target dbug
Scanning dependencies of target mysys_ssl
[ 87%] Building CXX object mysys_ssl/CMakeFiles/mysys_ssl.dir/my_default.cc.o
[ 87%] Building CXX object mysys_ssl/CMakeFiles/mysys_ssl.dir/my_getopt.cc.o
[ 87%] Building CXX object mysys_ssl/CMakeFiles/mysys_ssl.dir/my_sha1.cc.o
[ 87%] Building CXX object mysys_ssl/CMakeFiles/mysys_ssl.dir/my_sha2.cc.o
[ 88%] Building CXX object mysys_ssl/CMakeFiles/mysys_ssl.dir/crypt_genhash_impl.cc.o
[ 90%] Building CXX object mysys_ssl/CMakeFiles/mysys_ssl.dir/my_rnd.cc.o
[ 90%] Building CXX object mysys_ssl/CMakeFiles/mysys_ssl.dir/my_aes.cc.o
[ 90%] Building CXX object mysys_ssl/CMakeFiles/mysys_ssl.dir/my_md5.cc.o
In file included from /tmp/hhvm20151227-316-tfpd0y/hhvm-3.11.0/third-party/webscalesqlclient/src/mysys_ssl/my_md5.cc:25:
/tmp/hhvm20151227-316-tfpd0y/hhvm-3.11.0/third-party/webscalesqlclient/mysql-5.6/include/my_global.h:789:12: fatal error: 'cmath' file not found
#include <cmath>
^
In file included from /tmp/hhvm20151227-316-tfpd0y/hhvm-3.11.0/third-party/webscalesqlclient/src/mysys_ssl/my_default.cc:39:
In file included from /tmp/hhvm20151227-316-tfpd0y/hhvm-3.11.0/third-party/webscalesqlclient/src/mysys_ssl/../mysys/mysys_priv.h:16:
/tmp/hhvm20151227-316-tfpd0y/hhvm-3.11.0/third-party/webscalesqlclient/mysql-5.6/include/my_global.h:789:12: fatal error: 'cmath' file not found
#include <cmath>
^
In file included from /tmp/hhvm20151227-316-tfpd0y/hhvm-3.11.0/third-party/webscalesqlclient/src/mysys_ssl/my_sha2.cc:23:
/tmp/hhvm20151227-316-tfpd0y/hhvm-3.11.0/third-party/webscalesqlclient/mysql-5.6/include/my_global.h:789:12: fatal error: 'cmath' file not found
#include <cmath>
In file included from /tmp/hhvm20151227-316-tfpd0y/hhvm-3.11.0/third-party/webscalesqlclient/src/mysys_ssl/my_rnd.cc:17:
In file included from /tmp/hhvm20151227-316-tfpd0y/hhvm-3.11.0/third-party/webscalesqlclient/mysql-5.6/include/my_rnd.h:24:
/tmp/hhvm20151227-316-tfpd0y/hhvm-3.11.0/third-party/webscalesqlclient/mysql-5.6/include/my_global.h:789:12: fatal error: 'cmath' file not found
#include <cmath>
^
^
In file included from /tmp/hhvm20151227-316-tfpd0y/hhvm-3.11.0/third-party/webscalesqlclient/src/mysys_ssl/my_aes.cc:17:
/tmp/hhvm20151227-316-tfpd0y/hhvm-3.11.0/third-party/webscalesqlclient/mysql-5.6/include/my_global.h:789:12: fatal error: 'cmath' file not found
#include <cmath>
^
In file included from /tmp/hhvm20151227-316-tfpd0y/hhvm-3.11.0/third-party/webscalesqlclient/src/mysys_ssl/my_getopt.cc:16:
/tmp/hhvm20151227-316-tfpd0y/hhvm-3.11.0/third-party/webscalesqlclient/mysql-5.6/include/my_global.h:789:12: fatal error: 'cmath' file not found
#include <cmath>
^
In file included from /tmp/hhvm20151227-316-tfpd0y/hhvm-3.11.0/third-party/webscalesqlclient/src/mysys_ssl/my_sha1.cc:25:
/tmp/hhvm20151227-316-tfpd0y/hhvm-3.11.0/third-party/webscalesqlclient/mysql-5.6/include/my_global.h:789:12: fatal error: 'cmath' file not found
#include <cmath>
^
1 error generated.
In file included from /tmp/hhvm20151227-316-tfpd0y/hhvm-3.11.0/third-party/webscalesqlclient/src/mysys_ssl/crypt_genhash_impl.cc:30:
In file included from /tmp/hhvm20151227-316-tfpd0y/hhvm-3.11.0/third-party/webscalesqlclient/mysql-5.6/include/crypt_genhash_impl.h:17:
/tmp/hhvm20151227-316-tfpd0y/hhvm-3.11.0/third-party/webscalesqlclient/mysql-5.6/include/my_global.h:789:12: fatal error: 'cmath' file not found
#include <cmath>
^
1 error generated.
make[5]: *** [mysys_ssl/CMakeFiles/mysys_ssl.dir/my_sha2.cc.o] Error 1
make[5]: *** Waiting for unfinished jobs....
make[5]: *** [mysys_ssl/CMakeFiles/mysys_ssl.dir/my_sha1.cc.o] Error 1
1 error generated.
1 error generated.
make[5]: *** [mysys_ssl/CMakeFiles/mysys_ssl.dir/my_aes.cc.o] Error 1
make[5]: *** [mysys_ssl/CMakeFiles/mysys_ssl.dir/my_md5.cc.o] Error 1
1 error generated.
make[5]: *** [mysys_ssl/CMakeFiles/mysys_ssl.dir/crypt_genhash_impl.cc.o] Error 1
1 error generated.
make[5]: *** [mysys_ssl/CMakeFiles/mysys_ssl.dir/my_rnd.cc.o] Error 1
1 error generated.
1 error generated.
make[5]: *** [mysys_ssl/CMakeFiles/mysys_ssl.dir/my_default.cc.o] Error 1
make[5]: *** [mysys_ssl/CMakeFiles/mysys_ssl.dir/my_getopt.cc.o] Error 1
make[4]: *** [mysys_ssl/CMakeFiles/mysys_ssl.dir/all] Error 2
make[3]: *** [all] Error 2
make[2]: *** [third-party/webscalesqlclient/build/src/webscalesqlclient-stamp/webscalesqlclient-build] Error 2
make[1]: *** [third-party/webscalesqlclient/CMakeFiles/webscalesqlclient.dir/all] Error 2
make: *** [all] Error 2
==> Formula
Tap: hhvm/hhvm
Path: /usr/local/Library/Taps/hhvm/homebrew-hhvm/hhvm.rb
==> Configuration
HOMEBREW_VERSION: 0.9.5
ORIGIN: https://github.com/Homebrew/homebrew
HEAD: d694de7b8fda8423e109f3dcc424fb3fd74a5cf0
Last commit: 19 hours ago
HOMEBREW_PREFIX: /usr/local
HOMEBREW_REPOSITORY: /usr/local
HOMEBREW_CELLAR: /usr/local/Cellar
HOMEBREW_BOTTLE_DOMAIN: https://homebrew.bintray.com
CPU: 8-core 64-bit haswell
OS X: 10.11.3-x86_64
Xcode: 7.2
CLT: 7.2.0.0.1.1447826929
Clang: 7.0 build 700
X11: N/A
System Ruby: 2.0.0-p645
Perl: /usr/bin/perl
Python: /usr/local/bin/python => /usr/local/Cellar/python/2.7.11/Frameworks/Python.framework/Versions/2.7/bin/python2.7
Ruby: /usr/bin/ruby => /System/Library/Frameworks/Ruby.framework/Versions/2.0/usr/bin/ruby
Java: 1.8.0_60
==> ENV
HOMEBREW_CC: clang
HOMEBREW_CXX: clang++
MAKEFLAGS: -j8
CMAKE_PREFIX_PATH: /usr/local/opt/llvm:/usr/local/opt/gettext:/usr/local/opt/icu4c:/usr/local/opt/openssl:/usr/local/opt/readline:/usr/local/opt/sqlite:/usr/local
CMAKE_INCLUDE_PATH: /usr/include/libxml2:/System/Library/Frameworks/OpenGL.framework/Versions/Current/Headers
CMAKE_LIBRARY_PATH: /System/Library/Frameworks/OpenGL.framework/Versions/Current/Libraries
PKG_CONFIG_PATH: /usr/local/opt/libelf/lib/pkgconfig:/usr/local/opt/libpng/lib/pkgconfig:/usr/local/opt/freetype/lib/pkgconfig:/usr/local/opt/fontconfig/lib/pkgconfig:/usr/local/opt/libtiff/lib/pkgconfig:/usr/local/opt/gd/lib/pkgconfig:/usr/local/opt/glog/lib/pkgconfig:/usr/local/opt/icu4c/lib/pkgconfig:/usr/local/opt/xz/lib/pkgconfig:/usr/local/opt/imagemagick/lib/pkgconfig:/usr/local/opt/jemalloc/lib/pkgconfig:/usr/local/opt/openssl/lib/pkgconfig:/usr/local/opt/libevent/lib/pkgconfig:/usr/local/opt/libmemcached/lib/pkgconfig:/usr/local/opt/libzip/lib/pkgconfig:/usr/local/opt/lz4/lib/pkgconfig:/usr/local/opt/oniguruma/lib/pkgconfig:/usr/local/opt/pcre/lib/pkgconfig:/usr/local/opt/sqlite/lib/pkgconfig
PKG_CONFIG_LIBDIR: /usr/lib/pkgconfig:/usr/local/Library/ENV/pkgconfig/10.11
ACLOCAL_PATH: /usr/local/opt/gettext/share/aclocal:/usr/local/share/aclocal
PATH: /usr/local/Library/ENV/4.3:/usr/local/opt/llvm/bin:/usr/local/opt/autoconf/bin:/usr/local/opt/automake/bin:/usr/local/opt/cmake/bin:/usr/local/opt/dwarfutils/bin:/usr/local/opt/gawk/bin:/usr/local/opt/libtool/bin:/usr/local/opt/md5sha1sum/bin:/usr/local/opt/ocaml/bin:/usr/local/opt/pkg-config/bin:/usr/local/opt/libpng/bin:/usr/local/opt/freetype/bin:/usr/local/opt/fontconfig/bin:/usr/local/opt/jpeg/bin:/usr/local/opt/libtiff/bin:/usr/local/opt/gd/bin:/usr/local/opt/gettext/bin:/usr/local/opt/gflags/bin:/usr/local/opt/icu4c/bin:/usr/local/opt/xz/bin:/usr/local/opt/imagemagick/bin:/usr/local/opt/jemalloc/bin:/usr/local/opt/openssl/bin:/usr/local/opt/libevent/bin:/usr/local/opt/memcached/bin:/usr/local/opt/libmemcached/bin:/usr/local/opt/libzip/bin:/usr/local/opt/lz4/bin:/usr/local/opt/mcrypt/bin:/usr/local/opt/oniguruma/bin:/usr/local/opt/pcre/bin:/usr/local/opt/sqlite/bin:/usr/bin:/bin:/usr/sbin:/sbin
Error: hhvm/hhvm/hhvm 3.11.0 did not build
Logs:
/Users/burak/Library/Logs/Homebrew/hhvm/01.cmake
/Users/burak/Library/Logs/Homebrew/hhvm/01.cmake.cc
/Users/burak/Library/Logs/Homebrew/hhvm/02.make
/Users/burak/Library/Logs/Homebrew/hhvm/02.make.cc
/Users/burak/Library/Logs/Homebrew/hhvm/CMakeCache.txt
Sign up for free to join this conversation on GitHub. Already have an account? Sign in to comment