Skip to content

Instantly share code, notes, and snippets.

Embed
What would you like to do?
(partial) EasyBuild log for failed build of /dev/shm/f115261/eb-dmgn_xoc/files_pr15876/l/LAMMPS/LAMMPS-23Jun2022-foss-2021a-kokkos.eb (PR(s) #15876) (easyblock PR(s) #2213)
== 2022-07-20 17:38:15,670 environment.py:91 INFO Environment variable _ModuleTable010_ set to MCIsfSxPcGVuQkxBUz17WyJmbiJdPSIvc29mdHdhcmUvbW9kdWxlcy9udW1saWIvT3BlbkJMQVMvMC4zLjE1LUdDQy0xMC4zLjAubHVhIixbImZ1bGxOYW1lIl09Ik9wZW5CTEFTLzAuMy4xNS1HQ0MtMTAuMy4wIixbImxvYWRPcmRlciJdPTE0LHByb3BUPXt9LFsic3RhY2tEZXB0aCJdPTIsWyJzdGF0dXMiXT0iYWN0aXZlIixbInVzZXJOYW1lIl09Ik9wZW5CTEFTLzAuMy4xNS1HQ0MtMTAuMy4wIix9LE9wZW5NUEk9e1siZm4iXT0iL3NvZnR3YXJlL21vZHVsZXMvbXBpL09wZW5NUEkvNC4xLjEtR0NDLTEwLjMuMC5sdWEiLFsiZnVsbE5hbWUiXT0iT3Blbk1QSS80LjEuMS1HQ0MtMTAuMy4wIixbImxvYWRPcmRlciJdPTEzLHByb3BUPXt9LFsic3RhY2tEZXB0aCJdPTEsWyJz (previous value: 'MCIsfSxPcGVuQkxBUz17WyJmbiJdPSIvc29mdHdhcmUvbW9kdWxlcy9udW1saWIvT3BlbkJMQVMvMC4zLjE1LUdDQy0xMC4zLjAubHVhIixbImZ1bGxOYW1lIl09Ik9wZW5CTEFTLzAuMy4xNS1HQ0MtMTAuMy4wIixbImxvYWRPcmRlciJdPTE2LHByb3BUPXt9LFsic3RhY2tEZXB0aCJdPTMsWyJzdGF0dXMiXT0iYWN0aXZlIixbInVzZXJOYW1lIl09Ik9wZW5CTEFTLzAuMy4xNS1HQ0MtMTAuMy4wIix9LE9wZW5NUEk9e1siZm4iXT0iL3NvZnR3YXJlL21vZHVsZXMvbXBpL09wZW5NUEkvNC4xLjEtR0NDLTEwLjMuMC5sdWEiLFsiZnVsbE5hbWUiXT0iT3Blbk1QSS80LjEuMS1HQ0MtMTAuMy4wIixbImxvYWRPcmRlciJdPTE1LHByb3BUPXt9LFsic3RhY2tEZXB0aCJdPTIsWyJz')
== 2022-07-20 17:38:15,670 environment.py:91 INFO Environment variable _ModuleTable011_ set to dGF0dXMiXT0iYWN0aXZlIixbInVzZXJOYW1lIl09Ik9wZW5NUEkvNC4xLjEtR0NDLTEwLjMuMCIsfSxPcGVuU1NMPXtbImZuIl09Ii9zb2Z0d2FyZS9tb2R1bGVzL3N5c3RlbS9PcGVuU1NMLzEuMS5sdWEiLFsiZnVsbE5hbWUiXT0iT3BlblNTTC8xLjEiLFsibG9hZE9yZGVyIl09OSxwcm9wVD17fSxbInN0YWNrRGVwdGgiXT0zLFsic3RhdHVzIl09ImFjdGl2ZSIsWyJ1c2VyTmFtZSJdPSJPcGVuU1NMLzEuMSIsfSxQQ1JFPXtbImZuIl09Ii9zb2Z0d2FyZS9tb2R1bGVzL2RldmVsL1BDUkUvOC40NC1HQ0Njb3JlLTEwLjMuMC5sdWEiLFsiZnVsbE5hbWUiXT0iUENSRS84LjQ0LUdDQ2NvcmUtMTAuMy4wIixbImxvYWRPcmRlciJdPTQzLHByb3BUPXt9LFsic3RhY2tEZXB0aCJd (previous value: 'dGF0dXMiXT0iYWN0aXZlIixbInVzZXJOYW1lIl09Ik9wZW5NUEkvNC4xLjEtR0NDLTEwLjMuMCIsfSxPcGVuU1NMPXtbImZuIl09Ii9zb2Z0d2FyZS9tb2R1bGVzL3N5c3RlbS9PcGVuU1NMLzEuMS5sdWEiLFsiZnVsbE5hbWUiXT0iT3BlblNTTC8xLjEiLFsibG9hZE9yZGVyIl09MTEscHJvcFQ9e30sWyJzdGFja0RlcHRoIl09NCxbInN0YXR1cyJdPSJhY3RpdmUiLFsidXNlck5hbWUiXT0iT3BlblNTTC8xLjEiLH0sUENSRT17WyJmbiJdPSIvc29mdHdhcmUvbW9kdWxlcy9kZXZlbC9QQ1JFLzguNDQtR0NDY29yZS0xMC4zLjAubHVhIixbImZ1bGxOYW1lIl09IlBDUkUvOC40NC1HQ0Njb3JlLTEwLjMuMCIsWyJsb2FkT3JkZXIiXT00MCxwcm9wVD17fSxbInN0YWNrRGVwdGgi')
== 2022-07-20 17:38:15,670 environment.py:91 INFO Environment variable _ModuleTable012_ set to PTAsWyJzdGF0dXMiXT0iYWN0aXZlIixbInVzZXJOYW1lIl09IlBDUkUvOC40NC1HQ0Njb3JlLTEwLjMuMCIsfSxQTFVNRUQ9e1siZm4iXT0iL2Rldi9zaG0vZjExNTI2MS9lYXN5YnVpbGRpbnN0YWxsL21vZHVsZXMvYWxsL1BMVU1FRC8yLjcuMi1mb3NzLTIwMjFhLmx1YSIsWyJmdWxsTmFtZSJdPSJQTFVNRUQvMi43LjItZm9zcy0yMDIxYSIsWyJsb2FkT3JkZXIiXT02Mixwcm9wVD17fSxbInN0YWNrRGVwdGgiXT0wLFsic3RhdHVzIl09ImFjdGl2ZSIsWyJ1c2VyTmFtZSJdPSJQTFVNRUQvMi43LjItZm9zcy0yMDIxYSIsfSxQeXRob249e1siZm4iXT0iL3NvZnR3YXJlL21vZHVsZXMvbGFuZy9QeXRob24vMy45LjUtR0NDY29yZS0xMC4zLjAubHVhIixbImZ1bGxOYW1lIl09 (previous value: 'XT0xLFsic3RhdHVzIl09ImFjdGl2ZSIsWyJ1c2VyTmFtZSJdPSJQQ1JFLzguNDQtR0NDY29yZS0xMC4zLjAiLH0sUExVTUVEPXtbImZuIl09Ii9kZXYvc2htL2YxMTUyNjEvZWFzeWJ1aWxkaW5zdGFsbC9tb2R1bGVzL2FsbC9QTFVNRUQvMi43LjItZm9zcy0yMDIxYS5sdWEiLFsiZnVsbE5hbWUiXT0iUExVTUVELzIuNy4yLWZvc3MtMjAyMWEiLFsibG9hZE9yZGVyIl09NjEscHJvcFQ9e30sWyJzdGFja0RlcHRoIl09MSxbInN0YXR1cyJdPSJhY3RpdmUiLFsidXNlck5hbWUiXT0iUExVTUVELzIuNy4yLWZvc3MtMjAyMWEiLH0sUHl0aG9uPXtbImZuIl09Ii9zb2Z0d2FyZS9tb2R1bGVzL2xhbmcvUHl0aG9uLzMuOS41LUdDQ2NvcmUtMTAuMy4wLmx1YSIsWyJmdWxsTmFtZSJd')
== 2022-07-20 17:38:15,670 environment.py:91 INFO Environment variable _ModuleTable013_ set to IlB5dGhvbi8zLjkuNS1HQ0Njb3JlLTEwLjMuMCIsWyJsb2FkT3JkZXIiXT0zMSxwcm9wVD17fSxbInN0YWNrRGVwdGgiXT0wLFsic3RhdHVzIl09ImFjdGl2ZSIsWyJ1c2VyTmFtZSJdPSJQeXRob24vMy45LjUtR0NDY29yZS0xMC4zLjAiLH0sU1FMaXRlPXtbImZuIl09Ii9zb2Z0d2FyZS9tb2R1bGVzL2RldmVsL1NRTGl0ZS8zLjM1LjQtR0NDY29yZS0xMC4zLjAubHVhIixbImZ1bGxOYW1lIl09IlNRTGl0ZS8zLjM1LjQtR0NDY29yZS0xMC4zLjAiLFsibG9hZE9yZGVyIl09MjcscHJvcFQ9e30sWyJzdGFja0RlcHRoIl09MixbInN0YXR1cyJdPSJhY3RpdmUiLFsidXNlck5hbWUiXT0iU1FMaXRlLzMuMzUuNC1HQ0Njb3JlLTEwLjMuMCIsfSxTY2FGYUNvUz17WyJmbiJdPSIv (previous value: 'PSJQeXRob24vMy45LjUtR0NDY29yZS0xMC4zLjAiLFsibG9hZE9yZGVyIl09MjkscHJvcFQ9e30sWyJzdGFja0RlcHRoIl09MSxbInN0YXR1cyJdPSJhY3RpdmUiLFsidXNlck5hbWUiXT0iUHl0aG9uLzMuOS41LUdDQ2NvcmUtMTAuMy4wIix9LFNRTGl0ZT17WyJmbiJdPSIvc29mdHdhcmUvbW9kdWxlcy9kZXZlbC9TUUxpdGUvMy4zNS40LUdDQ2NvcmUtMTAuMy4wLmx1YSIsWyJmdWxsTmFtZSJdPSJTUUxpdGUvMy4zNS40LUdDQ2NvcmUtMTAuMy4wIixbImxvYWRPcmRlciJdPTI2LHByb3BUPXt9LFsic3RhY2tEZXB0aCJdPTIsWyJzdGF0dXMiXT0iYWN0aXZlIixbInVzZXJOYW1lIl09IlNRTGl0ZS8zLjM1LjQtR0NDY29yZS0xMC4zLjAiLH0sU2NhRmFDb1M9e1siZm4iXT0i')
== 2022-07-20 17:38:15,670 environment.py:91 INFO Environment variable _ModuleTable014_ set to ZGV2L3NobS9mMTE1MjYxL2Vhc3lidWlsZGluc3RhbGwvbW9kdWxlcy9hbGwvU2NhRmFDb1MvMS4wLjEtZm9zcy0yMDIxYS5sdWEiLFsiZnVsbE5hbWUiXT0iU2NhRmFDb1MvMS4wLjEtZm9zcy0yMDIxYSIsWyJsb2FkT3JkZXIiXT02Myxwcm9wVD17fSxbInN0YWNrRGVwdGgiXT0wLFsic3RhdHVzIl09ImFjdGl2ZSIsWyJ1c2VyTmFtZSJdPSJTY2FGYUNvUy8xLjAuMS1mb3NzLTIwMjFhIix9LFNjYUxBUEFDSz17WyJmbiJdPSIvc29mdHdhcmUvbW9kdWxlcy9udW1saWIvU2NhTEFQQUNLLzIuMS4wLWdvbXBpLTIwMjFhLWZiLmx1YSIsWyJmdWxsTmFtZSJdPSJTY2FMQVBBQ0svMi4xLjAtZ29tcGktMjAyMWEtZmIiLFsibG9hZE9yZGVyIl09MTgscHJvcFQ9e30sWyJzdGFja0Rl (previous value: 'L2Rldi9zaG0vZjExNTI2MS9lYXN5YnVpbGRpbnN0YWxsL21vZHVsZXMvYWxsL1NjYUZhQ29TLzEuMC4xLWZvc3MtMjAyMWEubHVhIixbImZ1bGxOYW1lIl09IlNjYUZhQ29TLzEuMC4xLWZvc3MtMjAyMWEiLFsibG9hZE9yZGVyIl09NjIscHJvcFQ9e30sWyJzdGFja0RlcHRoIl09MSxbInN0YXR1cyJdPSJhY3RpdmUiLFsidXNlck5hbWUiXT0iU2NhRmFDb1MvMS4wLjEtZm9zcy0yMDIxYSIsfSxTY2FMQVBBQ0s9e1siZm4iXT0iL3NvZnR3YXJlL21vZHVsZXMvbnVtbGliL1NjYUxBUEFDSy8yLjEuMC1nb21waS0yMDIxYS1mYi5sdWEiLFsiZnVsbE5hbWUiXT0iU2NhTEFQQUNLLzIuMS4wLWdvbXBpLTIwMjFhLWZiIixbImxvYWRPcmRlciJdPTIwLHByb3BUPXt9LFsic3RhY2tE')
== 2022-07-20 17:38:15,671 environment.py:91 INFO Environment variable _ModuleTable015_ set to cHRoIl09MSxbInN0YXR1cyJdPSJhY3RpdmUiLFsidXNlck5hbWUiXT0iU2NhTEFQQUNLLzIuMS4wLWdvbXBpLTIwMjFhLWZiIix9LFsiU2NpUHktYnVuZGxlIl09e1siZm4iXT0iL3NvZnR3YXJlL21vZHVsZXMvbGFuZy9TY2lQeS1idW5kbGUvMjAyMS4wNS1mb3NzLTIwMjFhLmx1YSIsWyJmdWxsTmFtZSJdPSJTY2lQeS1idW5kbGUvMjAyMS4wNS1mb3NzLTIwMjFhIixbImxvYWRPcmRlciJdPTY0LHByb3BUPXt9LFsic3RhY2tEZXB0aCJdPTAsWyJzdGF0dXMiXT0iYWN0aXZlIixbInVzZXJOYW1lIl09IlNjaVB5LWJ1bmRsZS8yMDIxLjA1LWZvc3MtMjAyMWEiLH0sU3ppcD17WyJmbiJdPSIvc29mdHdhcmUvbW9kdWxlcy90b29scy9TemlwLzIuMS4xLUdDQ2NvcmUtMTAuMy4w (previous value: 'ZXB0aCJdPTIsWyJzdGF0dXMiXT0iYWN0aXZlIixbInVzZXJOYW1lIl09IlNjYUxBUEFDSy8yLjEuMC1nb21waS0yMDIxYS1mYiIsfSxbIlNjaVB5LWJ1bmRsZSJdPXtbImZuIl09Ii9zb2Z0d2FyZS9tb2R1bGVzL2xhbmcvU2NpUHktYnVuZGxlLzIwMjEuMDUtZm9zcy0yMDIxYS5sdWEiLFsiZnVsbE5hbWUiXT0iU2NpUHktYnVuZGxlLzIwMjEuMDUtZm9zcy0yMDIxYSIsWyJsb2FkT3JkZXIiXT01OCxwcm9wVD17fSxbInN0YWNrRGVwdGgiXT0yLFsic3RhdHVzIl09ImFjdGl2ZSIsWyJ1c2VyTmFtZSJdPSJTY2lQeS1idW5kbGUvMjAyMS4wNS1mb3NzLTIwMjFhIix9LFN6aXA9e1siZm4iXT0iL3NvZnR3YXJlL21vZHVsZXMvdG9vbHMvU3ppcC8yLjEuMS1HQ0Njb3JlLTEwLjMu')
== 2022-07-20 17:38:15,671 environment.py:91 INFO Environment variable _ModuleTable016_ set to Lmx1YSIsWyJmdWxsTmFtZSJdPSJTemlwLzIuMS4xLUdDQ2NvcmUtMTAuMy4wIixbImxvYWRPcmRlciJdPTM1LHByb3BUPXt9LFsic3RhY2tEZXB0aCJdPTIsWyJzdGF0dXMiXT0iYWN0aXZlIixbInVzZXJOYW1lIl09IlN6aXAvMi4xLjEtR0NDY29yZS0xMC4zLjAiLH0sVGNsPXtbImZuIl09Ii9zb2Z0d2FyZS9tb2R1bGVzL2xhbmcvVGNsLzguNi4xMS1HQ0Njb3JlLTEwLjMuMC5sdWEiLFsiZnVsbE5hbWUiXT0iVGNsLzguNi4xMS1HQ0Njb3JlLTEwLjMuMCIsWyJsb2FkT3JkZXIiXT0yNixwcm9wVD17fSxbInN0YWNrRGVwdGgiXT0zLFsic3RhdHVzIl09ImFjdGl2ZSIsWyJ1c2VyTmFtZSJdPSJUY2wvOC42LjExLUdDQ2NvcmUtMTAuMy4wIix9LFVDWD17WyJmbiJdPSIvc29m (previous value: 'MC5sdWEiLFsiZnVsbE5hbWUiXT0iU3ppcC8yLjEuMS1HQ0Njb3JlLTEwLjMuMCIsWyJsb2FkT3JkZXIiXT0zMyxwcm9wVD17fSxbInN0YWNrRGVwdGgiXT0zLFsic3RhdHVzIl09ImFjdGl2ZSIsWyJ1c2VyTmFtZSJdPSJTemlwLzIuMS4xLUdDQ2NvcmUtMTAuMy4wIix9LFRjbD17WyJmbiJdPSIvc29mdHdhcmUvbW9kdWxlcy9sYW5nL1RjbC84LjYuMTEtR0NDY29yZS0xMC4zLjAubHVhIixbImZ1bGxOYW1lIl09IlRjbC84LjYuMTEtR0NDY29yZS0xMC4zLjAiLFsibG9hZE9yZGVyIl09MjUscHJvcFQ9e30sWyJzdGFja0RlcHRoIl09MyxbInN0YXR1cyJdPSJhY3RpdmUiLFsidXNlck5hbWUiXT0iVGNsLzguNi4xMS1HQ0Njb3JlLTEwLjMuMCIsfSxVQ1g9e1siZm4iXT0iL3Nv')
== 2022-07-20 17:38:15,671 environment.py:91 INFO Environment variable _ModuleTable017_ set to dHdhcmUvbW9kdWxlcy9saWIvVUNYLzEuMTAuMC1HQ0Njb3JlLTEwLjMuMC5sdWEiLFsiZnVsbE5hbWUiXT0iVUNYLzEuMTAuMC1HQ0Njb3JlLTEwLjMuMCIsWyJsb2FkT3JkZXIiXT0xMSxwcm9wVD17fSxbInN0YWNrRGVwdGgiXT0yLFsic3RhdHVzIl09ImFjdGl2ZSIsWyJ1c2VyTmFtZSJdPSJVQ1gvMS4xMC4wLUdDQ2NvcmUtMTAuMy4wIix9LFsiVm9ybysrIl09e1siZm4iXT0iL2Rldi9zaG0vZjExNTI2MS9lYXN5YnVpbGRpbnN0YWxsL21vZHVsZXMvYWxsL1Zvcm8rKy8wLjQuNi1HQ0Njb3JlLTEwLjMuMC5sdWEiLFsiZnVsbE5hbWUiXT0iVm9ybysrLzAuNC42LUdDQ2NvcmUtMTAuMy4wIixbImxvYWRPcmRlciJdPTU2LHByb3BUPXt9LFsic3RhY2tEZXB0aCJdPTAsWyJz (previous value: 'ZnR3YXJlL21vZHVsZXMvbGliL1VDWC8xLjEwLjAtR0NDY29yZS0xMC4zLjAubHVhIixbImZ1bGxOYW1lIl09IlVDWC8xLjEwLjAtR0NDY29yZS0xMC4zLjAiLFsibG9hZE9yZGVyIl09MTMscHJvcFQ9e30sWyJzdGFja0RlcHRoIl09MyxbInN0YXR1cyJdPSJhY3RpdmUiLFsidXNlck5hbWUiXT0iVUNYLzEuMTAuMC1HQ0Njb3JlLTEwLjMuMCIsfSxbIlZvcm8rKyJdPXtbImZuIl09Ii9kZXYvc2htL2YxMTUyNjEvZWFzeWJ1aWxkaW5zdGFsbC9tb2R1bGVzL2FsbC9Wb3JvKysvMC40LjYtR0NDY29yZS0xMC4zLjAubHVhIixbImZ1bGxOYW1lIl09IlZvcm8rKy8wLjQuNi1HQ0Njb3JlLTEwLjMuMCIsWyJsb2FkT3JkZXIiXT01Mixwcm9wVD17fSxbInN0YWNrRGVwdGgiXT0xLFsi')
== 2022-07-20 17:38:15,671 environment.py:91 INFO Environment variable _ModuleTable018_ set to dGF0dXMiXT0iYWN0aXZlIixbInVzZXJOYW1lIl09IlZvcm8rKy8wLjQuNi1HQ0Njb3JlLTEwLjMuMCIsfSxYMTE9e1siZm4iXT0iL3NvZnR3YXJlL21vZHVsZXMvdmlzL1gxMS8yMDIxMDUxOC1HQ0Njb3JlLTEwLjMuMC5sdWEiLFsiZnVsbE5hbWUiXT0iWDExLzIwMjEwNTE4LUdDQ2NvcmUtMTAuMy4wIixbImxvYWRPcmRlciJdPTUzLHByb3BUPXt9LFsic3RhY2tEZXB0aCJdPTEsWyJzdGF0dXMiXT0iYWN0aXZlIixbInVzZXJOYW1lIl09IlgxMS8yMDIxMDUxOC1HQ0Njb3JlLTEwLjMuMCIsfSxYWj17WyJmbiJdPSIvc29mdHdhcmUvbW9kdWxlcy90b29scy9YWi81LjIuNS1HQ0Njb3JlLTEwLjMuMC5sdWEiLFsiZnVsbE5hbWUiXT0iWFovNS4yLjUtR0NDY29yZS0xMC4zLjAi (previous value: 'c3RhdHVzIl09ImFjdGl2ZSIsWyJ1c2VyTmFtZSJdPSJWb3JvKysvMC40LjYtR0NDY29yZS0xMC4zLjAiLH0sWDExPXtbImZuIl09Ii9zb2Z0d2FyZS9tb2R1bGVzL3Zpcy9YMTEvMjAyMTA1MTgtR0NDY29yZS0xMC4zLjAubHVhIixbImZ1bGxOYW1lIl09IlgxMS8yMDIxMDUxOC1HQ0Njb3JlLTEwLjMuMCIsWyJsb2FkT3JkZXIiXT00OSxwcm9wVD17fSxbInN0YWNrRGVwdGgiXT0yLFsic3RhdHVzIl09ImFjdGl2ZSIsWyJ1c2VyTmFtZSJdPSJYMTEvMjAyMTA1MTgtR0NDY29yZS0xMC4zLjAiLH0sWFo9e1siZm4iXT0iL3NvZnR3YXJlL21vZHVsZXMvdG9vbHMvWFovNS4yLjUtR0NDY29yZS0xMC4zLjAubHVhIixbImZ1bGxOYW1lIl09IlhaLzUuMi41LUdDQ2NvcmUtMTAuMy4w')
== 2022-07-20 17:38:15,672 environment.py:91 INFO Environment variable EBDEVELPKGMINCONFIG set to /software/software/pkg-config/0.29.2-GCCcore-10.3.0/easybuild/pkg-config-0.29.2-GCCcore-10.3.0-easybuild-devel (previously undefined)
== 2022-07-20 17:38:15,672 environment.py:91 INFO Environment variable EBROOTPKGMINCONFIG set to /software/software/pkg-config/0.29.2-GCCcore-10.3.0 (previously undefined)
== 2022-07-20 17:38:15,672 environment.py:91 INFO Environment variable EBVERSIONPKGMINCONFIG set to 0.29.2 (previously undefined)
== 2022-07-20 17:38:15,672 environment.py:91 INFO Environment variable _ModuleTable019_ set to LFsibG9hZE9yZGVyIl09Nixwcm9wVD17fSxbInN0YWNrRGVwdGgiXT00LFsic3RhdHVzIl09ImFjdGl2ZSIsWyJ1c2VyTmFtZSJdPSJYWi81LjIuNS1HQ0Njb3JlLTEwLjMuMCIsfSxhcmNoc3BlYz17WyJmbiJdPSIvZGV2L3NobS9mMTE1MjYxL2Vhc3lidWlsZGluc3RhbGwvbW9kdWxlcy9hbGwvYXJjaHNwZWMvMC4xLjItR0NDY29yZS0xMC4zLjAubHVhIixbImZ1bGxOYW1lIl09ImFyY2hzcGVjLzAuMS4yLUdDQ2NvcmUtMTAuMy4wIixbImxvYWRPcmRlciJdPTMwLHByb3BUPXt9LFsic3RhY2tEZXB0aCJdPTAsWyJzdGF0dXMiXT0iYWN0aXZlIixbInVzZXJOYW1lIl09ImFyY2hzcGVjLzAuMS4yLUdDQ2NvcmUtMTAuMy4wIix9LGJpbnV0aWxzPXtbImZuIl09Ii9zb2Z0d2Fy (previous value: 'IixbImxvYWRPcmRlciJdPTcscHJvcFQ9e30sWyJzdGFja0RlcHRoIl09NSxbInN0YXR1cyJdPSJhY3RpdmUiLFsidXNlck5hbWUiXT0iWFovNS4yLjUtR0NDY29yZS0xMC4zLjAiLH0sYmludXRpbHM9e1siZm4iXT0iL3NvZnR3YXJlL21vZHVsZXMvdG9vbHMvYmludXRpbHMvMi4zNi4xLUdDQ2NvcmUtMTAuMy4wLmx1YSIsWyJmdWxsTmFtZSJdPSJiaW51dGlscy8yLjM2LjEtR0NDY29yZS0xMC4zLjAiLFsibG9hZE9yZGVyIl09NCxwcm9wVD17fSxbInN0YWNrRGVwdGgiXT0zLFsic3RhdHVzIl09ImFjdGl2ZSIsWyJ1c2VyTmFtZSJdPSJiaW51dGlscy8yLjM2LjEtR0NDY29yZS0xMC4zLjAiLH0sYnppcDI9e1siZm4iXT0iL3NvZnR3YXJlL21vZHVsZXMvdG9vbHMvYnppcDIv')
== 2022-07-20 17:38:15,672 environment.py:91 INFO Environment variable EBDEVELARCHSPEC set to /dev/shm/f115261/easybuildinstall/software/archspec/0.1.2-GCCcore-10.3.0/easybuild/archspec-0.1.2-GCCcore-10.3.0-easybuild-devel (previously undefined)
== 2022-07-20 17:38:15,673 environment.py:91 INFO Environment variable EBROOTARCHSPEC set to /dev/shm/f115261/easybuildinstall/software/archspec/0.1.2-GCCcore-10.3.0 (previously undefined)
== 2022-07-20 17:38:15,673 environment.py:91 INFO Environment variable EBVERSIONARCHSPEC set to 0.1.2 (previously undefined)
== 2022-07-20 17:38:15,673 environment.py:91 INFO Environment variable PYTHONPATH set to /software/software/SciPy-bundle/2021.05-foss-2021a/lib/python3.9/site-packages:/dev/shm/f115261/easybuildinstall/software/PLUMED/2.7.2-foss-2021a/lib/plumed/python:/software/software/pybind11/2.6.2-GCCcore-10.3.0/lib/python3.9/site-packages:/dev/shm/f115261/easybuildinstall/software/tbb/2020.3-GCCcore-10.3.0/python:/software/software/Python/3.9.5-GCCcore-10.3.0/easybuild/python:/dev/shm/f115261/easybuildinstall/software/archspec/0.1.2-GCCcore-10.3.0/lib/python3.9/site-packages (previous value: '/dev/shm/f115261/easybuildinstall/software/PLUMED/2.7.2-foss-2021a/lib/plumed/python:/software/software/SciPy-bundle/2021.05-foss-2021a/lib/python3.9/site-packages:/software/software/pybind11/2.6.2-GCCcore-10.3.0/lib/python3.9/site-packages:/dev/shm/f115261/easybuildinstall/software/tbb/2020.3-GCCcore-10.3.0/python:/software/software/Python/3.9.5-GCCcore-10.3.0/easybuild/python')
== 2022-07-20 17:38:15,674 environment.py:91 INFO Environment variable _ModuleTable020_ set to ZS9tb2R1bGVzL3Rvb2xzL2JpbnV0aWxzLzIuMzYuMS1HQ0Njb3JlLTEwLjMuMC5sdWEiLFsiZnVsbE5hbWUiXT0iYmludXRpbHMvMi4zNi4xLUdDQ2NvcmUtMTAuMy4wIixbImxvYWRPcmRlciJdPTMscHJvcFQ9e30sWyJzdGFja0RlcHRoIl09MixbInN0YXR1cyJdPSJhY3RpdmUiLFsidXNlck5hbWUiXT0iYmludXRpbHMvMi4zNi4xLUdDQ2NvcmUtMTAuMy4wIix9LGJ6aXAyPXtbImZuIl09Ii9zb2Z0d2FyZS9tb2R1bGVzL3Rvb2xzL2J6aXAyLzEuMC44LUdDQ2NvcmUtMTAuMy4wLmx1YSIsWyJmdWxsTmFtZSJdPSJiemlwMi8xLjAuOC1HQ0Njb3JlLTEwLjMuMCIsWyJsb2FkT3JkZXIiXT0yMSxwcm9wVD17fSxbInN0YWNrRGVwdGgiXT0xLFsic3RhdHVzIl09ImFjdGl2ZSIs (previous value: 'MS4wLjgtR0NDY29yZS0xMC4zLjAubHVhIixbImZ1bGxOYW1lIl09ImJ6aXAyLzEuMC44LUdDQ2NvcmUtMTAuMy4wIixbImxvYWRPcmRlciJdPTIyLHByb3BUPXt9LFsic3RhY2tEZXB0aCJdPTIsWyJzdGF0dXMiXT0iYWN0aXZlIixbInVzZXJOYW1lIl09ImJ6aXAyLzEuMC44LUdDQ2NvcmUtMTAuMy4wIix9LGNVUkw9e1siZm4iXT0iL3NvZnR3YXJlL21vZHVsZXMvdG9vbHMvY1VSTC83Ljc2LjAtR0NDY29yZS0xMC4zLjAubHVhIixbImZ1bGxOYW1lIl09ImNVUkwvNy43Ni4wLUdDQ2NvcmUtMTAuMy4wIixbImxvYWRPcmRlciJdPTM0LHByb3BUPXt9LFsic3RhY2tEZXB0aCJdPTIsWyJzdGF0dXMiXT0iYWN0aXZlIixbInVzZXJOYW1lIl09ImNVUkwvNy43Ni4wLUdDQ2NvcmUt')
== 2022-07-20 17:38:15,674 environment.py:91 INFO Environment variable _ModuleTable021_ set to WyJ1c2VyTmFtZSJdPSJiemlwMi8xLjAuOC1HQ0Njb3JlLTEwLjMuMCIsfSxjVVJMPXtbImZuIl09Ii9zb2Z0d2FyZS9tb2R1bGVzL3Rvb2xzL2NVUkwvNy43Ni4wLUdDQ2NvcmUtMTAuMy4wLmx1YSIsWyJmdWxsTmFtZSJdPSJjVVJMLzcuNzYuMC1HQ0Njb3JlLTEwLjMuMCIsWyJsb2FkT3JkZXIiXT00MCxwcm9wVD17fSxbInN0YWNrRGVwdGgiXT0wLFsic3RhdHVzIl09ImFjdGl2ZSIsWyJ1c2VyTmFtZSJdPSJjVVJMLzcuNzYuMC1HQ0Njb3JlLTEwLjMuMCIsfSxleHBhdD17WyJmbiJdPSIvc29mdHdhcmUvbW9kdWxlcy90b29scy9leHBhdC8yLjIuOS1HQ0Njb3JlLTEwLjMuMC5sdWEiLFsiZnVsbE5hbWUiXT0iZXhwYXQvMi4yLjktR0NDY29yZS0xMC4zLjAiLFsibG9hZE9y (previous value: 'MTAuMy4wIix9LGV4cGF0PXtbImZuIl09Ii9zb2Z0d2FyZS9tb2R1bGVzL3Rvb2xzL2V4cGF0LzIuMi45LUdDQ2NvcmUtMTAuMy4wLmx1YSIsWyJmdWxsTmFtZSJdPSJleHBhdC8yLjIuOS1HQ0Njb3JlLTEwLjMuMCIsWyJsb2FkT3JkZXIiXT00NCxwcm9wVD17fSxbInN0YWNrRGVwdGgiXT00LFsic3RhdHVzIl09ImFjdGl2ZSIsWyJ1c2VyTmFtZSJdPSJleHBhdC8yLjIuOS1HQ0Njb3JlLTEwLjMuMCIsfSxmb250Y29uZmlnPXtbImZuIl09Ii9zb2Z0d2FyZS9tb2R1bGVzL3Zpcy9mb250Y29uZmlnLzIuMTMuOTMtR0NDY29yZS0xMC4zLjAubHVhIixbImZ1bGxOYW1lIl09ImZvbnRjb25maWcvMi4xMy45My1HQ0Njb3JlLTEwLjMuMCIsWyJsb2FkT3JkZXIiXT00Nyxwcm9wVD17')
== 2022-07-20 17:38:15,674 environment.py:91 INFO Environment variable _ModuleTable022_ set to ZGVyIl09NDgscHJvcFQ9e30sWyJzdGFja0RlcHRoIl09MyxbInN0YXR1cyJdPSJhY3RpdmUiLFsidXNlck5hbWUiXT0iZXhwYXQvMi4yLjktR0NDY29yZS0xMC4zLjAiLH0sZm9udGNvbmZpZz17WyJmbiJdPSIvc29mdHdhcmUvbW9kdWxlcy92aXMvZm9udGNvbmZpZy8yLjEzLjkzLUdDQ2NvcmUtMTAuMy4wLmx1YSIsWyJmdWxsTmFtZSJdPSJmb250Y29uZmlnLzIuMTMuOTMtR0NDY29yZS0xMC4zLjAiLFsibG9hZE9yZGVyIl09NTEscHJvcFQ9e30sWyJzdGFja0RlcHRoIl09MixbInN0YXR1cyJdPSJhY3RpdmUiLFsidXNlck5hbWUiXT0iZm9udGNvbmZpZy8yLjEzLjkzLUdDQ2NvcmUtMTAuMy4wIix9LGZvc3M9e1siZm4iXT0iL3NvZnR3YXJlL21vZHVsZXMvdG9vbGNoYWlu (previous value: 'fSxbInN0YWNrRGVwdGgiXT0zLFsic3RhdHVzIl09ImFjdGl2ZSIsWyJ1c2VyTmFtZSJdPSJmb250Y29uZmlnLzIuMTMuOTMtR0NDY29yZS0xMC4zLjAiLH0sZm9zcz17WyJmbiJdPSIvc29mdHdhcmUvbW9kdWxlcy90b29sY2hhaW4vZm9zcy8yMDIxYS5sdWEiLFsiZnVsbE5hbWUiXT0iZm9zcy8yMDIxYSIsWyJsb2FkT3JkZXIiXT0yMSxwcm9wVD17fSxbInN0YWNrRGVwdGgiXT0xLFsic3RhdHVzIl09ImFjdGl2ZSIsWyJ1c2VyTmFtZSJdPSJmb3NzLzIwMjFhIix9LGZyZWV0eXBlPXtbImZuIl09Ii9zb2Z0d2FyZS9tb2R1bGVzL3Zpcy9mcmVldHlwZS8yLjEwLjQtR0NDY29yZS0xMC4zLjAubHVhIixbImZ1bGxOYW1lIl09ImZyZWV0eXBlLzIuMTAuNC1HQ0Njb3JlLTEwLjMu')
== 2022-07-20 17:38:15,674 environment.py:91 INFO Environment variable _ModuleTable023_ set to L2Zvc3MvMjAyMWEubHVhIixbImZ1bGxOYW1lIl09ImZvc3MvMjAyMWEiLFsibG9hZE9yZGVyIl09MTkscHJvcFQ9e30sWyJzdGFja0RlcHRoIl09MCxbInN0YXR1cyJdPSJhY3RpdmUiLFsidXNlck5hbWUiXT0iZm9zcy8yMDIxYSIsfSxmcmVldHlwZT17WyJmbiJdPSIvc29mdHdhcmUvbW9kdWxlcy92aXMvZnJlZXR5cGUvMi4xMC40LUdDQ2NvcmUtMTAuMy4wLmx1YSIsWyJmdWxsTmFtZSJdPSJmcmVldHlwZS8yLjEwLjQtR0NDY29yZS0xMC4zLjAiLFsibG9hZE9yZGVyIl09NDkscHJvcFQ9e30sWyJzdGFja0RlcHRoIl09MyxbInN0YXR1cyJdPSJhY3RpdmUiLFsidXNlck5hbWUiXT0iZnJlZXR5cGUvMi4xMC40LUdDQ2NvcmUtMTAuMy4wIix9LGdvbXBpPXtbImZuIl09Ii9z (previous value: 'MCIsWyJsb2FkT3JkZXIiXT00NSxwcm9wVD17fSxbInN0YWNrRGVwdGgiXT00LFsic3RhdHVzIl09ImFjdGl2ZSIsWyJ1c2VyTmFtZSJdPSJmcmVldHlwZS8yLjEwLjQtR0NDY29yZS0xMC4zLjAiLH0sZ29tcGk9e1siZm4iXT0iL3NvZnR3YXJlL21vZHVsZXMvdG9vbGNoYWluL2dvbXBpLzIwMjFhLmx1YSIsWyJmdWxsTmFtZSJdPSJnb21waS8yMDIxYSIsWyJsb2FkT3JkZXIiXT0xOCxwcm9wVD17fSxbInN0YWNrRGVwdGgiXT0zLFsic3RhdHVzIl09ImFjdGl2ZSIsWyJ1c2VyTmFtZSJdPSJnb21waS8yMDIxYSIsfSxnemlwPXtbImZuIl09Ii9zb2Z0d2FyZS9tb2R1bGVzL3Rvb2xzL2d6aXAvMS4xMC1HQ0Njb3JlLTEwLjMuMC5sdWEiLFsiZnVsbE5hbWUiXT0iZ3ppcC8xLjEw')
== 2022-07-20 17:38:15,674 environment.py:91 INFO Environment variable _ModuleTable024_ set to b2Z0d2FyZS9tb2R1bGVzL3Rvb2xjaGFpbi9nb21waS8yMDIxYS5sdWEiLFsiZnVsbE5hbWUiXT0iZ29tcGkvMjAyMWEiLFsibG9hZE9yZGVyIl09MTYscHJvcFQ9e30sWyJzdGFja0RlcHRoIl09MixbInN0YXR1cyJdPSJhY3RpdmUiLFsidXNlck5hbWUiXT0iZ29tcGkvMjAyMWEiLH0sZ3ppcD17WyJmbiJdPSIvc29mdHdhcmUvbW9kdWxlcy90b29scy9nemlwLzEuMTAtR0NDY29yZS0xMC4zLjAubHVhIixbImZ1bGxOYW1lIl09Imd6aXAvMS4xMC1HQ0Njb3JlLTEwLjMuMCIsWyJsb2FkT3JkZXIiXT0zOSxwcm9wVD17fSxbInN0YWNrRGVwdGgiXT0wLFsic3RhdHVzIl09ImFjdGl2ZSIsWyJ1c2VyTmFtZSJdPSJnemlwLzEuMTAtR0NDY29yZS0xMC4zLjAiLH0saHdsb2M9e1si (previous value: 'LUdDQ2NvcmUtMTAuMy4wIixbImxvYWRPcmRlciJdPTM3LHByb3BUPXt9LFsic3RhY2tEZXB0aCJdPTEsWyJzdGF0dXMiXT0iYWN0aXZlIixbInVzZXJOYW1lIl09Imd6aXAvMS4xMC1HQ0Njb3JlLTEwLjMuMCIsfSxod2xvYz17WyJmbiJdPSIvc29mdHdhcmUvbW9kdWxlcy9zeXN0ZW0vaHdsb2MvMi40LjEtR0NDY29yZS0xMC4zLjAubHVhIixbImZ1bGxOYW1lIl09Imh3bG9jLzIuNC4xLUdDQ2NvcmUtMTAuMy4wIixbImxvYWRPcmRlciJdPTEwLHByb3BUPXt9LFsic3RhY2tEZXB0aCJdPTMsWyJzdGF0dXMiXT0iYWN0aXZlIixbInVzZXJOYW1lIl09Imh3bG9jLzIuNC4xLUdDQ2NvcmUtMTAuMy4wIix9LFsia2ltLWFwaSJdPXtbImZuIl09Ii9kZXYvc2htL2YxMTUyNjEvZWFz')
== 2022-07-20 17:38:15,675 environment.py:91 INFO Environment variable _ModuleTable025_ set to Zm4iXT0iL3NvZnR3YXJlL21vZHVsZXMvc3lzdGVtL2h3bG9jLzIuNC4xLUdDQ2NvcmUtMTAuMy4wLmx1YSIsWyJmdWxsTmFtZSJdPSJod2xvYy8yLjQuMS1HQ0Njb3JlLTEwLjMuMCIsWyJsb2FkT3JkZXIiXT04LHByb3BUPXt9LFsic3RhY2tEZXB0aCJdPTIsWyJzdGF0dXMiXT0iYWN0aXZlIixbInVzZXJOYW1lIl09Imh3bG9jLzIuNC4xLUdDQ2NvcmUtMTAuMy4wIix9LFsia2ltLWFwaSJdPXtbImZuIl09Ii9kZXYvc2htL2YxMTUyNjEvZWFzeWJ1aWxkaW5zdGFsbC9tb2R1bGVzL2FsbC9raW0tYXBpLzIuMi4xLUdDQ2NvcmUtMTAuMy4wLmx1YSIsWyJmdWxsTmFtZSJdPSJraW0tYXBpLzIuMi4xLUdDQ2NvcmUtMTAuMy4wIixbImxvYWRPcmRlciJdPTU3LHByb3BUPXt9LFsi (previous value: 'eWJ1aWxkaW5zdGFsbC9tb2R1bGVzL2FsbC9raW0tYXBpLzIuMi4xLUdDQ2NvcmUtMTAuMy4wLmx1YSIsWyJmdWxsTmFtZSJdPSJraW0tYXBpLzIuMi4xLUdDQ2NvcmUtMTAuMy4wIixbImxvYWRPcmRlciJdPTU1LHByb3BUPXt9LFsic3RhY2tEZXB0aCJdPTEsWyJzdGF0dXMiXT0iYWN0aXZlIixbInVzZXJOYW1lIl09ImtpbS1hcGkvMi4yLjEtR0NDY29yZS0xMC4zLjAiLH0sbGliYXJjaGl2ZT17WyJmbiJdPSIvc29mdHdhcmUvbW9kdWxlcy90b29scy9saWJhcmNoaXZlLzMuNS4xLUdDQ2NvcmUtMTAuMy4wLmx1YSIsWyJmdWxsTmFtZSJdPSJsaWJhcmNoaXZlLzMuNS4xLUdDQ2NvcmUtMTAuMy4wIixbImxvYWRPcmRlciJdPTUzLHByb3BUPXt9LFsic3RhY2tEZXB0aCJdPTMs')
== 2022-07-20 17:38:15,675 environment.py:91 INFO Environment variable _ModuleTable026_ set to c3RhY2tEZXB0aCJdPTAsWyJzdGF0dXMiXT0iYWN0aXZlIixbInVzZXJOYW1lIl09ImtpbS1hcGkvMi4yLjEtR0NDY29yZS0xMC4zLjAiLH0sbGliYXJjaGl2ZT17WyJmbiJdPSIvc29mdHdhcmUvbW9kdWxlcy90b29scy9saWJhcmNoaXZlLzMuNS4xLUdDQ2NvcmUtMTAuMy4wLmx1YSIsWyJmdWxsTmFtZSJdPSJsaWJhcmNoaXZlLzMuNS4xLUdDQ2NvcmUtMTAuMy4wIixbImxvYWRPcmRlciJdPTIyLHByb3BUPXt9LFsic3RhY2tEZXB0aCJdPTEsWyJzdGF0dXMiXT0iYWN0aXZlIixbInVzZXJOYW1lIl09ImxpYmFyY2hpdmUvMy41LjEtR0NDY29yZS0xMC4zLjAiLH0sbGliZXZlbnQ9e1siZm4iXT0iL3NvZnR3YXJlL21vZHVsZXMvbGliL2xpYmV2ZW50LzIuMS4xMi1HQ0Njb3Jl (previous value: 'WyJzdGF0dXMiXT0iYWN0aXZlIixbInVzZXJOYW1lIl09ImxpYmFyY2hpdmUvMy41LjEtR0NDY29yZS0xMC4zLjAiLH0sbGliZXZlbnQ9e1siZm4iXT0iL3NvZnR3YXJlL21vZHVsZXMvbGliL2xpYmV2ZW50LzIuMS4xMi1HQ0Njb3JlLTEwLjMuMC5sdWEiLFsiZnVsbE5hbWUiXT0ibGliZXZlbnQvMi4xLjEyLUdDQ2NvcmUtMTAuMy4wIixbImxvYWRPcmRlciJdPTEyLHByb3BUPXt9LFsic3RhY2tEZXB0aCJdPTMsWyJzdGF0dXMiXT0iYWN0aXZlIixbInVzZXJOYW1lIl09ImxpYmV2ZW50LzIuMS4xMi1HQ0Njb3JlLTEwLjMuMCIsfSxsaWJmYWJyaWM9e1siZm4iXT0iL3NvZnR3YXJlL21vZHVsZXMvbGliL2xpYmZhYnJpYy8xLjEyLjEtR0NDY29yZS0xMC4zLjAubHVhIixbImZ1')
== 2022-07-20 17:38:15,675 environment.py:91 INFO Environment variable _ModuleTable027_ set to LTEwLjMuMC5sdWEiLFsiZnVsbE5hbWUiXT0ibGliZXZlbnQvMi4xLjEyLUdDQ2NvcmUtMTAuMy4wIixbImxvYWRPcmRlciJdPTEwLHByb3BUPXt9LFsic3RhY2tEZXB0aCJdPTIsWyJzdGF0dXMiXT0iYWN0aXZlIixbInVzZXJOYW1lIl09ImxpYmV2ZW50LzIuMS4xMi1HQ0Njb3JlLTEwLjMuMCIsfSxsaWJmYWJyaWM9e1siZm4iXT0iL3NvZnR3YXJlL21vZHVsZXMvbGliL2xpYmZhYnJpYy8xLjEyLjEtR0NDY29yZS0xMC4zLjAubHVhIixbImZ1bGxOYW1lIl09ImxpYmZhYnJpYy8xLjEyLjEtR0NDY29yZS0xMC4zLjAiLFsibG9hZE9yZGVyIl09MTIscHJvcFQ9e30sWyJzdGFja0RlcHRoIl09MixbInN0YXR1cyJdPSJhY3RpdmUiLFsidXNlck5hbWUiXT0ibGliZmFicmljLzEu (previous value: 'bGxOYW1lIl09ImxpYmZhYnJpYy8xLjEyLjEtR0NDY29yZS0xMC4zLjAiLFsibG9hZE9yZGVyIl09MTQscHJvcFQ9e30sWyJzdGFja0RlcHRoIl09MyxbInN0YXR1cyJdPSJhY3RpdmUiLFsidXNlck5hbWUiXT0ibGliZmFicmljLzEuMTIuMS1HQ0Njb3JlLTEwLjMuMCIsfSxsaWJmZmk9e1siZm4iXT0iL3NvZnR3YXJlL21vZHVsZXMvbGliL2xpYmZmaS8zLjMtR0NDY29yZS0xMC4zLjAubHVhIixbImZ1bGxOYW1lIl09ImxpYmZmaS8zLjMtR0NDY29yZS0xMC4zLjAiLFsibG9hZE9yZGVyIl09MjgscHJvcFQ9e30sWyJzdGFja0RlcHRoIl09MixbInN0YXR1cyJdPSJhY3RpdmUiLFsidXNlck5hbWUiXT0ibGliZmZpLzMuMy1HQ0Njb3JlLTEwLjMuMCIsfSxbImxpYmpwZWctdHVy')
== 2022-07-20 17:38:15,675 environment.py:91 INFO Environment variable _ModuleTable028_ set to MTIuMS1HQ0Njb3JlLTEwLjMuMCIsfSxsaWJmZmk9e1siZm4iXT0iL3NvZnR3YXJlL21vZHVsZXMvbGliL2xpYmZmaS8zLjMtR0NDY29yZS0xMC4zLjAubHVhIixbImZ1bGxOYW1lIl09ImxpYmZmaS8zLjMtR0NDY29yZS0xMC4zLjAiLFsibG9hZE9yZGVyIl09MjkscHJvcFQ9e30sWyJzdGFja0RlcHRoIl09MixbInN0YXR1cyJdPSJhY3RpdmUiLFsidXNlck5hbWUiXT0ibGliZmZpLzMuMy1HQ0Njb3JlLTEwLjMuMCIsfSxbImxpYmpwZWctdHVyYm8iXT17WyJmbiJdPSIvc29mdHdhcmUvbW9kdWxlcy9saWIvbGlianBlZy10dXJiby8yLjAuNi1HQ0Njb3JlLTEwLjMuMC5sdWEiLFsiZnVsbE5hbWUiXT0ibGlianBlZy10dXJiby8yLjAuNi1HQ0Njb3JlLTEwLjMuMCIsWyJsb2Fk (previous value: 'Ym8iXT17WyJmbiJdPSIvc29mdHdhcmUvbW9kdWxlcy9saWIvbGlianBlZy10dXJiby8yLjAuNi1HQ0Njb3JlLTEwLjMuMC5sdWEiLFsiZnVsbE5hbWUiXT0ibGlianBlZy10dXJiby8yLjAuNi1HQ0Njb3JlLTEwLjMuMCIsWyJsb2FkT3JkZXIiXT0zMixwcm9wVD17fSxbInN0YWNrRGVwdGgiXT0xLFsic3RhdHVzIl09ImFjdGl2ZSIsWyJ1c2VyTmFtZSJdPSJsaWJqcGVnLXR1cmJvLzIuMC42LUdDQ2NvcmUtMTAuMy4wIix9LGxpYnBjaWFjY2Vzcz17WyJmbiJdPSIvc29mdHdhcmUvbW9kdWxlcy9zeXN0ZW0vbGlicGNpYWNjZXNzLzAuMTYtR0NDY29yZS0xMC4zLjAubHVhIixbImZ1bGxOYW1lIl09ImxpYnBjaWFjY2Vzcy8wLjE2LUdDQ2NvcmUtMTAuMy4wIixbImxvYWRPcmRl')
== 2022-07-20 17:38:15,676 environment.py:91 INFO Environment variable _ModuleTable029_ set to T3JkZXIiXT0zNCxwcm9wVD17fSxbInN0YWNrRGVwdGgiXT0wLFsic3RhdHVzIl09ImFjdGl2ZSIsWyJ1c2VyTmFtZSJdPSJsaWJqcGVnLXR1cmJvLzIuMC42LUdDQ2NvcmUtMTAuMy4wIix9LGxpYnBjaWFjY2Vzcz17WyJmbiJdPSIvc29mdHdhcmUvbW9kdWxlcy9zeXN0ZW0vbGlicGNpYWNjZXNzLzAuMTYtR0NDY29yZS0xMC4zLjAubHVhIixbImZ1bGxOYW1lIl09ImxpYnBjaWFjY2Vzcy8wLjE2LUdDQ2NvcmUtMTAuMy4wIixbImxvYWRPcmRlciJdPTcscHJvcFQ9e30sWyJzdGFja0RlcHRoIl09MyxbInN0YXR1cyJdPSJhY3RpdmUiLFsidXNlck5hbWUiXT0ibGlicGNpYWNjZXNzLzAuMTYtR0NDY29yZS0xMC4zLjAiLH0sbGlicG5nPXtbImZuIl09Ii9zb2Z0d2FyZS9tb2R1 (previous value: 'ciJdPTkscHJvcFQ9e30sWyJzdGFja0RlcHRoIl09NCxbInN0YXR1cyJdPSJhY3RpdmUiLFsidXNlck5hbWUiXT0ibGlicGNpYWNjZXNzLzAuMTYtR0NDY29yZS0xMC4zLjAiLH0sbGlicG5nPXtbImZuIl09Ii9zb2Z0d2FyZS9tb2R1bGVzL2xpYi9saWJwbmcvMS42LjM3LUdDQ2NvcmUtMTAuMy4wLmx1YSIsWyJmdWxsTmFtZSJdPSJsaWJwbmcvMS42LjM3LUdDQ2NvcmUtMTAuMy4wIixbImxvYWRPcmRlciJdPTMwLHByb3BUPXt9LFsic3RhY2tEZXB0aCJdPTEsWyJzdGF0dXMiXT0iYWN0aXZlIixbInVzZXJOYW1lIl09ImxpYnBuZy8xLjYuMzctR0NDY29yZS0xMC4zLjAiLH0sbGlicmVhZGxpbmU9e1siZm4iXT0iL3NvZnR3YXJlL21vZHVsZXMvbGliL2xpYnJlYWRsaW5lLzgu')
== 2022-07-20 17:38:15,676 environment.py:91 INFO Environment variable _ModuleTable030_ set to bGVzL2xpYi9saWJwbmcvMS42LjM3LUdDQ2NvcmUtMTAuMy4wLmx1YSIsWyJmdWxsTmFtZSJdPSJsaWJwbmcvMS42LjM3LUdDQ2NvcmUtMTAuMy4wIixbImxvYWRPcmRlciJdPTMyLHByb3BUPXt9LFsic3RhY2tEZXB0aCJdPTAsWyJzdGF0dXMiXT0iYWN0aXZlIixbInVzZXJOYW1lIl09ImxpYnBuZy8xLjYuMzctR0NDY29yZS0xMC4zLjAiLH0sbGlicmVhZGxpbmU9e1siZm4iXT0iL3NvZnR3YXJlL21vZHVsZXMvbGliL2xpYnJlYWRsaW5lLzguMS1HQ0Njb3JlLTEwLjMuMC5sdWEiLFsiZnVsbE5hbWUiXT0ibGlicmVhZGxpbmUvOC4xLUdDQ2NvcmUtMTAuMy4wIixbImxvYWRPcmRlciJdPTI1LHByb3BUPXt9LFsic3RhY2tEZXB0aCJdPTIsWyJzdGF0dXMiXT0iYWN0aXZlIixb (previous value: 'MS1HQ0Njb3JlLTEwLjMuMC5sdWEiLFsiZnVsbE5hbWUiXT0ibGlicmVhZGxpbmUvOC4xLUdDQ2NvcmUtMTAuMy4wIixbImxvYWRPcmRlciJdPTI0LHByb3BUPXt9LFsic3RhY2tEZXB0aCJdPTIsWyJzdGF0dXMiXT0iYWN0aXZlIixbInVzZXJOYW1lIl09ImxpYnJlYWRsaW5lLzguMS1HQ0Njb3JlLTEwLjMuMCIsfSxsaWJ4bWwyPXtbImZuIl09Ii9zb2Z0d2FyZS9tb2R1bGVzL2xpYi9saWJ4bWwyLzIuOS4xMC1HQ0Njb3JlLTEwLjMuMC5sdWEiLFsiZnVsbE5hbWUiXT0ibGlieG1sMi8yLjkuMTAtR0NDY29yZS0xMC4zLjAiLFsibG9hZE9yZGVyIl09OCxwcm9wVD17fSxbInN0YWNrRGVwdGgiXT00LFsic3RhdHVzIl09ImFjdGl2ZSIsWyJ1c2VyTmFtZSJdPSJsaWJ4bWwyLzIu')
== 2022-07-20 17:38:15,677 environment.py:91 INFO Environment variable _ModuleTable031_ set to InVzZXJOYW1lIl09ImxpYnJlYWRsaW5lLzguMS1HQ0Njb3JlLTEwLjMuMCIsfSxsaWJ4bWwyPXtbImZuIl09Ii9zb2Z0d2FyZS9tb2R1bGVzL2xpYi9saWJ4bWwyLzIuOS4xMC1HQ0Njb3JlLTEwLjMuMC5sdWEiLFsiZnVsbE5hbWUiXT0ibGlieG1sMi8yLjkuMTAtR0NDY29yZS0xMC4zLjAiLFsibG9hZE9yZGVyIl09NDQscHJvcFQ9e30sWyJzdGFja0RlcHRoIl09MCxbInN0YXR1cyJdPSJhY3RpdmUiLFsidXNlck5hbWUiXT0ibGlieG1sMi8yLjkuMTAtR0NDY29yZS0xMC4zLjAiLH0sbmN1cnNlcz17WyJmbiJdPSIvc29mdHdhcmUvbW9kdWxlcy9kZXZlbC9uY3Vyc2VzLzYuMi1HQ0Njb3JlLTEwLjMuMC5sdWEiLFsiZnVsbE5hbWUiXT0ibmN1cnNlcy82LjItR0NDY29yZS0x (previous value: 'OS4xMC1HQ0Njb3JlLTEwLjMuMCIsfSxuY3Vyc2VzPXtbImZuIl09Ii9zb2Z0d2FyZS9tb2R1bGVzL2RldmVsL25jdXJzZXMvNi4yLUdDQ2NvcmUtMTAuMy4wLmx1YSIsWyJmdWxsTmFtZSJdPSJuY3Vyc2VzLzYuMi1HQ0Njb3JlLTEwLjMuMCIsWyJsb2FkT3JkZXIiXT0yMyxwcm9wVD17fSxbInN0YWNrRGVwdGgiXT0zLFsic3RhdHVzIl09ImFjdGl2ZSIsWyJ1c2VyTmFtZSJdPSJuY3Vyc2VzLzYuMi1HQ0Njb3JlLTEwLjMuMCIsfSxuZXRDREY9e1siZm4iXT0iL3NvZnR3YXJlL21vZHVsZXMvZGF0YS9uZXRDREYvNC44LjAtZ29tcGktMjAyMWEubHVhIixbImZ1bGxOYW1lIl09Im5ldENERi80LjguMC1nb21waS0yMDIxYSIsWyJsb2FkT3JkZXIiXT0zNSxwcm9wVD17fSxbInN0')
== 2022-07-20 17:38:15,677 environment.py:91 INFO Environment variable _ModuleTable032_ set to MC4zLjAiLFsibG9hZE9yZGVyIl09MjAscHJvcFQ9e30sWyJzdGFja0RlcHRoIl09MSxbInN0YXR1cyJdPSJhY3RpdmUiLFsidXNlck5hbWUiXT0ibmN1cnNlcy82LjItR0NDY29yZS0xMC4zLjAiLH0sbmV0Q0RGPXtbImZuIl09Ii9zb2Z0d2FyZS9tb2R1bGVzL2RhdGEvbmV0Q0RGLzQuOC4wLWdvbXBpLTIwMjFhLmx1YSIsWyJmdWxsTmFtZSJdPSJuZXRDREYvNC44LjAtZ29tcGktMjAyMWEiLFsibG9hZE9yZGVyIl09MzYscHJvcFQ9e30sWyJzdGFja0RlcHRoIl09MCxbInN0YXR1cyJdPSJhY3RpdmUiLFsidXNlck5hbWUiXT0ibmV0Q0RGLzQuOC4wLWdvbXBpLTIwMjFhIix9LG51bWFjdGw9e1siZm4iXT0iL3NvZnR3YXJlL21vZHVsZXMvdG9vbHMvbnVtYWN0bC8yLjAuMTQt (previous value: 'YWNrRGVwdGgiXT0xLFsic3RhdHVzIl09ImFjdGl2ZSIsWyJ1c2VyTmFtZSJdPSJuZXRDREYvNC44LjAtZ29tcGktMjAyMWEiLH0sbnVtYWN0bD17WyJmbiJdPSIvc29mdHdhcmUvbW9kdWxlcy90b29scy9udW1hY3RsLzIuMC4xNC1HQ0Njb3JlLTEwLjMuMC5sdWEiLFsiZnVsbE5hbWUiXT0ibnVtYWN0bC8yLjAuMTQtR0NDY29yZS0xMC4zLjAiLFsibG9hZE9yZGVyIl09Nixwcm9wVD17fSxbInN0YWNrRGVwdGgiXT00LFsic3RhdHVzIl09ImFjdGl2ZSIsWyJ1c2VyTmFtZSJdPSJudW1hY3RsLzIuMC4xNC1HQ0Njb3JlLTEwLjMuMCIsfSxweWJpbmQxMT17WyJmbiJdPSIvc29mdHdhcmUvbW9kdWxlcy9saWIvcHliaW5kMTEvMi42LjItR0NDY29yZS0xMC4zLjAubHVhIixbImZ1')
== 2022-07-20 17:38:15,677 environment.py:91 INFO Environment variable _ModuleTable033_ set to R0NDY29yZS0xMC4zLjAubHVhIixbImZ1bGxOYW1lIl09Im51bWFjdGwvMi4wLjE0LUdDQ2NvcmUtMTAuMy4wIixbImxvYWRPcmRlciJdPTUscHJvcFQ9e30sWyJzdGFja0RlcHRoIl09MyxbInN0YXR1cyJdPSJhY3RpdmUiLFsidXNlck5hbWUiXT0ibnVtYWN0bC8yLjAuMTQtR0NDY29yZS0xMC4zLjAiLH0sWyJwa2ctY29uZmlnIl09e1siZm4iXT0iL3NvZnR3YXJlL21vZHVsZXMvZGV2ZWwvcGtnLWNvbmZpZy8wLjI5LjItR0NDY29yZS0xMC4zLjAubHVhIixbImZ1bGxOYW1lIl09InBrZy1jb25maWcvMC4yOS4yLUdDQ2NvcmUtMTAuMy4wIixbImxvYWRPcmRlciJdPTI0LHByb3BUPXt9LFsic3RhY2tEZXB0aCJdPTAsWyJzdGF0dXMiXT0iYWN0aXZlIixbInVzZXJOYW1lIl09 (previous value: 'bGxOYW1lIl09InB5YmluZDExLzIuNi4yLUdDQ2NvcmUtMTAuMy4wIixbImxvYWRPcmRlciJdPTU3LHByb3BUPXt9LFsic3RhY2tEZXB0aCJdPTMsWyJzdGF0dXMiXT0iYWN0aXZlIixbInVzZXJOYW1lIl09InB5YmluZDExLzIuNi4yLUdDQ2NvcmUtMTAuMy4wIix9LHRiYj17WyJmbiJdPSIvZGV2L3NobS9mMTE1MjYxL2Vhc3lidWlsZGluc3RhbGwvbW9kdWxlcy9hbGwvdGJiLzIwMjAuMy1HQ0Njb3JlLTEwLjMuMC5sdWEiLFsiZnVsbE5hbWUiXT0idGJiLzIwMjAuMy1HQ0Njb3JlLTEwLjMuMCIsWyJsb2FkT3JkZXIiXT0zOSxwcm9wVD17fSxbInN0YWNrRGVwdGgiXT0xLFsic3RhdHVzIl09ImFjdGl2ZSIsWyJ1c2VyTmFtZSJdPSJ0YmIvMjAyMC4zLUdDQ2NvcmUtMTAuMy4w')
== 2022-07-20 17:38:15,677 environment.py:91 INFO Environment variable _ModuleTable034_ set to InBrZy1jb25maWcvMC4yOS4yLUdDQ2NvcmUtMTAuMy4wIix9LHB5YmluZDExPXtbImZuIl09Ii9zb2Z0d2FyZS9tb2R1bGVzL2xpYi9weWJpbmQxMS8yLjYuMi1HQ0Njb3JlLTEwLjMuMC5sdWEiLFsiZnVsbE5hbWUiXT0icHliaW5kMTEvMi42LjItR0NDY29yZS0xMC4zLjAiLFsibG9hZE9yZGVyIl09NTkscHJvcFQ9e30sWyJzdGFja0RlcHRoIl09MixbInN0YXR1cyJdPSJhY3RpdmUiLFsidXNlck5hbWUiXT0icHliaW5kMTEvMi42LjItR0NDY29yZS0xMC4zLjAiLH0sdGJiPXtbImZuIl09Ii9kZXYvc2htL2YxMTUyNjEvZWFzeWJ1aWxkaW5zdGFsbC9tb2R1bGVzL2FsbC90YmIvMjAyMC4zLUdDQ2NvcmUtMTAuMy4wLmx1YSIsWyJmdWxsTmFtZSJdPSJ0YmIvMjAyMC4zLUdD (previous value: 'Iix9LFsidXRpbC1saW51eCJdPXtbImZuIl09Ii9zb2Z0d2FyZS9tb2R1bGVzL3Rvb2xzL3V0aWwtbGludXgvMi4zNi1HQ0Njb3JlLTEwLjMuMC5sdWEiLFsiZnVsbE5hbWUiXT0idXRpbC1saW51eC8yLjM2LUdDQ2NvcmUtMTAuMy4wIixbImxvYWRPcmRlciJdPTQ2LHByb3BUPXt9LFsic3RhY2tEZXB0aCJdPTQsWyJzdGF0dXMiXT0iYWN0aXZlIixbInVzZXJOYW1lIl09InV0aWwtbGludXgvMi4zNi1HQ0Njb3JlLTEwLjMuMCIsfSx4MjY0PXtbImZuIl09Ii9zb2Z0d2FyZS9tb2R1bGVzL3Zpcy94MjY0LzIwMjEwNDE0LUdDQ2NvcmUtMTAuMy4wLmx1YSIsWyJmdWxsTmFtZSJdPSJ4MjY0LzIwMjEwNDE0LUdDQ2NvcmUtMTAuMy4wIixbImxvYWRPcmRlciJdPTQxLHByb3BUPXt9')
== 2022-07-20 17:38:15,677 environment.py:91 INFO Environment variable _ModuleTable035_ set to Q2NvcmUtMTAuMy4wIixbImxvYWRPcmRlciJdPTQyLHByb3BUPXt9LFsic3RhY2tEZXB0aCJdPTAsWyJzdGF0dXMiXT0iYWN0aXZlIixbInVzZXJOYW1lIl09InRiYi8yMDIwLjMtR0NDY29yZS0xMC4zLjAiLH0sWyJ1dGlsLWxpbnV4Il09e1siZm4iXT0iL3NvZnR3YXJlL21vZHVsZXMvdG9vbHMvdXRpbC1saW51eC8yLjM2LUdDQ2NvcmUtMTAuMy4wLmx1YSIsWyJmdWxsTmFtZSJdPSJ1dGlsLWxpbnV4LzIuMzYtR0NDY29yZS0xMC4zLjAiLFsibG9hZE9yZGVyIl09NTAscHJvcFQ9e30sWyJzdGFja0RlcHRoIl09MyxbInN0YXR1cyJdPSJhY3RpdmUiLFsidXNlck5hbWUiXT0idXRpbC1saW51eC8yLjM2LUdDQ2NvcmUtMTAuMy4wIix9LHgyNjQ9e1siZm4iXT0iL3NvZnR3YXJl (previous value: 'LFsic3RhY2tEZXB0aCJdPTIsWyJzdGF0dXMiXT0iYWN0aXZlIixbInVzZXJOYW1lIl09IngyNjQvMjAyMTA0MTQtR0NDY29yZS0xMC4zLjAiLH0seDI2NT17WyJmbiJdPSIvc29mdHdhcmUvbW9kdWxlcy92aXMveDI2NS8zLjUtR0NDY29yZS0xMC4zLjAubHVhIixbImZ1bGxOYW1lIl09IngyNjUvMy41LUdDQ2NvcmUtMTAuMy4wIixbImxvYWRPcmRlciJdPTQzLHByb3BUPXt9LFsic3RhY2tEZXB0aCJdPTIsWyJzdGF0dXMiXT0iYWN0aXZlIixbInVzZXJOYW1lIl09IngyNjUvMy41LUdDQ2NvcmUtMTAuMy4wIix9LFsieG9yZy1tYWNyb3MiXT17WyJmbiJdPSIvc29mdHdhcmUvbW9kdWxlcy9kZXZlbC94b3JnLW1hY3Jvcy8xLjE5LjMtR0NDY29yZS0xMC4zLjAubHVhIixbImZ1')
== 2022-07-20 17:38:15,678 environment.py:91 INFO Environment variable _ModuleTable036_ set to L21vZHVsZXMvdmlzL3gyNjQvMjAyMTA0MTQtR0NDY29yZS0xMC4zLjAubHVhIixbImZ1bGxOYW1lIl09IngyNjQvMjAyMTA0MTQtR0NDY29yZS0xMC4zLjAiLFsibG9hZE9yZGVyIl09NDUscHJvcFQ9e30sWyJzdGFja0RlcHRoIl09MSxbInN0YXR1cyJdPSJhY3RpdmUiLFsidXNlck5hbWUiXT0ieDI2NC8yMDIxMDQxNC1HQ0Njb3JlLTEwLjMuMCIsfSx4MjY1PXtbImZuIl09Ii9zb2Z0d2FyZS9tb2R1bGVzL3Zpcy94MjY1LzMuNS1HQ0Njb3JlLTEwLjMuMC5sdWEiLFsiZnVsbE5hbWUiXT0ieDI2NS8zLjUtR0NDY29yZS0xMC4zLjAiLFsibG9hZE9yZGVyIl09NDcscHJvcFQ9e30sWyJzdGFja0RlcHRoIl09MSxbInN0YXR1cyJdPSJhY3RpdmUiLFsidXNlck5hbWUiXT0ieDI2 (previous value: 'bGxOYW1lIl09InhvcmctbWFjcm9zLzEuMTkuMy1HQ0Njb3JlLTEwLjMuMCIsWyJsb2FkT3JkZXIiXT00OCxwcm9wVD17fSxbInN0YWNrRGVwdGgiXT0zLFsic3RhdHVzIl09ImFjdGl2ZSIsWyJ1c2VyTmFtZSJdPSJ4b3JnLW1hY3Jvcy8xLjE5LjMtR0NDY29yZS0xMC4zLjAiLH0semxpYj17WyJmbiJdPSIvc29mdHdhcmUvbW9kdWxlcy9saWIvemxpYi8xLjIuMTEtR0NDY29yZS0xMC4zLjAubHVhIixbImZ1bGxOYW1lIl09InpsaWIvMS4yLjExLUdDQ2NvcmUtMTAuMy4wIixbImxvYWRPcmRlciJdPTMscHJvcFQ9e30sWyJzdGFja0RlcHRoIl09NCxbInN0YXR1cyJdPSJhY3RpdmUiLFsidXNlck5hbWUiXT0iemxpYi8xLjIuMTEtR0NDY29yZS0xMC4zLjAiLH0sfSxtcGF0aEE9')
== 2022-07-20 17:38:15,678 environment.py:91 INFO Environment variable _ModuleTable037_ set to NS8zLjUtR0NDY29yZS0xMC4zLjAiLH0sWyJ4b3JnLW1hY3JvcyJdPXtbImZuIl09Ii9zb2Z0d2FyZS9tb2R1bGVzL2RldmVsL3hvcmctbWFjcm9zLzEuMTkuMy1HQ0Njb3JlLTEwLjMuMC5sdWEiLFsiZnVsbE5hbWUiXT0ieG9yZy1tYWNyb3MvMS4xOS4zLUdDQ2NvcmUtMTAuMy4wIixbImxvYWRPcmRlciJdPTUyLHByb3BUPXt9LFsic3RhY2tEZXB0aCJdPTIsWyJzdGF0dXMiXT0iYWN0aXZlIixbInVzZXJOYW1lIl09InhvcmctbWFjcm9zLzEuMTkuMy1HQ0Njb3JlLTEwLjMuMCIsfSx6bGliPXtbImZuIl09Ii9zb2Z0d2FyZS9tb2R1bGVzL2xpYi96bGliLzEuMi4xMS1HQ0Njb3JlLTEwLjMuMC5sdWEiLFsiZnVsbE5hbWUiXT0iemxpYi8xLjIuMTEtR0NDY29yZS0xMC4zLjAi (previous value: 'eyIvZGV2L3NobS9mMTE1MjYxL2ViLWRtZ25feG9jL3RtcHBlaHQ1OW0yL2FsbCIsIi9kZXYvc2htL2YxMTUyNjEvZWFzeWJ1aWxkaW5zdGFsbC9tb2R1bGVzL2FsbCIsIi9ldGMvbW9kdWxlZmlsZXMiLCIvdXNyL3NoYXJlL21vZHVsZWZpbGVzIiwiL3NvZnR3YXJlL21vZHVsZXMvYmlvIiwiL3NvZnR3YXJlL21vZHVsZXMvY2FlIiwiL3NvZnR3YXJlL21vZHVsZXMvY2hlbSIsIi9zb2Z0d2FyZS9tb2R1bGVzL2NvbXBpbGVyIiwiL3NvZnR3YXJlL21vZHVsZXMvZGF0YSIsIi9zb2Z0d2FyZS9tb2R1bGVzL2RlYnVnZ2VyIiwiL3NvZnR3YXJlL21vZHVsZXMvZGV2ZWwiLCIvc29mdHdhcmUvbW9kdWxlcy9naXMiLCIvc29mdHdhcmUvbW9kdWxlcy9sYW5nIiwiL3NvZnR3YXJlL21v')
== 2022-07-20 17:38:15,678 environment.py:91 INFO Environment variable _ModuleTable038_ set to LFsibG9hZE9yZGVyIl09MzgscHJvcFQ9e30sWyJzdGFja0RlcHRoIl09MCxbInN0YXR1cyJdPSJhY3RpdmUiLFsidXNlck5hbWUiXT0iemxpYi8xLjIuMTEtR0NDY29yZS0xMC4zLjAiLH0sfSxtcGF0aEE9eyIvZGV2L3NobS9mMTE1MjYxL2Vhc3lidWlsZGluc3RhbGwvbW9kdWxlcy9hbGwiLCIvZXRjL21vZHVsZWZpbGVzIiwiL3Vzci9zaGFyZS9tb2R1bGVmaWxlcyIsIi9zb2Z0d2FyZS9tb2R1bGVzL2JpbyIsIi9zb2Z0d2FyZS9tb2R1bGVzL2NhZSIsIi9zb2Z0d2FyZS9tb2R1bGVzL2NoZW0iLCIvc29mdHdhcmUvbW9kdWxlcy9jb21waWxlciIsIi9zb2Z0d2FyZS9tb2R1bGVzL2RhdGEiLCIvc29mdHdhcmUvbW9kdWxlcy9kZWJ1Z2dlciIsIi9zb2Z0d2FyZS9tb2R1bGVz (previous value: 'ZHVsZXMvbGliIiwiL3NvZnR3YXJlL21vZHVsZXMvbWF0aCIsIi9zb2Z0d2FyZS9tb2R1bGVzL21waSIsIi9zb2Z0d2FyZS9tb2R1bGVzL251bWxpYiIsIi9zb2Z0d2FyZS9tb2R1bGVzL3BlcmYiLCIvc29mdHdhcmUvbW9kdWxlcy9waHlzIiwiL3NvZnR3YXJlL21vZHVsZXMvc3lzdGVtIiwiL3NvZnR3YXJlL21vZHVsZXMvdG9vbGNoYWluIiwiL3NvZnR3YXJlL21vZHVsZXMvdG9vbHMiLCIvc29mdHdhcmUvbW9kdWxlcy92aXMiLH0sWyJzeXN0ZW1CYXNlTVBBVEgiXT0iL2V0Yy9tb2R1bGVmaWxlczovdXNyL3NoYXJlL21vZHVsZWZpbGVzOi91c3Ivc2hhcmUvbW9kdWxlZmlsZXMvTGludXg6L3Vzci9zaGFyZS9tb2R1bGVmaWxlcy9Db3JlOi91c3Ivc2hhcmUvbG1vZC9sbW9k')
== 2022-07-20 17:38:15,679 environment.py:91 INFO Environment variable _ModuleTable039_ set to L2RldmVsIiwiL3NvZnR3YXJlL21vZHVsZXMvZ2lzIiwiL3NvZnR3YXJlL21vZHVsZXMvbGFuZyIsIi9zb2Z0d2FyZS9tb2R1bGVzL2xpYiIsIi9zb2Z0d2FyZS9tb2R1bGVzL21hdGgiLCIvc29mdHdhcmUvbW9kdWxlcy9tcGkiLCIvc29mdHdhcmUvbW9kdWxlcy9udW1saWIiLCIvc29mdHdhcmUvbW9kdWxlcy9wZXJmIiwiL3NvZnR3YXJlL21vZHVsZXMvcGh5cyIsIi9zb2Z0d2FyZS9tb2R1bGVzL3N5c3RlbSIsIi9zb2Z0d2FyZS9tb2R1bGVzL3Rvb2xjaGFpbiIsIi9zb2Z0d2FyZS9tb2R1bGVzL3Rvb2xzIiwiL3NvZnR3YXJlL21vZHVsZXMvdmlzIix9LFsic3lzdGVtQmFzZU1QQVRIIl09Ii9ldGMvbW9kdWxlZmlsZXM6L3Vzci9zaGFyZS9tb2R1bGVmaWxlczovdXNyL3No (previous value: 'L21vZHVsZWZpbGVzL0NvcmU6L3NvZnR3YXJlL21vZHVsZXMvYmlvOi9zb2Z0d2FyZS9tb2R1bGVzL2NhZTovc29mdHdhcmUvbW9kdWxlcy9jaGVtOi9zb2Z0d2FyZS9tb2R1bGVzL2NvbXBpbGVyOi9zb2Z0d2FyZS9tb2R1bGVzL2RhdGE6L3NvZnR3YXJlL21vZHVsZXMvZGVidWdnZXI6L3NvZnR3YXJlL21vZHVsZXMvZGV2ZWw6L3NvZnR3YXJlL21vZHVsZXMvZ2lzOi9zb2Z0d2FyZS9tb2R1bGVzL2xhbmc6L3NvZnR3YXJlL21vZHVsZXMvbGliOi9zb2Z0d2FyZS9tb2R1bGVzL21hdGg6L3NvZnR3YXJlL21vZHVsZXMvbXBpOi9zb2Z0d2FyZS9tb2R1bGVzL251bWxpYjovc29mdHdhcmUvbW9kdWxlcy9wZXJmOi9zb2Z0d2FyZS9tb2R1bGVzL3BoeXM6L3NvZnR3YXJlL21vZHVs')
== 2022-07-20 17:38:15,679 environment.py:91 INFO Environment variable _ModuleTable040_ set to YXJlL21vZHVsZWZpbGVzL0xpbnV4Oi91c3Ivc2hhcmUvbW9kdWxlZmlsZXMvQ29yZTovdXNyL3NoYXJlL2xtb2QvbG1vZC9tb2R1bGVmaWxlcy9Db3JlOi9zb2Z0d2FyZS9tb2R1bGVzL2Jpbzovc29mdHdhcmUvbW9kdWxlcy9jYWU6L3NvZnR3YXJlL21vZHVsZXMvY2hlbTovc29mdHdhcmUvbW9kdWxlcy9jb21waWxlcjovc29mdHdhcmUvbW9kdWxlcy9kYXRhOi9zb2Z0d2FyZS9tb2R1bGVzL2RlYnVnZ2VyOi9zb2Z0d2FyZS9tb2R1bGVzL2RldmVsOi9zb2Z0d2FyZS9tb2R1bGVzL2dpczovc29mdHdhcmUvbW9kdWxlcy9sYW5nOi9zb2Z0d2FyZS9tb2R1bGVzL2xpYjovc29mdHdhcmUvbW9kdWxlcy9tYXRoOi9zb2Z0d2FyZS9tb2R1bGVzL21waTovc29mdHdhcmUvbW9kdWxl (previous value: 'ZXMvc3lzdGVtOi9zb2Z0d2FyZS9tb2R1bGVzL3Rvb2xjaGFpbjovc29mdHdhcmUvbW9kdWxlcy90b29sczovc29mdHdhcmUvbW9kdWxlcy92aXMiLH0=')
== 2022-07-20 17:38:15,679 environment.py:91 INFO Environment variable _ModuleTable041_ set to cy9udW1saWI6L3NvZnR3YXJlL21vZHVsZXMvcGVyZjovc29mdHdhcmUvbW9kdWxlcy9waHlzOi9zb2Z0d2FyZS9tb2R1bGVzL3N5c3RlbTovc29mdHdhcmUvbW9kdWxlcy90b29sY2hhaW46L3NvZnR3YXJlL21vZHVsZXMvdG9vbHM6L3NvZnR3YXJlL21vZHVsZXMvdmlzIix9 (previously undefined)
== 2022-07-20 17:38:15,679 environment.py:91 INFO Environment variable BLAS_INC_DIR set to /software/software/FlexiBLAS/3.0.4-GCC-10.3.0/include/flexiblas (previously undefined)
== 2022-07-20 17:38:15,679 environment.py:91 INFO Environment variable EBVARBLAS_INC_DIR set to /software/software/FlexiBLAS/3.0.4-GCC-10.3.0/include/flexiblas (previously undefined)
== 2022-07-20 17:38:15,680 environment.py:91 INFO Environment variable BLAS_LAPACK_INC_DIR set to /software/software/FlexiBLAS/3.0.4-GCC-10.3.0/include/flexiblas (previously undefined)
== 2022-07-20 17:38:15,680 environment.py:91 INFO Environment variable EBVARBLAS_LAPACK_INC_DIR set to /software/software/FlexiBLAS/3.0.4-GCC-10.3.0/include/flexiblas (previously undefined)
== 2022-07-20 17:38:15,680 environment.py:91 INFO Environment variable BLAS_LAPACK_LIB_DIR set to /software/software/FlexiBLAS/3.0.4-GCC-10.3.0/lib (previously undefined)
== 2022-07-20 17:38:15,680 environment.py:91 INFO Environment variable EBVARBLAS_LAPACK_LIB_DIR set to /software/software/FlexiBLAS/3.0.4-GCC-10.3.0/lib (previously undefined)
== 2022-07-20 17:38:15,680 environment.py:91 INFO Environment variable BLAS_LAPACK_MT_SHARED_LIBS set to libflexiblas.so,libgfortran.so (previously undefined)
== 2022-07-20 17:38:15,681 environment.py:91 INFO Environment variable EBVARBLAS_LAPACK_MT_SHARED_LIBS set to libflexiblas.so,libgfortran.so (previously undefined)
== 2022-07-20 17:38:15,681 environment.py:91 INFO Environment variable BLAS_LAPACK_MT_STATIC_LIBS set to libflexiblas.a,libgfortran.a (previously undefined)
== 2022-07-20 17:38:15,681 environment.py:91 INFO Environment variable EBVARBLAS_LAPACK_MT_STATIC_LIBS set to libflexiblas.a,libgfortran.a (previously undefined)
== 2022-07-20 17:38:15,681 environment.py:91 INFO Environment variable BLAS_LAPACK_SHARED_LIBS set to libflexiblas.so,libgfortran.so (previously undefined)
== 2022-07-20 17:38:15,681 environment.py:91 INFO Environment variable EBVARBLAS_LAPACK_SHARED_LIBS set to libflexiblas.so,libgfortran.so (previously undefined)
== 2022-07-20 17:38:15,681 environment.py:91 INFO Environment variable BLAS_LAPACK_STATIC_LIBS set to libflexiblas.a,libgfortran.a (previously undefined)
== 2022-07-20 17:38:15,682 environment.py:91 INFO Environment variable EBVARBLAS_LAPACK_STATIC_LIBS set to libflexiblas.a,libgfortran.a (previously undefined)
== 2022-07-20 17:38:15,682 environment.py:91 INFO Environment variable BLAS_LIB_DIR set to /software/software/FlexiBLAS/3.0.4-GCC-10.3.0/lib (previously undefined)
== 2022-07-20 17:38:15,682 environment.py:91 INFO Environment variable EBVARBLAS_LIB_DIR set to /software/software/FlexiBLAS/3.0.4-GCC-10.3.0/lib (previously undefined)
== 2022-07-20 17:38:15,682 environment.py:91 INFO Environment variable BLAS_MT_SHARED_LIBS set to libflexiblas.so,libgfortran.so (previously undefined)
== 2022-07-20 17:38:15,682 environment.py:91 INFO Environment variable EBVARBLAS_MT_SHARED_LIBS set to libflexiblas.so,libgfortran.so (previously undefined)
== 2022-07-20 17:38:15,682 environment.py:91 INFO Environment variable BLAS_MT_STATIC_LIBS set to libflexiblas.a,libgfortran.a (previously undefined)
== 2022-07-20 17:38:15,683 environment.py:91 INFO Environment variable EBVARBLAS_MT_STATIC_LIBS set to libflexiblas.a,libgfortran.a (previously undefined)
== 2022-07-20 17:38:15,683 environment.py:91 INFO Environment variable BLAS_SHARED_LIBS set to libflexiblas.so,libgfortran.so (previously undefined)
== 2022-07-20 17:38:15,683 environment.py:91 INFO Environment variable EBVARBLAS_SHARED_LIBS set to libflexiblas.so,libgfortran.so (previously undefined)
== 2022-07-20 17:38:15,683 environment.py:91 INFO Environment variable BLAS_STATIC_LIBS set to libflexiblas.a,libgfortran.a (previously undefined)
== 2022-07-20 17:38:15,683 environment.py:91 INFO Environment variable EBVARBLAS_STATIC_LIBS set to libflexiblas.a,libgfortran.a (previously undefined)
== 2022-07-20 17:38:15,684 environment.py:91 INFO Environment variable CC set to mpicc (previously undefined)
== 2022-07-20 17:38:15,684 environment.py:91 INFO Environment variable EBVARCC set to mpicc (previously undefined)
== 2022-07-20 17:38:15,684 environment.py:91 INFO Environment variable CC_SEQ set to gcc (previously undefined)
== 2022-07-20 17:38:15,684 environment.py:91 INFO Environment variable EBVARCC_SEQ set to gcc (previously undefined)
== 2022-07-20 17:38:15,684 environment.py:91 INFO Environment variable CFLAGS set to -O2 -ftree-vectorize -march=native -fno-math-errno -fopenmp (previously undefined)
== 2022-07-20 17:38:15,684 environment.py:91 INFO Environment variable EBVARCFLAGS set to -O2 -ftree-vectorize -march=native -fno-math-errno -fopenmp (previously undefined)
== 2022-07-20 17:38:15,685 environment.py:91 INFO Environment variable CPPFLAGS set to -I/dev/shm/f115261/easybuildinstall/software/ScaFaCoS/1.0.1-foss-2021a/include -I/dev/shm/f115261/easybuildinstall/software/PLUMED/2.7.2-foss-2021a/include -I/software/software/Eigen/3.3.9-GCCcore-10.3.0/include -I/dev/shm/f115261/easybuildinstall/software/kim-api/2.2.1-GCCcore-10.3.0/include -I/dev/shm/f115261/easybuildinstall/software/Voro++/0.4.6-GCCcore-10.3.0/include -I/software/software/FFmpeg/4.3.2-GCCcore-10.3.0/include -I/software/software/libxml2/2.9.10-GCCcore-10.3.0/include -I/software/software/PCRE/8.44-GCCcore-10.3.0/include -I/dev/shm/f115261/easybuildinstall/software/tbb/2020.3-GCCcore-10.3.0/include -I/dev/shm/f115261/easybuildinstall/software/HDF5/1.12.1-gompi-2021a/include -I/software/software/cURL/7.76.0-GCCcore-10.3.0/include -I/software/software/zlib/1.2.11-GCCcore-10.3.0/include -I/software/software/GSL/2.7-GCC-10.3.0/include -I/software/software/netCDF/4.8.0-gompi-2021a/include -I/software/software/libjpeg-turbo/2.0.6-GCCcore-10.3.0/include -I/software/software/libpng/1.6.37-GCCcore-10.3.0/include -I/software/software/Python/3.9.5-GCCcore-10.3.0/include -I/software/software/FFTW/3.3.9-gompi-2021a/include -I/software/software/FlexiBLAS/3.0.4-GCC-10.3.0/include -I/software/software/FlexiBLAS/3.0.4-GCC-10.3.0/include/flexiblas (previously undefined)
== 2022-07-20 17:38:15,685 environment.py:91 INFO Environment variable EBVARCPPFLAGS set to -I/dev/shm/f115261/easybuildinstall/software/ScaFaCoS/1.0.1-foss-2021a/include -I/dev/shm/f115261/easybuildinstall/software/PLUMED/2.7.2-foss-2021a/include -I/software/software/Eigen/3.3.9-GCCcore-10.3.0/include -I/dev/shm/f115261/easybuildinstall/software/kim-api/2.2.1-GCCcore-10.3.0/include -I/dev/shm/f115261/easybuildinstall/software/Voro++/0.4.6-GCCcore-10.3.0/include -I/software/software/FFmpeg/4.3.2-GCCcore-10.3.0/include -I/software/software/libxml2/2.9.10-GCCcore-10.3.0/include -I/software/software/PCRE/8.44-GCCcore-10.3.0/include -I/dev/shm/f115261/easybuildinstall/software/tbb/2020.3-GCCcore-10.3.0/include -I/dev/shm/f115261/easybuildinstall/software/HDF5/1.12.1-gompi-2021a/include -I/software/software/cURL/7.76.0-GCCcore-10.3.0/include -I/software/software/zlib/1.2.11-GCCcore-10.3.0/include -I/software/software/GSL/2.7-GCC-10.3.0/include -I/software/software/netCDF/4.8.0-gompi-2021a/include -I/software/software/libjpeg-turbo/2.0.6-GCCcore-10.3.0/include -I/software/software/libpng/1.6.37-GCCcore-10.3.0/include -I/software/software/Python/3.9.5-GCCcore-10.3.0/include -I/software/software/FFTW/3.3.9-gompi-2021a/include -I/software/software/FlexiBLAS/3.0.4-GCC-10.3.0/include -I/software/software/FlexiBLAS/3.0.4-GCC-10.3.0/include/flexiblas (previously undefined)
== 2022-07-20 17:38:15,685 environment.py:91 INFO Environment variable CXX set to mpicxx (previously undefined)
== 2022-07-20 17:38:15,685 environment.py:91 INFO Environment variable EBVARCXX set to mpicxx (previously undefined)
== 2022-07-20 17:38:15,685 environment.py:91 INFO Environment variable CXXFLAGS set to -O2 -ftree-vectorize -march=native -fno-math-errno -fopenmp (previously undefined)
== 2022-07-20 17:38:15,685 environment.py:91 INFO Environment variable EBVARCXXFLAGS set to -O2 -ftree-vectorize -march=native -fno-math-errno -fopenmp (previously undefined)
== 2022-07-20 17:38:15,686 environment.py:91 INFO Environment variable CXX_SEQ set to g++ (previously undefined)
== 2022-07-20 17:38:15,686 environment.py:91 INFO Environment variable EBVARCXX_SEQ set to g++ (previously undefined)
== 2022-07-20 17:38:15,686 environment.py:91 INFO Environment variable F77 set to mpifort (previously undefined)
== 2022-07-20 17:38:15,686 environment.py:91 INFO Environment variable EBVARF77 set to mpifort (previously undefined)
== 2022-07-20 17:38:15,686 environment.py:91 INFO Environment variable F77_SEQ set to gfortran (previously undefined)
== 2022-07-20 17:38:15,686 environment.py:91 INFO Environment variable EBVARF77_SEQ set to gfortran (previously undefined)
== 2022-07-20 17:38:15,687 environment.py:91 INFO Environment variable F90 set to mpifort (previously undefined)
== 2022-07-20 17:38:15,687 environment.py:91 INFO Environment variable EBVARF90 set to mpifort (previously undefined)
== 2022-07-20 17:38:15,687 environment.py:91 INFO Environment variable F90FLAGS set to -O2 -ftree-vectorize -march=native -fno-math-errno -fopenmp (previously undefined)
== 2022-07-20 17:38:15,687 environment.py:91 INFO Environment variable EBVARF90FLAGS set to -O2 -ftree-vectorize -march=native -fno-math-errno -fopenmp (previously undefined)
== 2022-07-20 17:38:15,687 environment.py:91 INFO Environment variable F90_SEQ set to gfortran (previously undefined)
== 2022-07-20 17:38:15,687 environment.py:91 INFO Environment variable EBVARF90_SEQ set to gfortran (previously undefined)
== 2022-07-20 17:38:15,688 environment.py:91 INFO Environment variable FC set to mpifort (previously undefined)
== 2022-07-20 17:38:15,688 environment.py:91 INFO Environment variable EBVARFC set to mpifort (previously undefined)
== 2022-07-20 17:38:15,688 environment.py:91 INFO Environment variable FCFLAGS set to -O2 -ftree-vectorize -march=native -fno-math-errno -fopenmp (previously undefined)
== 2022-07-20 17:38:15,688 environment.py:91 INFO Environment variable EBVARFCFLAGS set to -O2 -ftree-vectorize -march=native -fno-math-errno -fopenmp (previously undefined)
== 2022-07-20 17:38:15,688 environment.py:91 INFO Environment variable FC_SEQ set to gfortran (previously undefined)
== 2022-07-20 17:38:15,688 environment.py:91 INFO Environment variable EBVARFC_SEQ set to gfortran (previously undefined)
== 2022-07-20 17:38:15,689 environment.py:91 INFO Environment variable FFLAGS set to -O2 -ftree-vectorize -march=native -fno-math-errno -fopenmp (previously undefined)
== 2022-07-20 17:38:15,689 environment.py:91 INFO Environment variable EBVARFFLAGS set to -O2 -ftree-vectorize -march=native -fno-math-errno -fopenmp (previously undefined)
== 2022-07-20 17:38:15,689 environment.py:91 INFO Environment variable FFTW_INC_DIR set to /software/software/FFTW/3.3.9-gompi-2021a/include (previously undefined)
== 2022-07-20 17:38:15,689 environment.py:91 INFO Environment variable EBVARFFTW_INC_DIR set to /software/software/FFTW/3.3.9-gompi-2021a/include (previously undefined)
== 2022-07-20 17:38:15,689 environment.py:91 INFO Environment variable FFTW_LIB_DIR set to /software/software/FFTW/3.3.9-gompi-2021a/lib (previously undefined)
== 2022-07-20 17:38:15,689 environment.py:91 INFO Environment variable EBVARFFTW_LIB_DIR set to /software/software/FFTW/3.3.9-gompi-2021a/lib (previously undefined)
== 2022-07-20 17:38:15,690 environment.py:91 INFO Environment variable FFTW_SHARED_LIBS set to libfftw3_mpi.so,libfftw3.so (previously undefined)
== 2022-07-20 17:38:15,690 environment.py:91 INFO Environment variable EBVARFFTW_SHARED_LIBS set to libfftw3_mpi.so,libfftw3.so (previously undefined)
== 2022-07-20 17:38:15,690 environment.py:91 INFO Environment variable FFTW_SHARED_LIBS_MT set to libfftw3_omp.so,libfftw3.so,libpthread.so (previously undefined)
== 2022-07-20 17:38:15,690 environment.py:91 INFO Environment variable EBVARFFTW_SHARED_LIBS_MT set to libfftw3_omp.so,libfftw3.so,libpthread.so (previously undefined)
== 2022-07-20 17:38:15,690 environment.py:91 INFO Environment variable FFTW_STATIC_LIBS set to libfftw3_mpi.a,libfftw3.a (previously undefined)
== 2022-07-20 17:38:15,690 environment.py:91 INFO Environment variable EBVARFFTW_STATIC_LIBS set to libfftw3_mpi.a,libfftw3.a (previously undefined)
== 2022-07-20 17:38:15,690 environment.py:91 INFO Environment variable FFTW_STATIC_LIBS_MT set to libfftw3_omp.a,libfftw3.a,libpthread.a (previously undefined)
== 2022-07-20 17:38:15,691 environment.py:91 INFO Environment variable EBVARFFTW_STATIC_LIBS_MT set to libfftw3_omp.a,libfftw3.a,libpthread.a (previously undefined)
== 2022-07-20 17:38:15,691 environment.py:91 INFO Environment variable FFT_INC_DIR set to /software/software/FFTW/3.3.9-gompi-2021a/include (previously undefined)
== 2022-07-20 17:38:15,691 environment.py:91 INFO Environment variable EBVARFFT_INC_DIR set to /software/software/FFTW/3.3.9-gompi-2021a/include (previously undefined)
== 2022-07-20 17:38:15,691 environment.py:91 INFO Environment variable FFT_LIB_DIR set to /software/software/FFTW/3.3.9-gompi-2021a/lib (previously undefined)
== 2022-07-20 17:38:15,691 environment.py:91 INFO Environment variable EBVARFFT_LIB_DIR set to /software/software/FFTW/3.3.9-gompi-2021a/lib (previously undefined)
== 2022-07-20 17:38:15,691 environment.py:91 INFO Environment variable FFT_SHARED_LIBS set to libfftw3_mpi.so,libfftw3.so (previously undefined)
== 2022-07-20 17:38:15,692 environment.py:91 INFO Environment variable EBVARFFT_SHARED_LIBS set to libfftw3_mpi.so,libfftw3.so (previously undefined)
== 2022-07-20 17:38:15,692 environment.py:91 INFO Environment variable FFT_SHARED_LIBS_MT set to libfftw3_omp.so,libfftw3.so,libpthread.so (previously undefined)
== 2022-07-20 17:38:15,692 environment.py:91 INFO Environment variable EBVARFFT_SHARED_LIBS_MT set to libfftw3_omp.so,libfftw3.so,libpthread.so (previously undefined)
== 2022-07-20 17:38:15,692 environment.py:91 INFO Environment variable FFT_STATIC_LIBS set to libfftw3_mpi.a,libfftw3.a (previously undefined)
== 2022-07-20 17:38:15,692 environment.py:91 INFO Environment variable EBVARFFT_STATIC_LIBS set to libfftw3_mpi.a,libfftw3.a (previously undefined)
== 2022-07-20 17:38:15,692 environment.py:91 INFO Environment variable FFT_STATIC_LIBS_MT set to libfftw3_omp.a,libfftw3.a,libpthread.a (previously undefined)
== 2022-07-20 17:38:15,693 environment.py:91 INFO Environment variable EBVARFFT_STATIC_LIBS_MT set to libfftw3_omp.a,libfftw3.a,libpthread.a (previously undefined)
== 2022-07-20 17:38:15,693 environment.py:91 INFO Environment variable FLIBS set to -lgfortran (previously undefined)
== 2022-07-20 17:38:15,693 environment.py:91 INFO Environment variable EBVARFLIBS set to -lgfortran (previously undefined)
== 2022-07-20 17:38:15,693 environment.py:91 INFO Environment variable LAPACK_INC_DIR set to /software/software/FlexiBLAS/3.0.4-GCC-10.3.0/include/flexiblas (previously undefined)
== 2022-07-20 17:38:15,693 environment.py:91 INFO Environment variable EBVARLAPACK_INC_DIR set to /software/software/FlexiBLAS/3.0.4-GCC-10.3.0/include/flexiblas (previously undefined)
== 2022-07-20 17:38:15,693 environment.py:91 INFO Environment variable LAPACK_LIB_DIR set to /software/software/FlexiBLAS/3.0.4-GCC-10.3.0/lib (previously undefined)
== 2022-07-20 17:38:15,694 environment.py:91 INFO Environment variable EBVARLAPACK_LIB_DIR set to /software/software/FlexiBLAS/3.0.4-GCC-10.3.0/lib (previously undefined)
== 2022-07-20 17:38:15,694 environment.py:91 INFO Environment variable LAPACK_MT_SHARED_LIBS set to libflexiblas.so,libgfortran.so (previously undefined)
== 2022-07-20 17:38:15,694 environment.py:91 INFO Environment variable EBVARLAPACK_MT_SHARED_LIBS set to libflexiblas.so,libgfortran.so (previously undefined)
== 2022-07-20 17:38:15,694 environment.py:91 INFO Environment variable LAPACK_MT_STATIC_LIBS set to libflexiblas.a,libgfortran.a (previously undefined)
== 2022-07-20 17:38:15,694 environment.py:91 INFO Environment variable EBVARLAPACK_MT_STATIC_LIBS set to libflexiblas.a,libgfortran.a (previously undefined)
== 2022-07-20 17:38:15,694 environment.py:91 INFO Environment variable LAPACK_SHARED_LIBS set to libflexiblas.so,libgfortran.so (previously undefined)
== 2022-07-20 17:38:15,695 environment.py:91 INFO Environment variable EBVARLAPACK_SHARED_LIBS set to libflexiblas.so,libgfortran.so (previously undefined)
== 2022-07-20 17:38:15,695 environment.py:91 INFO Environment variable LAPACK_STATIC_LIBS set to libflexiblas.a,libgfortran.a (previously undefined)
== 2022-07-20 17:38:15,695 environment.py:91 INFO Environment variable EBVARLAPACK_STATIC_LIBS set to libflexiblas.a,libgfortran.a (previously undefined)
== 2022-07-20 17:38:15,695 environment.py:91 INFO Environment variable LDFLAGS set to -L/software/software/SciPy-bundle/2021.05-foss-2021a/lib64 -L/software/software/SciPy-bundle/2021.05-foss-2021a/lib -L/dev/shm/f115261/easybuildinstall/software/ScaFaCoS/1.0.1-foss-2021a/lib64 -L/dev/shm/f115261/easybuildinstall/software/ScaFaCoS/1.0.1-foss-2021a/lib -L/dev/shm/f115261/easybuildinstall/software/PLUMED/2.7.2-foss-2021a/lib64 -L/dev/shm/f115261/easybuildinstall/software/PLUMED/2.7.2-foss-2021a/lib -L/dev/shm/f115261/easybuildinstall/software/kim-api/2.2.1-GCCcore-10.3.0/lib64 -L/dev/shm/f115261/easybuildinstall/software/kim-api/2.2.1-GCCcore-10.3.0/lib -L/dev/shm/f115261/easybuildinstall/software/Voro++/0.4.6-GCCcore-10.3.0/lib64 -L/dev/shm/f115261/easybuildinstall/software/Voro++/0.4.6-GCCcore-10.3.0/lib -L/software/software/FFmpeg/4.3.2-GCCcore-10.3.0/lib64 -L/software/software/FFmpeg/4.3.2-GCCcore-10.3.0/lib -L/software/software/libxml2/2.9.10-GCCcore-10.3.0/lib64 -L/software/software/libxml2/2.9.10-GCCcore-10.3.0/lib -L/software/software/PCRE/8.44-GCCcore-10.3.0/lib64 -L/software/software/PCRE/8.44-GCCcore-10.3.0/lib -L/dev/shm/f115261/easybuildinstall/software/tbb/2020.3-GCCcore-10.3.0/lib64 -L/dev/shm/f115261/easybuildinstall/software/tbb/2020.3-GCCcore-10.3.0/lib -L/dev/shm/f115261/easybuildinstall/software/HDF5/1.12.1-gompi-2021a/lib64 -L/dev/shm/f115261/easybuildinstall/software/HDF5/1.12.1-gompi-2021a/lib -L/software/software/cURL/7.76.0-GCCcore-10.3.0/lib64 -L/software/software/cURL/7.76.0-GCCcore-10.3.0/lib -L/software/software/zlib/1.2.11-GCCcore-10.3.0/lib64 -L/software/software/zlib/1.2.11-GCCcore-10.3.0/lib -L/software/software/GSL/2.7-GCC-10.3.0/lib64 -L/software/software/GSL/2.7-GCC-10.3.0/lib -L/software/software/netCDF/4.8.0-gompi-2021a/lib64 -L/software/software/netCDF/4.8.0-gompi-2021a/lib -L/software/software/libjpeg-turbo/2.0.6-GCCcore-10.3.0/lib64 -L/software/software/libjpeg-turbo/2.0.6-GCCcore-10.3.0/lib -L/software/software/libpng/1.6.37-GCCcore-10.3.0/lib64 -L/software/software/libpng/1.6.37-GCCcore-10.3.0/lib -L/software/software/Python/3.9.5-GCCcore-10.3.0/lib64 -L/software/software/Python/3.9.5-GCCcore-10.3.0/lib -L/dev/shm/f115261/easybuildinstall/software/archspec/0.1.2-GCCcore-10.3.0/lib64 -L/dev/shm/f115261/easybuildinstall/software/archspec/0.1.2-GCCcore-10.3.0/lib -L/software/software/FFTW/3.3.9-gompi-2021a/lib64 -L/software/software/FFTW/3.3.9-gompi-2021a/lib -L/software/software/ScaLAPACK/2.1.0-gompi-2021a-fb/lib64 -L/software/software/ScaLAPACK/2.1.0-gompi-2021a-fb/lib -L/software/software/FlexiBLAS/3.0.4-GCC-10.3.0/lib64 -L/software/software/FlexiBLAS/3.0.4-GCC-10.3.0/lib -L/software/software/GCCcore/10.3.0/lib64 -L/software/software/GCCcore/10.3.0/lib (previously undefined)
== 2022-07-20 17:38:15,695 environment.py:91 INFO Environment variable EBVARLDFLAGS set to -L/software/software/SciPy-bundle/2021.05-foss-2021a/lib64 -L/software/software/SciPy-bundle/2021.05-foss-2021a/lib -L/dev/shm/f115261/easybuildinstall/software/ScaFaCoS/1.0.1-foss-2021a/lib64 -L/dev/shm/f115261/easybuildinstall/software/ScaFaCoS/1.0.1-foss-2021a/lib -L/dev/shm/f115261/easybuildinstall/software/PLUMED/2.7.2-foss-2021a/lib64 -L/dev/shm/f115261/easybuildinstall/software/PLUMED/2.7.2-foss-2021a/lib -L/dev/shm/f115261/easybuildinstall/software/kim-api/2.2.1-GCCcore-10.3.0/lib64 -L/dev/shm/f115261/easybuildinstall/software/kim-api/2.2.1-GCCcore-10.3.0/lib -L/dev/shm/f115261/easybuildinstall/software/Voro++/0.4.6-GCCcore-10.3.0/lib64 -L/dev/shm/f115261/easybuildinstall/software/Voro++/0.4.6-GCCcore-10.3.0/lib -L/software/software/FFmpeg/4.3.2-GCCcore-10.3.0/lib64 -L/software/software/FFmpeg/4.3.2-GCCcore-10.3.0/lib -L/software/software/libxml2/2.9.10-GCCcore-10.3.0/lib64 -L/software/software/libxml2/2.9.10-GCCcore-10.3.0/lib -L/software/software/PCRE/8.44-GCCcore-10.3.0/lib64 -L/software/software/PCRE/8.44-GCCcore-10.3.0/lib -L/dev/shm/f115261/easybuildinstall/software/tbb/2020.3-GCCcore-10.3.0/lib64 -L/dev/shm/f115261/easybuildinstall/software/tbb/2020.3-GCCcore-10.3.0/lib -L/dev/shm/f115261/easybuildinstall/software/HDF5/1.12.1-gompi-2021a/lib64 -L/dev/shm/f115261/easybuildinstall/software/HDF5/1.12.1-gompi-2021a/lib -L/software/software/cURL/7.76.0-GCCcore-10.3.0/lib64 -L/software/software/cURL/7.76.0-GCCcore-10.3.0/lib -L/software/software/zlib/1.2.11-GCCcore-10.3.0/lib64 -L/software/software/zlib/1.2.11-GCCcore-10.3.0/lib -L/software/software/GSL/2.7-GCC-10.3.0/lib64 -L/software/software/GSL/2.7-GCC-10.3.0/lib -L/software/software/netCDF/4.8.0-gompi-2021a/lib64 -L/software/software/netCDF/4.8.0-gompi-2021a/lib -L/software/software/libjpeg-turbo/2.0.6-GCCcore-10.3.0/lib64 -L/software/software/libjpeg-turbo/2.0.6-GCCcore-10.3.0/lib -L/software/software/libpng/1.6.37-GCCcore-10.3.0/lib64 -L/software/software/libpng/1.6.37-GCCcore-10.3.0/lib -L/software/software/Python/3.9.5-GCCcore-10.3.0/lib64 -L/software/software/Python/3.9.5-GCCcore-10.3.0/lib -L/dev/shm/f115261/easybuildinstall/software/archspec/0.1.2-GCCcore-10.3.0/lib64 -L/dev/shm/f115261/easybuildinstall/software/archspec/0.1.2-GCCcore-10.3.0/lib -L/software/software/FFTW/3.3.9-gompi-2021a/lib64 -L/software/software/FFTW/3.3.9-gompi-2021a/lib -L/software/software/ScaLAPACK/2.1.0-gompi-2021a-fb/lib64 -L/software/software/ScaLAPACK/2.1.0-gompi-2021a-fb/lib -L/software/software/FlexiBLAS/3.0.4-GCC-10.3.0/lib64 -L/software/software/FlexiBLAS/3.0.4-GCC-10.3.0/lib -L/software/software/GCCcore/10.3.0/lib64 -L/software/software/GCCcore/10.3.0/lib (previously undefined)
== 2022-07-20 17:38:15,695 environment.py:91 INFO Environment variable LIBBLAS set to -lflexiblas -lgfortran (previously undefined)
== 2022-07-20 17:38:15,696 environment.py:91 INFO Environment variable EBVARLIBBLAS set to -lflexiblas -lgfortran (previously undefined)
== 2022-07-20 17:38:15,696 environment.py:91 INFO Environment variable LIBBLAS_MT set to -lflexiblas -lgfortran (previously undefined)
== 2022-07-20 17:38:15,696 environment.py:91 INFO Environment variable EBVARLIBBLAS_MT set to -lflexiblas -lgfortran (previously undefined)
== 2022-07-20 17:38:15,696 environment.py:91 INFO Environment variable LIBFFT set to -lfftw3_mpi -lfftw3 (previously undefined)
== 2022-07-20 17:38:15,696 environment.py:91 INFO Environment variable EBVARLIBFFT set to -lfftw3_mpi -lfftw3 (previously undefined)
== 2022-07-20 17:38:15,696 environment.py:91 INFO Environment variable LIBFFT_MT set to -lfftw3_omp -lfftw3 -lpthread (previously undefined)
== 2022-07-20 17:38:15,696 environment.py:91 INFO Environment variable EBVARLIBFFT_MT set to -lfftw3_omp -lfftw3 -lpthread (previously undefined)
== 2022-07-20 17:38:15,697 environment.py:91 INFO Environment variable LIBLAPACK set to -lflexiblas -lgfortran (previously undefined)
== 2022-07-20 17:38:15,697 environment.py:91 INFO Environment variable EBVARLIBLAPACK set to -lflexiblas -lgfortran (previously undefined)
== 2022-07-20 17:38:15,697 environment.py:91 INFO Environment variable LIBLAPACK_MT set to -lflexiblas -lgfortran (previously undefined)
== 2022-07-20 17:38:15,697 environment.py:91 INFO Environment variable EBVARLIBLAPACK_MT set to -lflexiblas -lgfortran (previously undefined)
== 2022-07-20 17:38:15,697 environment.py:91 INFO Environment variable LIBLAPACK_MT_ONLY set to -lflexiblas -lgfortran (previously undefined)
== 2022-07-20 17:38:15,697 environment.py:91 INFO Environment variable EBVARLIBLAPACK_MT_ONLY set to -lflexiblas -lgfortran (previously undefined)
== 2022-07-20 17:38:15,698 environment.py:91 INFO Environment variable LIBLAPACK_ONLY set to -lflexiblas -lgfortran (previously undefined)
== 2022-07-20 17:38:15,698 environment.py:91 INFO Environment variable EBVARLIBLAPACK_ONLY set to -lflexiblas -lgfortran (previously undefined)
== 2022-07-20 17:38:15,698 environment.py:91 INFO Environment variable LIBS set to -lm -lpthread (previously undefined)
== 2022-07-20 17:38:15,698 environment.py:91 INFO Environment variable EBVARLIBS set to -lm -lpthread (previously undefined)
== 2022-07-20 17:38:15,698 environment.py:91 INFO Environment variable LIBSCALAPACK set to -lscalapack -lflexiblas -lgfortran (previously undefined)
== 2022-07-20 17:38:15,698 environment.py:91 INFO Environment variable EBVARLIBSCALAPACK set to -lscalapack -lflexiblas -lgfortran (previously undefined)
== 2022-07-20 17:38:15,698 environment.py:91 INFO Environment variable LIBSCALAPACK_MT set to -lscalapack -lflexiblas -lpthread -lgfortran (previously undefined)
== 2022-07-20 17:38:15,699 environment.py:91 INFO Environment variable EBVARLIBSCALAPACK_MT set to -lscalapack -lflexiblas -lpthread -lgfortran (previously undefined)
== 2022-07-20 17:38:15,699 environment.py:91 INFO Environment variable LIBSCALAPACK_MT_ONLY set to -lscalapack -lgfortran (previously undefined)
== 2022-07-20 17:38:15,699 environment.py:91 INFO Environment variable EBVARLIBSCALAPACK_MT_ONLY set to -lscalapack -lgfortran (previously undefined)
== 2022-07-20 17:38:15,699 environment.py:91 INFO Environment variable LIBSCALAPACK_ONLY set to -lscalapack -lgfortran (previously undefined)
== 2022-07-20 17:38:15,699 environment.py:91 INFO Environment variable EBVARLIBSCALAPACK_ONLY set to -lscalapack -lgfortran (previously undefined)
== 2022-07-20 17:38:15,699 environment.py:91 INFO Environment variable MPICC set to mpicc (previously undefined)
== 2022-07-20 17:38:15,700 environment.py:91 INFO Environment variable EBVARMPICC set to mpicc (previously undefined)
== 2022-07-20 17:38:15,700 environment.py:91 INFO Environment variable MPICXX set to mpicxx (previously undefined)
== 2022-07-20 17:38:15,700 environment.py:91 INFO Environment variable EBVARMPICXX set to mpicxx (previously undefined)
== 2022-07-20 17:38:15,700 environment.py:91 INFO Environment variable MPIF77 set to mpifort (previously undefined)
== 2022-07-20 17:38:15,700 environment.py:91 INFO Environment variable EBVARMPIF77 set to mpifort (previously undefined)
== 2022-07-20 17:38:15,700 environment.py:91 INFO Environment variable MPIF90 set to mpifort (previously undefined)
== 2022-07-20 17:38:15,700 environment.py:91 INFO Environment variable EBVARMPIF90 set to mpifort (previously undefined)
== 2022-07-20 17:38:15,701 environment.py:91 INFO Environment variable MPIFC set to mpifort (previously undefined)
== 2022-07-20 17:38:15,701 environment.py:91 INFO Environment variable EBVARMPIFC set to mpifort (previously undefined)
== 2022-07-20 17:38:15,701 environment.py:91 INFO Environment variable MPI_INC_DIR set to /software/software/OpenMPI/4.1.1-GCC-10.3.0/include (previously undefined)
== 2022-07-20 17:38:15,701 environment.py:91 INFO Environment variable EBVARMPI_INC_DIR set to /software/software/OpenMPI/4.1.1-GCC-10.3.0/include (previously undefined)
== 2022-07-20 17:38:15,701 environment.py:91 INFO Environment variable MPI_LIB_DIR set to /software/software/OpenMPI/4.1.1-GCC-10.3.0/lib64 (previously undefined)
== 2022-07-20 17:38:15,701 environment.py:91 INFO Environment variable EBVARMPI_LIB_DIR set to /software/software/OpenMPI/4.1.1-GCC-10.3.0/lib64 (previously undefined)
== 2022-07-20 17:38:15,702 environment.py:91 INFO Environment variable MPI_LIB_SHARED set to /software/software/OpenMPI/4.1.1-GCC-10.3.0/lib64/libmpi.so (previously undefined)
== 2022-07-20 17:38:15,702 environment.py:91 INFO Environment variable EBVARMPI_LIB_SHARED set to /software/software/OpenMPI/4.1.1-GCC-10.3.0/lib64/libmpi.so (previously undefined)
== 2022-07-20 17:38:15,702 environment.py:91 INFO Environment variable MPI_LIB_STATIC set to (previously undefined)
== 2022-07-20 17:38:15,702 environment.py:91 INFO Environment variable EBVARMPI_LIB_STATIC set to (previously undefined)
== 2022-07-20 17:38:15,702 environment.py:91 INFO Environment variable OMPI_CC set to gcc (previously undefined)
== 2022-07-20 17:38:15,702 environment.py:91 INFO Environment variable EBVAROMPI_CC set to gcc (previously undefined)
== 2022-07-20 17:38:15,702 environment.py:91 INFO Environment variable OMPI_CXX set to g++ (previously undefined)
== 2022-07-20 17:38:15,703 environment.py:91 INFO Environment variable EBVAROMPI_CXX set to g++ (previously undefined)
== 2022-07-20 17:38:15,703 environment.py:91 INFO Environment variable OMPI_F77 set to gfortran (previously undefined)
== 2022-07-20 17:38:15,703 environment.py:91 INFO Environment variable EBVAROMPI_F77 set to gfortran (previously undefined)
== 2022-07-20 17:38:15,703 environment.py:91 INFO Environment variable OMPI_F90 set to gfortran (previously undefined)
== 2022-07-20 17:38:15,703 environment.py:91 INFO Environment variable EBVAROMPI_F90 set to gfortran (previously undefined)
== 2022-07-20 17:38:15,703 environment.py:91 INFO Environment variable OMPI_FC set to gfortran (previously undefined)
== 2022-07-20 17:38:15,704 environment.py:91 INFO Environment variable EBVAROMPI_FC set to gfortran (previously undefined)
== 2022-07-20 17:38:15,704 environment.py:91 INFO Environment variable OPTFLAGS set to -O2 -ftree-vectorize -march=native (previously undefined)
== 2022-07-20 17:38:15,704 environment.py:91 INFO Environment variable EBVAROPTFLAGS set to -O2 -ftree-vectorize -march=native (previously undefined)
== 2022-07-20 17:38:15,704 environment.py:91 INFO Environment variable PRECFLAGS set to -fno-math-errno (previously undefined)
== 2022-07-20 17:38:15,704 environment.py:91 INFO Environment variable EBVARPRECFLAGS set to -fno-math-errno (previously undefined)
== 2022-07-20 17:38:15,704 environment.py:91 INFO Environment variable SCALAPACK_INC_DIR set to (previously undefined)
== 2022-07-20 17:38:15,704 environment.py:91 INFO Environment variable EBVARSCALAPACK_INC_DIR set to (previously undefined)
== 2022-07-20 17:38:15,705 environment.py:91 INFO Environment variable SCALAPACK_LIB_DIR set to /software/software/ScaLAPACK/2.1.0-gompi-2021a-fb/lib (previously undefined)
== 2022-07-20 17:38:15,705 environment.py:91 INFO Environment variable EBVARSCALAPACK_LIB_DIR set to /software/software/ScaLAPACK/2.1.0-gompi-2021a-fb/lib (previously undefined)
== 2022-07-20 17:38:15,705 environment.py:91 INFO Environment variable SCALAPACK_MT_SHARED_LIBS set to libscalapack.so,libflexiblas.so,libgfortran.so,libpthread.so (previously undefined)
== 2022-07-20 17:38:15,705 environment.py:91 INFO Environment variable EBVARSCALAPACK_MT_SHARED_LIBS set to libscalapack.so,libflexiblas.so,libgfortran.so,libpthread.so (previously undefined)
== 2022-07-20 17:38:15,705 environment.py:91 INFO Environment variable SCALAPACK_MT_STATIC_LIBS set to libscalapack.a,libflexiblas.a,libgfortran.a,libpthread.a (previously undefined)
== 2022-07-20 17:38:15,705 environment.py:91 INFO Environment variable EBVARSCALAPACK_MT_STATIC_LIBS set to libscalapack.a,libflexiblas.a,libgfortran.a,libpthread.a (previously undefined)
== 2022-07-20 17:38:15,706 environment.py:91 INFO Environment variable SCALAPACK_SHARED_LIBS set to libscalapack.so,libflexiblas.so,libgfortran.so (previously undefined)
== 2022-07-20 17:38:15,706 environment.py:91 INFO Environment variable EBVARSCALAPACK_SHARED_LIBS set to libscalapack.so,libflexiblas.so,libgfortran.so (previously undefined)
== 2022-07-20 17:38:15,706 environment.py:91 INFO Environment variable SCALAPACK_STATIC_LIBS set to libscalapack.a,libflexiblas.a,libgfortran.a (previously undefined)
== 2022-07-20 17:38:15,706 environment.py:91 INFO Environment variable EBVARSCALAPACK_STATIC_LIBS set to libscalapack.a,libflexiblas.a,libgfortran.a (previously undefined)
== 2022-07-20 17:38:15,706 environment.py:91 INFO Environment variable XDG_CACHE_HOME set to /dev/shm/f115261/eb-dmgn_xoc (previously undefined)
== 2022-07-20 17:38:15,706 environment.py:91 INFO Environment variable CMAKE_INCLUDE_PATH set to /software/software/FlexiBLAS/3.0.4-GCC-10.3.0/include:/software/software/FlexiBLAS/3.0.4-GCC-10.3.0/include/flexiblas:/software/software/FFTW/3.3.9-gompi-2021a/include:/software/software/Python/3.9.5-GCCcore-10.3.0/include:/software/software/libpng/1.6.37-GCCcore-10.3.0/include:/software/software/libjpeg-turbo/2.0.6-GCCcore-10.3.0/include:/software/software/netCDF/4.8.0-gompi-2021a/include:/software/software/GSL/2.7-GCC-10.3.0/include:/software/software/zlib/1.2.11-GCCcore-10.3.0/include:/software/software/cURL/7.76.0-GCCcore-10.3.0/include:/dev/shm/f115261/easybuildinstall/software/HDF5/1.12.1-gompi-2021a/include:/dev/shm/f115261/easybuildinstall/software/tbb/2020.3-GCCcore-10.3.0/include:/software/software/PCRE/8.44-GCCcore-10.3.0/include:/software/software/libxml2/2.9.10-GCCcore-10.3.0/include:/software/software/FFmpeg/4.3.2-GCCcore-10.3.0/include:/dev/shm/f115261/easybuildinstall/software/Voro++/0.4.6-GCCcore-10.3.0/include:/dev/shm/f115261/easybuildinstall/software/kim-api/2.2.1-GCCcore-10.3.0/include:/software/software/Eigen/3.3.9-GCCcore-10.3.0/include:/dev/shm/f115261/easybuildinstall/software/PLUMED/2.7.2-foss-2021a/include:/dev/shm/f115261/easybuildinstall/software/ScaFaCoS/1.0.1-foss-2021a/include:/software/software/SciPy-bundle/2021.05-foss-2021a/lib/python3.9/site-packages/numpy/core/include:/software/software/Boost/1.76.0-GCC-10.3.0/include:/software/software/ICU/69.1-GCCcore-10.3.0/include:/software/software/pybind11/2.6.2-GCCcore-10.3.0/include:/software/software/FriBidi/1.0.10-GCCcore-10.3.0/include:/software/software/X11/20210518-GCCcore-10.3.0/include:/software/software/fontconfig/2.13.93-GCCcore-10.3.0/include:/software/software/util-linux/2.36-GCCcore-10.3.0/include:/software/software/freetype/2.10.4-GCCcore-10.3.0/include/freetype2:/software/software/expat/2.2.9-GCCcore-10.3.0/include:/software/software/x265/3.5-GCCcore-10.3.0/include:/software/software/LAME/3.100-GCCcore-10.3.0/include:/software/software/x264/20210414-GCCcore-10.3.0/include:/software/software/libxml2/2.9.10-GCCcore-10.3.0/include/libxml2:/software/software/Szip/2.1.1-GCCcore-10.3.0/include:/software/software/libffi/3.3-GCCcore-10.3.0/include:/software/software/GMP/6.2.1-GCCcore-10.3.0/include:/software/software/SQLite/3.35.4-GCCcore-10.3.0/include:/software/software/Tcl/8.6.11-GCCcore-10.3.0/include:/software/software/libreadline/8.1-GCCcore-10.3.0/include:/software/software/libarchive/3.5.1-GCCcore-10.3.0/include:/software/software/bzip2/1.0.8-GCCcore-10.3.0/include:/software/software/ncurses/6.2-GCCcore-10.3.0/include:/software/software/OpenBLAS/0.3.15-GCC-10.3.0/include:/software/software/OpenMPI/4.1.1-GCC-10.3.0/include:/software/software/libfabric/1.12.1-GCCcore-10.3.0/include:/software/software/UCX/1.10.0-GCCcore-10.3.0/include:/software/software/libevent/2.1.12-GCCcore-10.3.0/include:/software/software/OpenSSL/1.1/include:/software/software/hwloc/2.4.1-GCCcore-10.3.0/include:/software/software/libpciaccess/0.16-GCCcore-10.3.0/include:/software/software/XZ/5.2.5-GCCcore-10.3.0/include:/software/software/numactl/2.0.14-GCCcore-10.3.0/include:/software/software/binutils/2.36.1-GCCcore-10.3.0/include (previously undefined)
== 2022-07-20 17:38:15,707 environment.py:91 INFO Environment variable CTEST_OUTPUT_ON_FAILURE set to True (previously undefined)
== 2022-07-20 17:38:15,850 build_log.py:169 ERROR EasyBuild crashed with an error (at easybuild/base/exceptions.py:124 in __init__): Sanity check failed: sanity check command cd /dev/shm/f115261/eb-dmgn_xoc/tmpk6n6efrl && mpirun -n 1 python -c 'from lammps import lammps; l=lammps(); l.file("/dev/shm/f115261/easybuildinstall/software/LAMMPS/23Jun2022-foss-2021a-kokkos/examples/atm/in.atm")' exited with code 1 (output: Traceback (most recent call last):
File "<string>", line 1, in <module>
File "/dev/shm/f115261/easybuildinstall/software/LAMMPS/23Jun2022-foss-2021a-kokkos/lib/python3.9/site-packages/lammps/core.py", line 150, in __init__
self.lib = CDLL(libpath,RTLD_GLOBAL)
File "/software/software/Python/3.9.5-GCCcore-10.3.0/lib/python3.9/ctypes/__init__.py", line 374, in __init__
self._handle = _dlopen(self._name, mode)
OSError: libhdf5_hl.so.100: cannot open shared object file: No such file or directory
--------------------------------------------------------------------------
Primary job terminated normally, but 1 process returned
a non-zero exit code. Per user-direction, the job has been aborted.
--------------------------------------------------------------------------
--------------------------------------------------------------------------
mpirun detected that one or more processes exited with non-zero status, thus causing
the job to be terminated. The first process to do so was:
Process name: [[47555,1],0]
Exit code: 1
--------------------------------------------------------------------------
)
sanity check command cd /dev/shm/f115261/eb-dmgn_xoc/tmpk6n6efrl && mpirun -n 1 python -c 'from lammps import lammps; l=lammps(); l.file("/dev/shm/f115261/easybuildinstall/software/LAMMPS/23Jun2022-foss-2021a-kokkos/examples/balance/in.balance")' exited with code 1 (output: Traceback (most recent call last):
File "<string>", line 1, in <module>
File "/dev/shm/f115261/easybuildinstall/software/LAMMPS/23Jun2022-foss-2021a-kokkos/lib/python3.9/site-packages/lammps/core.py", line 150, in __init__
self.lib = CDLL(libpath,RTLD_GLOBAL)
File "/software/software/Python/3.9.5-GCCcore-10.3.0/lib/python3.9/ctypes/__init__.py", line 374, in __init__
self._handle = _dlopen(self._name, mode)
OSError: libhdf5_hl.so.100: cannot open shared object file: No such file or directory
--------------------------------------------------------------------------
Primary job terminated normally, but 1 process returned
a non-zero exit code. Per user-direction, the job has been aborted.
--------------------------------------------------------------------------
--------------------------------------------------------------------------
mpirun detected that one or more processes exited with non-zero status, thus causing
the job to be terminated. The first process to do so was:
Process name: [[47581,1],0]
Exit code: 1
--------------------------------------------------------------------------
)
sanity check command cd /dev/shm/f115261/eb-dmgn_xoc/tmpk6n6efrl && mpirun -n 1 python -c 'from lammps import lammps; l=lammps(); l.file("/dev/shm/f115261/easybuildinstall/software/LAMMPS/23Jun2022-foss-2021a-kokkos/examples/colloid/in.colloid")' exited with code 1 (output: Traceback (most recent call last):
File "<string>", line 1, in <module>
File "/dev/shm/f115261/easybuildinstall/software/LAMMPS/23Jun2022-foss-2021a-kokkos/lib/python3.9/site-packages/lammps/core.py", line 150, in __init__
self.lib = CDLL(libpath,RTLD_GLOBAL)
File "/software/software/Python/3.9.5-GCCcore-10.3.0/lib/python3.9/ctypes/__init__.py", line 374, in __init__
self._handle = _dlopen(self._name, mode)
OSError: libhdf5_hl.so.100: cannot open shared object file: No such file or directory
--------------------------------------------------------------------------
Primary job terminated normally, but 1 process returned
a non-zero exit code. Per user-direction, the job has been aborted.
--------------------------------------------------------------------------
--------------------------------------------------------------------------
mpirun detected that one or more processes exited with non-zero status, thus causing
the job to be terminated. The first process to do so was:
Process name: [[47599,1],0]
Exit code: 1
--------------------------------------------------------------------------
)
sanity check command cd /dev/shm/f115261/eb-dmgn_xoc/tmpk6n6efrl && mpirun -n 1 python -c 'from lammps import lammps; l=lammps(); l.file("/dev/shm/f115261/easybuildinstall/software/LAMMPS/23Jun2022-foss-2021a-kokkos/examples/crack/in.crack")' exited with code 1 (output: Traceback (most recent call last):
File "<string>", line 1, in <module>
File "/dev/shm/f115261/easybuildinstall/software/LAMMPS/23Jun2022-foss-2021a-kokkos/lib/python3.9/site-packages/lammps/core.py", line 150, in __init__
self.lib = CDLL(libpath,RTLD_GLOBAL)
File "/software/software/Python/3.9.5-GCCcore-10.3.0/lib/python3.9/ctypes/__init__.py", line 374, in __init__
self._handle = _dlopen(self._name, mode)
OSError: libhdf5_hl.so.100: cannot open shared object file: No such file or directory
--------------------------------------------------------------------------
Primary job terminated normally, but 1 process returned
a non-zero exit code. Per user-direction, the job has been aborted.
--------------------------------------------------------------------------
--------------------------------------------------------------------------
mpirun detected that one or more processes exited with non-zero status, thus causing
the job to be terminated. The first process to do so was:
Process name: [[47495,1],0]
Exit code: 1
--------------------------------------------------------------------------
)
sanity check command cd /dev/shm/f115261/eb-dmgn_xoc/tmpk6n6efrl && mpirun -n 1 python -c 'from lammps import lammps; l=lammps(); l.file("/dev/shm/f115261/easybuildinstall/software/LAMMPS/23Jun2022-foss-2021a-kokkos/examples/dipole/in.dipole")' exited with code 1 (output: Traceback (most recent call last):
File "<string>", line 1, in <module>
File "/dev/shm/f115261/easybuildinstall/software/LAMMPS/23Jun2022-foss-2021a-kokkos/lib/python3.9/site-packages/lammps/core.py", line 150, in __init__
self.lib = CDLL(libpath,RTLD_GLOBAL)
File "/software/software/Python/3.9.5-GCCcore-10.3.0/lib/python3.9/ctypes/__init__.py", line 374, in __init__
self._handle = _dlopen(self._name, mode)
OSError: libhdf5_hl.so.100: cannot open shared object file: No such file or directory
--------------------------------------------------------------------------
Primary job terminated normally, but 1 process returned
a non-zero exit code. Per user-direction, the job has been aborted.
--------------------------------------------------------------------------
--------------------------------------------------------------------------
mpirun detected that one or more processes exited with non-zero status, thus causing
the job to be terminated. The first process to do so was:
Process name: [[47518,1],0]
Exit code: 1
--------------------------------------------------------------------------
)
sanity check command cd /dev/shm/f115261/eb-dmgn_xoc/tmpk6n6efrl && mpirun -n 1 python -c 'from lammps import lammps; l=lammps(); l.file("/dev/shm/f115261/easybuildinstall/software/LAMMPS/23Jun2022-foss-2021a-kokkos/examples/friction/in.friction")' exited with code 1 (output: Traceback (most recent call last):
File "<string>", line 1, in <module>
File "/dev/shm/f115261/easybuildinstall/software/LAMMPS/23Jun2022-foss-2021a-kokkos/lib/python3.9/site-packages/lammps/core.py", line 150, in __init__
self.lib = CDLL(libpath,RTLD_GLOBAL)
File "/software/software/Python/3.9.5-GCCcore-10.3.0/lib/python3.9/ctypes/__init__.py", line 374, in __init__
self._handle = _dlopen(self._name, mode)
OSError: libhdf5_hl.so.100: cannot open shared object file: No such file or directory
--------------------------------------------------------------------------
Primary job terminated normally, but 1 process returned
a non-zero exit code. Per user-direction, the job has been aborted.
--------------------------------------------------------------------------
--------------------------------------------------------------------------
mpirun detected that one or more processes exited with non-zero status, thus causing
the job to be terminated. The first process to do so was:
Process name: [[47528,1],0]
Exit code: 1
--------------------------------------------------------------------------
)
sanity check command cd /dev/shm/f115261/eb-dmgn_xoc/tmpk6n6efrl && mpirun -n 1 python -c 'from lammps import lammps; l=lammps(); l.file("/dev/shm/f115261/easybuildinstall/software/LAMMPS/23Jun2022-foss-2021a-kokkos/examples/hugoniostat/in.hugoniostat")' exited with code 1 (output: Traceback (most recent call last):
File "<string>", line 1, in <module>
File "/dev/shm/f115261/easybuildinstall/software/LAMMPS/23Jun2022-foss-2021a-kokkos/lib/python3.9/site-packages/lammps/core.py", line 150, in __init__
self.lib = CDLL(libpath,RTLD_GLOBAL)
File "/software/software/Python/3.9.5-GCCcore-10.3.0/lib/python3.9/ctypes/__init__.py", line 374, in __init__
self._handle = _dlopen(self._name, mode)
OSError: libhdf5_hl.so.100: cannot open shared object file: No such file or directory
--------------------------------------------------------------------------
Primary job terminated normally, but 1 process returned
a non-zero exit code. Per user-direction, the job has been aborted.
--------------------------------------------------------------------------
--------------------------------------------------------------------------
mpirun detected that one or more processes exited with non-zero status, thus causing
the job to be terminated. The first process to do so was:
Process name: [[47446,1],0]
Exit code: 1
--------------------------------------------------------------------------
)
sanity check command cd /dev/shm/f115261/eb-dmgn_xoc/tmpk6n6efrl && mpirun -n 1 python -c 'from lammps import lammps; l=lammps(); l.file("/dev/shm/f115261/easybuildinstall/software/LAMMPS/23Jun2022-foss-2021a-kokkos/examples/indent/in.indent")' exited with code 1 (output: Traceback (most recent call last):
File "<string>", line 1, in <module>
File "/dev/shm/f115261/easybuildinstall/software/LAMMPS/23Jun2022-foss-2021a-kokkos/lib/python3.9/site-packages/lammps/core.py", line 150, in __init__
self.lib = CDLL(libpath,RTLD_GLOBAL)
File "/software/software/Python/3.9.5-GCCcore-10.3.0/lib/python3.9/ctypes/__init__.py", line 374, in __init__
self._handle = _dlopen(self._name, mode)
OSError: libhdf5_hl.so.100: cannot open shared object file: No such file or directory
--------------------------------------------------------------------------
Primary job terminated normally, but 1 process returned
a non-zero exit code. Per user-direction, the job has been aborted.
--------------------------------------------------------------------------
--------------------------------------------------------------------------
mpirun detected that one or more processes exited with non-zero status, thus causing
the job to be terminated. The first process to do so was:
Process name: [[47481,1],0]
Exit code: 1
--------------------------------------------------------------------------
)
sanity check command cd /dev/shm/f115261/eb-dmgn_xoc/tmpk6n6efrl && mpirun -n 1 python -c 'from lammps import lammps; l=lammps(); l.file("/dev/shm/f115261/easybuildinstall/software/LAMMPS/23Jun2022-foss-2021a-kokkos/examples/melt/in.melt")' exited with code 1 (output: Traceback (most recent call last):
File "<string>", line 1, in <module>
File "/dev/shm/f115261/easybuildinstall/software/LAMMPS/23Jun2022-foss-2021a-kokkos/lib/python3.9/site-packages/lammps/core.py", line 150, in __init__
self.lib = CDLL(libpath,RTLD_GLOBAL)
File "/software/software/Python/3.9.5-GCCcore-10.3.0/lib/python3.9/ctypes/__init__.py", line 374, in __init__
self._handle = _dlopen(self._name, mode)
OSError: libhdf5_hl.so.100: cannot open shared object file: No such file or directory
--------------------------------------------------------------------------
Primary job terminated normally, but 1 process returned
a non-zero exit code. Per user-direction, the job has been aborted.
--------------------------------------------------------------------------
--------------------------------------------------------------------------
mpirun detected that one or more processes exited with non-zero status, thus causing
the job to be terminated. The first process to do so was:
Process name: [[47371,1],0]
Exit code: 1
--------------------------------------------------------------------------
)
sanity check command cd /dev/shm/f115261/eb-dmgn_xoc/tmpk6n6efrl && mpirun -n 1 python -c 'from lammps import lammps; l=lammps(); l.file("/dev/shm/f115261/easybuildinstall/software/LAMMPS/23Jun2022-foss-2021a-kokkos/examples/min/in.min")' exited with code 1 (output: Traceback (most recent call last):
File "<string>", line 1, in <module>
File "/dev/shm/f115261/easybuildinstall/software/LAMMPS/23Jun2022-foss-2021a-kokkos/lib/python3.9/site-packages/lammps/core.py", line 150, in __init__
self.lib = CDLL(libpath,RTLD_GLOBAL)
File "/software/software/Python/3.9.5-GCCcore-10.3.0/lib/python3.9/ctypes/__init__.py", line 374, in __init__
self._handle = _dlopen(self._name, mode)
OSError: libhdf5_hl.so.100: cannot open shared object file: No such file or directory
--------------------------------------------------------------------------
Primary job terminated normally, but 1 process returned
a non-zero exit code. Per user-direction, the job has been aborted.
--------------------------------------------------------------------------
--------------------------------------------------------------------------
mpirun detected that one or more processes exited with non-zero status, thus causing
the job to be terminated. The first process to do so was:
Process name: [[47414,1],0]
Exit code: 1
--------------------------------------------------------------------------
)
sanity check command cd /dev/shm/f115261/eb-dmgn_xoc/tmpk6n6efrl && mpirun -n 1 python -c 'from lammps import lammps; l=lammps(); l.file("/dev/shm/f115261/easybuildinstall/software/LAMMPS/23Jun2022-foss-2021a-kokkos/examples/msst/in.msst")' exited with code 1 (output: Traceback (most recent call last):
File "<string>", line 1, in <module>
File "/dev/shm/f115261/easybuildinstall/software/LAMMPS/23Jun2022-foss-2021a-kokkos/lib/python3.9/site-packages/lammps/core.py", line 150, in __init__
self.lib = CDLL(libpath,RTLD_GLOBAL)
File "/software/software/Python/3.9.5-GCCcore-10.3.0/lib/python3.9/ctypes/__init__.py", line 374, in __init__
self._handle = _dlopen(self._name, mode)
OSError: libhdf5_hl.so.100: cannot open shared object file: No such file or directory
--------------------------------------------------------------------------
Primary job terminated normally, but 1 process returned
a non-zero exit code. Per user-direction, the job has been aborted.
--------------------------------------------------------------------------
--------------------------------------------------------------------------
mpirun detected that one or more processes exited with non-zero status, thus causing
the job to be terminated. The first process to do so was:
Process name: [[47811,1],0]
Exit code: 1
--------------------------------------------------------------------------
)
sanity check command cd /dev/shm/f115261/eb-dmgn_xoc/tmpk6n6efrl && mpirun -n 1 python -c 'from lammps import lammps; l=lammps(); l.file("/dev/shm/f115261/easybuildinstall/software/LAMMPS/23Jun2022-foss-2021a-kokkos/examples/nemd/in.nemd")' exited with code 1 (output: Traceback (most recent call last):
File "<string>", line 1, in <module>
File "/dev/shm/f115261/easybuildinstall/software/LAMMPS/23Jun2022-foss-2021a-kokkos/lib/python3.9/site-packages/lammps/core.py", line 150, in __init__
self.lib = CDLL(libpath,RTLD_GLOBAL)
File "/software/software/Python/3.9.5-GCCcore-10.3.0/lib/python3.9/ctypes/__init__.py", line 374, in __init__
self._handle = _dlopen(self._name, mode)
OSError: libhdf5_hl.so.100: cannot open shared object file: No such file or directory
--------------------------------------------------------------------------
Primary job terminated normally, but 1 process returned
a non-zero exit code. Per user-direction, the job has been aborted.
--------------------------------------------------------------------------
--------------------------------------------------------------------------
mpirun detected that one or more processes exited with non-zero status, thus causing
the job to be terminated. The first process to do so was:
Process name: [[47866,1],0]
Exit code: 1
--------------------------------------------------------------------------
)
sanity check command cd /dev/shm/f115261/eb-dmgn_xoc/tmpk6n6efrl && mpirun -n 1 python -c 'from lammps import lammps; l=lammps(); l.file("/dev/shm/f115261/easybuildinstall/software/LAMMPS/23Jun2022-foss-2021a-kokkos/examples/obstacle/in.obstacle")' exited with code 1 (output: Traceback (most recent call last):
File "<string>", line 1, in <module>
File "/dev/shm/f115261/easybuildinstall/software/LAMMPS/23Jun2022-foss-2021a-kokkos/lib/python3.9/site-packages/lammps/core.py", line 150, in __init__
self.lib = CDLL(libpath,RTLD_GLOBAL)
File "/software/software/Python/3.9.5-GCCcore-10.3.0/lib/python3.9/ctypes/__init__.py", line 374, in __init__
self._handle = _dlopen(self._name, mode)
OSError: libhdf5_hl.so.100: cannot open shared object file: No such file or directory
--------------------------------------------------------------------------
Primary job terminated normally, but 1 process returned
a non-zero exit code. Per user-direction, the job has been aborted.
--------------------------------------------------------------------------
--------------------------------------------------------------------------
mpirun detected that one or more processes exited with non-zero status, thus causing
the job to be terminated. The first process to do so was:
Process name: [[47755,1],0]
Exit code: 1
--------------------------------------------------------------------------
)
sanity check command cd /dev/shm/f115261/eb-dmgn_xoc/tmpk6n6efrl && mpirun -n 1 python -c 'from lammps import lammps; l=lammps(); l.file("/dev/shm/f115261/easybuildinstall/software/LAMMPS/23Jun2022-foss-2021a-kokkos/examples/pour/in.pour")' exited with code 1 (output: Traceback (most recent call last):
File "<string>", line 1, in <module>
File "/dev/shm/f115261/easybuildinstall/software/LAMMPS/23Jun2022-foss-2021a-kokkos/lib/python3.9/site-packages/lammps/core.py", line 150, in __init__
self.lib = CDLL(libpath,RTLD_GLOBAL)
File "/software/software/Python/3.9.5-GCCcore-10.3.0/lib/python3.9/ctypes/__init__.py", line 374, in __init__
self._handle = _dlopen(self._name, mode)
OSError: libhdf5_hl.so.100: cannot open shared object file: No such file or directory
--------------------------------------------------------------------------
Primary job terminated normally, but 1 process returned
a non-zero exit code. Per user-direction, the job has been aborted.
--------------------------------------------------------------------------
--------------------------------------------------------------------------
mpirun detected that one or more processes exited with non-zero status, thus causing
the job to be terminated. The first process to do so was:
Process name: [[48066,1],0]
Exit code: 1
--------------------------------------------------------------------------
)
sanity check command cd /dev/shm/f115261/eb-dmgn_xoc/tmpk6n6efrl && mpirun -n 1 python -c 'from lammps import lammps; l=lammps(); l.file("/dev/shm/f115261/easybuildinstall/software/LAMMPS/23Jun2022-foss-2021a-kokkos/examples/voronoi/in.voronoi")' exited with code 1 (output: Traceback (most recent call last):
File "<string>", line 1, in <module>
File "/dev/shm/f115261/easybuildinstall/software/LAMMPS/23Jun2022-foss-2021a-kokkos/lib/python3.9/site-packages/lammps/core.py", line 150, in __init__
self.lib = CDLL(libpath,RTLD_GLOBAL)
File "/software/software/Python/3.9.5-GCCcore-10.3.0/lib/python3.9/ctypes/__init__.py", line 374, in __init__
self._handle = _dlopen(self._name, mode)
OSError: libhdf5_hl.so.100: cannot open shared object file: No such file or directory
--------------------------------------------------------------------------
Primary job terminated normally, but 1 process returned
a non-zero exit code. Per user-direction, the job has been aborted.
--------------------------------------------------------------------------
--------------------------------------------------------------------------
mpirun detected that one or more processes exited with non-zero status, thus causing
the job to be terminated. The first process to do so was:
Process name: [[48044,1],0]
Exit code: 1
--------------------------------------------------------------------------
) (at easybuild/framework/easyblock.py:3480 in _sanity_check_step)
== 2022-07-20 17:38:15,853 build_log.py:265 INFO ... (took 46 secs)
== 2022-07-20 17:38:15,859 filetools.py:2014 INFO Removing lock /dev/shm/f115261/easybuildinstall/software/.locks/_dev_shm_f115261_easybuildinstall_software_LAMMPS_23Jun2022-foss-2021a-kokkos.lock...
== 2022-07-20 17:38:15,860 filetools.py:382 INFO Path /dev/shm/f115261/easybuildinstall/software/.locks/_dev_shm_f115261_easybuildinstall_software_LAMMPS_23Jun2022-foss-2021a-kokkos.lock successfully removed.
== 2022-07-20 17:38:15,860 filetools.py:2018 INFO Lock removed: /dev/shm/f115261/easybuildinstall/software/.locks/_dev_shm_f115261_easybuildinstall_software_LAMMPS_23Jun2022-foss-2021a-kokkos.lock
== 2022-07-20 17:38:15,860 easyblock.py:4098 WARNING build failed (first 300 chars): Sanity check failed: sanity check command cd /dev/shm/f115261/eb-dmgn_xoc/tmpk6n6efrl && mpirun -n 1 python -c 'from lammps import lammps; l=lammps(); l.file("/dev/shm/f115261/easybuildinstall/software/LAMMPS/23Jun2022-foss-2021a-kokkos/examples/atm/in.atm")' exited with code 1 (output: Traceback (m
== 2022-07-20 17:38:15,860 easyblock.py:318 INFO Closing log for application name LAMMPS version 23Jun2022
Sign up for free to join this conversation on GitHub. Already have an account? Sign in to comment