Skip to content

Instantly share code, notes, and snippets.

Embed
What would you like to do?
gradlew task --info --debug --stacktrace
15:41:57.007 [LIFECYCLE] [org.gradle.launcher.daemon.client.SingleUseDaemonClient] To honour the JVM settings for this build a new JVM will be forked. Please consider using the daemon: https://docs.gradle.org/2.14.1/userguide/gradle_daemon.html.
15:41:57.017 [DEBUG] [org.gradle.launcher.daemon.client.DefaultDaemonStarter] Using daemon args: [/Library/Java/JavaVirtualMachines/jdk1.8.0_121.jdk/Contents/Home/bin/java, -Xmx1536m, -Dfile.encoding=UTF-8, -Duser.country=DE, -Duser.language=de, -Duser.variant, -cp, /Users/below/.gradle/wrapper/dists/gradle-2.14.1-all/8bnwg5hd3w55iofp58khbp6yv/gradle-2.14.1/lib/gradle-launcher-2.14.1.jar]
15:41:57.023 [INFO] [org.gradle.launcher.daemon.client.DefaultDaemonStarter] Starting daemon process: workingDir = /Users/below/.gradle/daemon/2.14.1, daemonArgs: [/Library/Java/JavaVirtualMachines/jdk1.8.0_121.jdk/Contents/Home/bin/java, -Xmx1536m, -Dfile.encoding=UTF-8, -Duser.country=DE, -Duser.language=de, -Duser.variant, -cp, /Users/below/.gradle/wrapper/dists/gradle-2.14.1-all/8bnwg5hd3w55iofp58khbp6yv/gradle-2.14.1/lib/gradle-launcher-2.14.1.jar, org.gradle.launcher.daemon.bootstrap.GradleDaemon, 2.14.1]
15:41:57.041 [INFO] [org.gradle.process.internal.DefaultExecHandle] Starting process 'Gradle build daemon'. Working directory: /Users/below/.gradle/daemon/2.14.1 Command: /Library/Java/JavaVirtualMachines/jdk1.8.0_121.jdk/Contents/Home/bin/java -Xmx1536m -Dfile.encoding=UTF-8 -Duser.country=DE -Duser.language=de -Duser.variant -cp /Users/below/.gradle/wrapper/dists/gradle-2.14.1-all/8bnwg5hd3w55iofp58khbp6yv/gradle-2.14.1/lib/gradle-launcher-2.14.1.jar org.gradle.launcher.daemon.bootstrap.GradleDaemon 2.14.1
15:41:57.041 [DEBUG] [org.gradle.process.internal.DefaultExecHandle] Environment for process 'Gradle build daemon': {PATH=/Users/below/bin:/usr/local/bin:/usr/local/sbin:/Users/below/.rvm/gems/ruby-2.1.5/bin:/Users/below/.rvm/gems/ruby-2.1.5@global/bin:/Users/below/.rvm/rubies/ruby-2.1.5/bin:/usr/bin:/bin:/usr/sbin:/sbin:/opt/X11/bin:/Users/below/.rvm/bin, IRBRC=/Users/below/.rvm/rubies/ruby-2.1.5/.irbrc, rvm_silent_flag=, APP_ICON_5985=/Users/below/AndroidStudioProjects/HelloAndroid/media/gradle.icns, rvm_quiet_flag=, rvm_bin_flag=, rvm_niceness=, rvm_ruby_make_install=, rvm_ruby_mode=, CVSROOT=imacbelow.local:/Users/below/dev/cvs-repository, JAVA_MAIN_CLASS_5985=org.gradle.wrapper.GradleWrapperMain, LOGNAME=below, rvm_version=1.26.11 (latest), PWD=/Users/below/AndroidStudioProjects/HelloAndroid, TERM_PROGRAM_VERSION=388, rvm_proxy=, SHELL=/bin/zsh, PAGER=less -CX, rvm_wrapper_name=, rvm_hook=, MY_RUBY_HOME=/Users/below/.rvm/rubies/ruby-2.1.5, rvm_sdk=, OLDPWD=/Users/below/AndroidStudioProjects/HelloAndroid, rvm_nightly_flag=, GEM_HOME=/Users/below/.rvm/gems/ruby-2.1.5, rvm_path=/Users/below/.rvm, TMPDIR=/var/folders/vk/9s7n8tyn00nfp69b29wdvqz80000gn/T/, rvm_use_flag=, RUBY_VERSION=ruby-2.1.5, XPC_FLAGS=0x0, TERM_SESSION_ID=124C1A5C-1675-4E63-89D9-EC749A761603, _system_name=OSX, LC_ALL=de_DE.UTF-8, __CF_USER_TEXT_ENCODING=0x1F5:0x0:0x3, Apple_PubSub_Socket_Render=/private/tmp/com.apple.launchd.DxVayhP5EC/Render, LESS=-RP?n?f%f .?m(file %i of %m) ..?e(END) ?x- Next\: %x..%t, LC_CTYPE=en_US.UTF-8, SHLVL=1, GROOFCVS=:ext:groof.com:/var/lib/cvs, rvm_gemstone_package_file=, JAVA_ARCH=x86_64, _system_arch=x86_64, rvm_bin_path=/Users/below/.rvm/bin, TERM=xterm-color, rvm_only_path_flag=, rvm_prefix=/Users/below, LANG=de_DE.UTF-8, APP_NAME_5985=Gradle, rvm_script_name=, DISPLAY=/private/tmp/com.apple.launchd.JNVSiSVYPP/org.macosforge.xquartz:0, rvm_ruby_make=, rvm_gemstone_url=, rvm_docs_type=, XPC_SERVICE_NAME=0, TERM_PROGRAM=Apple_Terminal, LSCOLORS=Gxfxcxdxbxegedabagacad, _system_type=Darwin, CVS_RSH=/usr/bin/ssh, _system_version=10.12, USER=below, CLICOLOR=1, rvm_ruby_file=, rvm_ruby_bits=, rvm_alias_expanded=, SSH_AUTH_SOCK=/private/tmp/com.apple.launchd.0XNpDR4PE9/Listeners, EDITOR=vim, GEM_PATH=/Users/below/.rvm/gems/ruby-2.1.5:/Users/below/.rvm/gems/ruby-2.1.5@global, com.apple.java.jvmTask=CommandLine, HOME=/Users/below}
15:41:57.045 [DEBUG] [org.gradle.process.internal.DefaultExecHandle] Changing state to: STARTING
15:41:57.047 [DEBUG] [org.gradle.process.internal.DefaultExecHandle] Waiting until process started: Gradle build daemon.
15:41:57.123 [DEBUG] [org.gradle.process.internal.DefaultExecHandle] Changing state to: STARTED
15:41:57.124 [DEBUG] [org.gradle.process.internal.ExecHandleRunner] waiting until streams are handled...
15:41:57.124 [INFO] [org.gradle.process.internal.DefaultExecHandle] Successfully started process 'Gradle build daemon'
15:41:57.124 [DEBUG] [org.gradle.launcher.daemon.client.DefaultDaemonStarter] Gradle daemon process is starting. Waiting for the daemon to detach...
15:41:57.124 [DEBUG] [org.gradle.launcher.daemon.bootstrap.DaemonOutputConsumer] Starting consuming the daemon process output.
15:41:57.823 [DEBUG] [org.gradle.launcher.daemon.bootstrap.DaemonOutputConsumer] daemon out: Daemon started. About to close the streams. Daemon details: 01000435393932002434646538366538622d623864322d346238342d623737612d65303234336134356462393015865a0a481e4b9a960b77b2790cd5990000d235000000020000001000000000000000000000000000000001000000047f00000100362f55736572732f62656c6f772f2e677261646c652f6461656d6f6e2f322e31342e312f6461656d6f6e2d353939322e6f75742e6c6f67
15:41:57.824 [DEBUG] [org.gradle.process.internal.DefaultExecHandle] Changing state to: DETACHED
15:41:57.825 [DEBUG] [org.gradle.process.internal.DefaultExecHandle] Process 'Gradle build daemon' finished with exit value 0 (state: DETACHED)
15:41:57.825 [DEBUG] [org.gradle.launcher.daemon.client.DefaultDaemonStarter] Gradle daemon process is now detached.
15:41:57.831 [INFO] [org.gradle.launcher.daemon.client.DefaultDaemonStarter] An attempt to start the daemon took 0.806 secs.
15:41:57.833 [DEBUG] [org.gradle.launcher.daemon.client.DefaultDaemonConnector] Started Gradle daemon DaemonStartupInfo{pid=5992, uid=4de86e8b-b8d2-4b84-b77a-e0243a45db90, address=[15865a0a-481e-4b9a-960b-77b2790cd599 port:53813, addresses:[/0:0:0:0:0:0:0:1, /127.0.0.1]], diagnostics={pid=5992, daemonLog=/Users/below/.gradle/daemon/2.14.1/daemon-5992.out.log}}
15:41:57.838 [DEBUG] [org.gradle.internal.remote.internal.inet.InetAddressFactory] Adding IP addresses for network interface utun1
15:41:57.838 [DEBUG] [org.gradle.internal.remote.internal.inet.InetAddressFactory] Is this a loopback interface? false
15:41:57.838 [DEBUG] [org.gradle.internal.remote.internal.inet.InetAddressFactory] Is this a multicast interface? true
15:41:57.839 [DEBUG] [org.gradle.internal.remote.internal.inet.InetAddressFactory] Adding remote address /fe80:0:0:0:eda1:b56c:5535:e0c3%utun1
15:41:57.839 [DEBUG] [org.gradle.internal.remote.internal.inet.InetAddressFactory] Adding remote multicast interface utun1
15:41:57.839 [DEBUG] [org.gradle.internal.remote.internal.inet.InetAddressFactory] Adding IP addresses for network interface utun0
15:41:57.839 [DEBUG] [org.gradle.internal.remote.internal.inet.InetAddressFactory] Is this a loopback interface? false
15:41:57.840 [DEBUG] [org.gradle.internal.remote.internal.inet.InetAddressFactory] Is this a multicast interface? true
15:41:57.840 [DEBUG] [org.gradle.internal.remote.internal.inet.InetAddressFactory] Adding remote address /fe80:0:0:0:5900:dc7a:7e14:c69e%utun0
15:41:57.840 [DEBUG] [org.gradle.internal.remote.internal.inet.InetAddressFactory] Adding remote multicast interface utun0
15:41:57.840 [DEBUG] [org.gradle.internal.remote.internal.inet.InetAddressFactory] Adding IP addresses for network interface awdl0
15:41:57.840 [DEBUG] [org.gradle.internal.remote.internal.inet.InetAddressFactory] Is this a loopback interface? false
15:41:57.840 [DEBUG] [org.gradle.internal.remote.internal.inet.InetAddressFactory] Is this a multicast interface? true
15:41:57.840 [DEBUG] [org.gradle.internal.remote.internal.inet.InetAddressFactory] Adding remote address /fe80:0:0:0:3c4c:38ff:fe92:fadf%awdl0
15:41:57.840 [DEBUG] [org.gradle.internal.remote.internal.inet.InetAddressFactory] Adding remote multicast interface awdl0
15:41:57.841 [DEBUG] [org.gradle.internal.remote.internal.inet.InetAddressFactory] Adding IP addresses for network interface vmnet8
15:41:57.841 [DEBUG] [org.gradle.internal.remote.internal.inet.InetAddressFactory] Is this a loopback interface? false
15:41:57.841 [DEBUG] [org.gradle.internal.remote.internal.inet.InetAddressFactory] Is this a multicast interface? true
15:41:57.841 [DEBUG] [org.gradle.internal.remote.internal.inet.InetAddressFactory] Adding remote address /172.16.107.1
15:41:57.841 [DEBUG] [org.gradle.internal.remote.internal.inet.InetAddressFactory] Adding remote multicast interface vmnet8
15:41:57.841 [DEBUG] [org.gradle.internal.remote.internal.inet.InetAddressFactory] Adding IP addresses for network interface vmnet1
15:41:57.841 [DEBUG] [org.gradle.internal.remote.internal.inet.InetAddressFactory] Is this a loopback interface? false
15:41:57.841 [DEBUG] [org.gradle.internal.remote.internal.inet.InetAddressFactory] Is this a multicast interface? true
15:41:57.842 [DEBUG] [org.gradle.internal.remote.internal.inet.InetAddressFactory] Adding remote address /192.168.122.1
15:41:57.842 [DEBUG] [org.gradle.internal.remote.internal.inet.InetAddressFactory] Adding remote multicast interface vmnet1
15:41:57.842 [DEBUG] [org.gradle.internal.remote.internal.inet.InetAddressFactory] Adding IP addresses for network interface en0
15:41:57.842 [DEBUG] [org.gradle.internal.remote.internal.inet.InetAddressFactory] Is this a loopback interface? false
15:41:57.842 [DEBUG] [org.gradle.internal.remote.internal.inet.InetAddressFactory] Is this a multicast interface? true
15:41:57.842 [DEBUG] [org.gradle.internal.remote.internal.inet.InetAddressFactory] Adding remote address /2003:ca:bbc2:8300:59cc:7610:2b18:3cd7
15:41:57.842 [DEBUG] [org.gradle.internal.remote.internal.inet.InetAddressFactory] Adding remote address /2003:ca:bbc2:8300:a4:ae6b:f3a0:4eb1
15:41:57.842 [DEBUG] [org.gradle.internal.remote.internal.inet.InetAddressFactory] Adding remote address /fe80:0:0:0:1864:7391:7268:f6b6%en0
15:41:57.843 [DEBUG] [org.gradle.internal.remote.internal.inet.InetAddressFactory] Adding remote address /192.168.178.27
15:41:57.843 [DEBUG] [org.gradle.internal.remote.internal.inet.InetAddressFactory] Adding remote multicast interface en0
15:41:57.843 [DEBUG] [org.gradle.internal.remote.internal.inet.InetAddressFactory] Adding IP addresses for network interface lo0
15:41:57.843 [DEBUG] [org.gradle.internal.remote.internal.inet.InetAddressFactory] Is this a loopback interface? true
15:41:57.843 [DEBUG] [org.gradle.internal.remote.internal.inet.InetAddressFactory] Is this a multicast interface? true
15:41:57.843 [DEBUG] [org.gradle.internal.remote.internal.inet.InetAddressFactory] Ignoring remote address on loopback interface /fe80:0:0:0:0:0:0:1%lo0
15:41:57.843 [DEBUG] [org.gradle.internal.remote.internal.inet.InetAddressFactory] Adding loopback address /0:0:0:0:0:0:0:1
15:41:57.843 [DEBUG] [org.gradle.internal.remote.internal.inet.InetAddressFactory] Adding loopback address /127.0.0.1
15:41:57.844 [DEBUG] [org.gradle.internal.remote.internal.inet.InetAddressFactory] Adding loopback multicast interface lo0
15:41:57.850 [DEBUG] [org.gradle.cache.internal.DefaultFileLockManager] Waiting to acquire shared lock on daemon addresses registry.
15:41:57.851 [DEBUG] [org.gradle.cache.internal.DefaultFileLockManager] Lock acquired.
15:41:57.872 [DEBUG] [org.gradle.cache.internal.DefaultFileLockManager] Releasing lock on daemon addresses registry.
15:41:57.873 [DEBUG] [org.gradle.internal.remote.internal.inet.TcpOutgoingConnector] Attempting to connect to [15865a0a-481e-4b9a-960b-77b2790cd599 port:53813, addresses:[/0:0:0:0:0:0:0:1, /127.0.0.1]].
15:41:57.873 [DEBUG] [org.gradle.internal.remote.internal.inet.TcpOutgoingConnector] Trying to connect to address /0:0:0:0:0:0:0:1.
15:41:57.883 [DEBUG] [org.gradle.internal.remote.internal.inet.TcpOutgoingConnector] Connected to address /0:0:0:0:0:0:0:1:53813.
15:41:57.911 [INFO] [org.gradle.launcher.daemon.client.DaemonClient] Connected to daemon DaemonInfo{pid=5992, address=[15865a0a-481e-4b9a-960b-77b2790cd599 port:53813, addresses:[/0:0:0:0:0:0:0:1, /127.0.0.1]], idle=false, lastBusy=1488552117814, context=DefaultDaemonContext[uid=4de86e8b-b8d2-4b84-b77a-e0243a45db90,javaHome=/Library/Java/JavaVirtualMachines/jdk1.8.0_121.jdk/Contents/Home,daemonRegistryDir=/Users/below/.gradle/daemon,pid=5992,idleTimeout=120000,daemonOpts=-Xmx1536m,-Dfile.encoding=UTF-8,-Duser.country=DE,-Duser.language=de,-Duser.variant]}. Dispatching request BuildAndStop{id=9b1e9ac2-1d2e-4200-884c-f192e8f92dff.1, currentDir=/Users/below/AndroidStudioProjects/HelloAndroid}.
15:41:57.920 [DEBUG] [org.gradle.launcher.daemon.client.DaemonClientConnection] thread 1: dispatching class org.gradle.launcher.daemon.protocol.BuildAndStop
15:41:57.972 [INFO] [org.gradle.launcher.daemon.client.DaemonClient] Received result org.gradle.launcher.daemon.protocol.BuildStarted@6c0d7c83 from daemon DaemonInfo{pid=5992, address=[15865a0a-481e-4b9a-960b-77b2790cd599 port:53813, addresses:[/0:0:0:0:0:0:0:1, /127.0.0.1]], idle=false, lastBusy=1488552117814, context=DefaultDaemonContext[uid=4de86e8b-b8d2-4b84-b77a-e0243a45db90,javaHome=/Library/Java/JavaVirtualMachines/jdk1.8.0_121.jdk/Contents/Home,daemonRegistryDir=/Users/below/.gradle/daemon,pid=5992,idleTimeout=120000,daemonOpts=-Xmx1536m,-Dfile.encoding=UTF-8,-Duser.country=DE,-Duser.language=de,-Duser.variant]} (build should be starting).
15:41:57.979 [INFO] [org.gradle.launcher.daemon.server.exec.LogToClient] The client will now receive all logging from the daemon (pid: 5992). The daemon log file: /Users/below/.gradle/daemon/2.14.1/daemon-5992.out.log
15:41:57.983 [DEBUG] [org.gradle.launcher.daemon.server.exec.RequestStopIfSingleUsedDaemon] Requesting daemon stop after processing BuildAndStop{id=9b1e9ac2-1d2e-4200-884c-f192e8f92dff.1, currentDir=/Users/below/AndroidStudioProjects/HelloAndroid}
15:41:57.983 [DEBUG] [org.gradle.launcher.daemon.server.DaemonStateCoordinator] Stop as soon as idle requested. The daemon is busy: true
15:41:57.983 [DEBUG] [org.gradle.launcher.daemon.server.DaemonStateCoordinator] daemon stop has been requested. Sleeping until state changes.
15:41:57.985 [DEBUG] [org.gradle.launcher.daemon.server.exec.ExecuteBuild] The daemon has started executing the build.
15:41:57.986 [INFO] [org.gradle.launcher.daemon.server.exec.ExecuteBuild] Executing build with daemon context: DefaultDaemonContext[uid=4de86e8b-b8d2-4b84-b77a-e0243a45db90,javaHome=/Library/Java/JavaVirtualMachines/jdk1.8.0_121.jdk/Contents/Home,daemonRegistryDir=/Users/below/.gradle/daemon,pid=5992,idleTimeout=120000,daemonOpts=-Xmx1536m,-Dfile.encoding=UTF-8,-Duser.country=DE,-Duser.language=de,-Duser.variant]
15:41:58.536 [INFO] [org.gradle.BuildLogger] Starting Build
15:41:58.536 [DEBUG] [org.gradle.BuildLogger] Gradle user home: /Users/below/.gradle
15:41:58.537 [DEBUG] [org.gradle.BuildLogger] Current dir: /Users/below/AndroidStudioProjects/HelloAndroid
15:41:58.537 [DEBUG] [org.gradle.BuildLogger] Settings file: null
15:41:58.537 [DEBUG] [org.gradle.BuildLogger] Build file: null
15:41:58.545 [DEBUG] [org.gradle.initialization.buildsrc.BuildSourceBuilder] Starting to build the build sources.
15:41:58.545 [DEBUG] [org.gradle.initialization.buildsrc.BuildSourceBuilder] Gradle source dir does not exist. We leave.
15:41:58.546 [DEBUG] [org.gradle.initialization.DefaultGradlePropertiesLoader] Found env project properties: []
15:41:58.546 [DEBUG] [org.gradle.initialization.DefaultGradlePropertiesLoader] Found system project properties: []
15:41:58.588 [DEBUG] [org.gradle.cache.internal.DefaultFileLockManager] Waiting to acquire shared lock on cp_settings remapped class cache for 9y1gfkloc4c02whxatii4koij (/Users/below/.gradle/caches/2.14.1/scripts-remapped/settings_d4ineqzg3nk24gls2s08thp3u/9y1gfkloc4c02whxatii4koij/cp_settings57408229).
15:41:58.588 [DEBUG] [org.gradle.cache.internal.DefaultFileLockManager] Lock acquired.
15:41:58.590 [DEBUG] [org.gradle.cache.internal.DefaultFileLockManager] Releasing lock on cp_settings remapped class cache for 9y1gfkloc4c02whxatii4koij (/Users/below/.gradle/caches/2.14.1/scripts-remapped/settings_d4ineqzg3nk24gls2s08thp3u/9y1gfkloc4c02whxatii4koij/cp_settings57408229).
15:41:58.606 [DEBUG] [org.gradle.cache.internal.DefaultFileLockManager] Waiting to acquire shared lock on settings remapped class cache for 9y1gfkloc4c02whxatii4koij (/Users/below/.gradle/caches/2.14.1/scripts-remapped/settings_d4ineqzg3nk24gls2s08thp3u/9y1gfkloc4c02whxatii4koij/settings57408229).
15:41:58.606 [DEBUG] [org.gradle.cache.internal.DefaultFileLockManager] Lock acquired.
15:41:58.607 [DEBUG] [org.gradle.cache.internal.DefaultFileLockManager] Releasing lock on settings remapped class cache for 9y1gfkloc4c02whxatii4koij (/Users/below/.gradle/caches/2.14.1/scripts-remapped/settings_d4ineqzg3nk24gls2s08thp3u/9y1gfkloc4c02whxatii4koij/settings57408229).
15:41:58.704 [DEBUG] [org.gradle.initialization.ScriptEvaluatingSettingsProcessor] Timing: Processing settings took: 0.157 secs
15:41:58.706 [INFO] [org.gradle.BuildLogger] Settings evaluated using settings file '/Users/below/AndroidStudioProjects/HelloAndroid/settings.gradle'.
15:41:58.827 [DEBUG] [org.gradle.model.internal.registry.DefaultModelRegistry] Project : - Transitioning model element '<root>' from state Registered to Created
15:41:58.830 [DEBUG] [org.gradle.model.internal.registry.DefaultModelRegistry] Project : - Transitioning model element '<root>' to state Discovered.
15:41:58.831 [DEBUG] [org.gradle.model.internal.registry.DefaultModelRegistry] Project : - Transitioning model element '<root>' to state Created.
15:41:58.851 [DEBUG] [org.gradle.model.internal.registry.DefaultModelRegistry] Project : - Registering model element 'tasks' (hidden = false)
15:41:58.855 [DEBUG] [org.gradle.model.internal.registry.DefaultModelRegistry] Project : - Transitioning model element 'tasks' from state Registered to Created
15:41:58.857 [DEBUG] [org.gradle.model.internal.registry.DefaultModelRegistry] Project : - Running model element 'tasks' rule action Project.<init>.tasks()
15:41:58.857 [DEBUG] [org.gradle.model.internal.registry.DefaultModelRegistry] Project : - Mutating tasks using Project.<init>.tasks()
15:41:58.858 [DEBUG] [org.gradle.model.internal.registry.DefaultModelRegistry] Project : - Transitioning model element 'tasks' to state Discovered.
15:41:58.859 [DEBUG] [org.gradle.model.internal.registry.DefaultModelRegistry] Project : - Running model element 'tasks' rule action Project.<init>.tasks()
15:41:58.859 [DEBUG] [org.gradle.model.internal.registry.DefaultModelRegistry] Project : - Mutating tasks using Project.<init>.tasks()
15:41:58.869 [DEBUG] [org.gradle.model.internal.registry.DefaultModelRegistry] Project : - Transitioning model element 'tasks' to state Created.
15:41:58.873 [DEBUG] [org.gradle.model.internal.registry.DefaultModelRegistry] Project : - Registering model element 'serviceRegistry' (hidden = true)
15:41:58.874 [DEBUG] [org.gradle.model.internal.registry.DefaultModelRegistry] Project : - Registering model element 'buildDir' (hidden = true)
15:41:58.874 [DEBUG] [org.gradle.model.internal.registry.DefaultModelRegistry] Project : - Registering model element 'projectIdentifier' (hidden = true)
15:41:58.875 [DEBUG] [org.gradle.model.internal.registry.DefaultModelRegistry] Project : - Registering model element 'extensionContainer' (hidden = true)
15:41:58.968 [DEBUG] [org.gradle.model.internal.registry.DefaultModelRegistry] Project : - Registering model element 'fileOperations' (hidden = true)
15:41:58.970 [DEBUG] [org.gradle.model.internal.registry.DefaultModelRegistry] Project : - Registering model element 'sourceDirectorySetFactory' (hidden = true)
15:41:58.970 [DEBUG] [org.gradle.model.internal.registry.DefaultModelRegistry] Project : - Registering model element 'taskFactory' (hidden = true)
15:41:58.970 [DEBUG] [org.gradle.model.internal.registry.DefaultModelRegistry] Project : - Registering model element 'instantiator' (hidden = true)
15:41:58.971 [DEBUG] [org.gradle.model.internal.registry.DefaultModelRegistry] Project : - Registering model element 'typeConverter' (hidden = true)
15:41:58.971 [DEBUG] [org.gradle.model.internal.registry.DefaultModelRegistry] Project : - Registering model element 'nodeInitializerRegistry' (hidden = true)
15:41:58.972 [DEBUG] [org.gradle.model.internal.registry.DefaultModelRegistry] Project : - Registering model element 'structBindingsStore' (hidden = true)
15:41:58.972 [DEBUG] [org.gradle.model.internal.registry.DefaultModelRegistry] Project : - Registering model element 'proxyFactory' (hidden = true)
15:41:58.972 [DEBUG] [org.gradle.model.internal.registry.DefaultModelRegistry] Project : - Registering model element 'schemaStore' (hidden = true)
15:41:58.973 [DEBUG] [org.gradle.model.internal.registry.DefaultModelRegistry] Project :app - Transitioning model element '<root>' from state Registered to Created
15:41:58.973 [DEBUG] [org.gradle.model.internal.registry.DefaultModelRegistry] Project :app - Transitioning model element '<root>' to state Discovered.
15:41:58.974 [DEBUG] [org.gradle.model.internal.registry.DefaultModelRegistry] Project :app - Transitioning model element '<root>' to state Created.
15:41:58.974 [DEBUG] [org.gradle.model.internal.registry.DefaultModelRegistry] Project :app - Registering model element 'tasks' (hidden = false)
15:41:58.974 [DEBUG] [org.gradle.model.internal.registry.DefaultModelRegistry] Project :app - Transitioning model element 'tasks' from state Registered to Created
15:41:58.975 [DEBUG] [org.gradle.model.internal.registry.DefaultModelRegistry] Project :app - Running model element 'tasks' rule action Project.<init>.tasks()
15:41:58.975 [DEBUG] [org.gradle.model.internal.registry.DefaultModelRegistry] Project :app - Mutating tasks using Project.<init>.tasks()
15:41:58.975 [DEBUG] [org.gradle.model.internal.registry.DefaultModelRegistry] Project :app - Transitioning model element 'tasks' to state Discovered.
15:41:58.975 [DEBUG] [org.gradle.model.internal.registry.DefaultModelRegistry] Project :app - Running model element 'tasks' rule action Project.<init>.tasks()
15:41:58.976 [DEBUG] [org.gradle.model.internal.registry.DefaultModelRegistry] Project :app - Mutating tasks using Project.<init>.tasks()
15:41:58.976 [DEBUG] [org.gradle.model.internal.registry.DefaultModelRegistry] Project :app - Transitioning model element 'tasks' to state Created.
15:41:58.977 [DEBUG] [org.gradle.model.internal.registry.DefaultModelRegistry] Project :app - Registering model element 'serviceRegistry' (hidden = true)
15:41:58.977 [DEBUG] [org.gradle.model.internal.registry.DefaultModelRegistry] Project :app - Registering model element 'buildDir' (hidden = true)
15:41:58.977 [DEBUG] [org.gradle.model.internal.registry.DefaultModelRegistry] Project :app - Registering model element 'projectIdentifier' (hidden = true)
15:41:58.978 [DEBUG] [org.gradle.model.internal.registry.DefaultModelRegistry] Project :app - Registering model element 'extensionContainer' (hidden = true)
15:41:58.978 [DEBUG] [org.gradle.model.internal.registry.DefaultModelRegistry] Project :app - Registering model element 'fileOperations' (hidden = true)
15:41:58.978 [DEBUG] [org.gradle.model.internal.registry.DefaultModelRegistry] Project :app - Registering model element 'sourceDirectorySetFactory' (hidden = true)
15:41:58.978 [DEBUG] [org.gradle.model.internal.registry.DefaultModelRegistry] Project :app - Registering model element 'taskFactory' (hidden = true)
15:41:58.979 [DEBUG] [org.gradle.model.internal.registry.DefaultModelRegistry] Project :app - Registering model element 'instantiator' (hidden = true)
15:41:58.979 [DEBUG] [org.gradle.model.internal.registry.DefaultModelRegistry] Project :app - Registering model element 'typeConverter' (hidden = true)
15:41:58.979 [DEBUG] [org.gradle.model.internal.registry.DefaultModelRegistry] Project :app - Registering model element 'nodeInitializerRegistry' (hidden = true)
15:41:58.980 [DEBUG] [org.gradle.model.internal.registry.DefaultModelRegistry] Project :app - Registering model element 'structBindingsStore' (hidden = true)
15:41:58.980 [DEBUG] [org.gradle.model.internal.registry.DefaultModelRegistry] Project :app - Registering model element 'proxyFactory' (hidden = true)
15:41:58.980 [DEBUG] [org.gradle.model.internal.registry.DefaultModelRegistry] Project :app - Registering model element 'schemaStore' (hidden = true)
15:41:58.981 [DEBUG] [org.gradle.initialization.ProjectPropertySettingBuildLoader] Looking for project properties from: /Users/below/AndroidStudioProjects/HelloAndroid/gradle.properties
15:41:58.981 [DEBUG] [org.gradle.initialization.ProjectPropertySettingBuildLoader] Adding project properties (if not overwritten by user properties): [org.gradle.jvmargs]
15:41:58.986 [DEBUG] [org.gradle.initialization.ProjectPropertySettingBuildLoader] Looking for project properties from: /Users/below/AndroidStudioProjects/HelloAndroid/app/gradle.properties
15:41:58.986 [DEBUG] [org.gradle.initialization.ProjectPropertySettingBuildLoader] project property file does not exists. We continue!
15:41:58.986 [INFO] [org.gradle.BuildLogger] Projects loaded. Root project using build file '/Users/below/AndroidStudioProjects/HelloAndroid/build.gradle'.
15:41:58.987 [INFO] [org.gradle.BuildLogger] Included projects: [root project 'HelloAndroid', project ':app']
15:41:59.016 [DEBUG] [org.gradle.model.internal.registry.DefaultModelRegistry] Project : - Registering model element 'tasks.init' (hidden = false)
15:41:59.017 [DEBUG] [org.gradle.model.internal.registry.DefaultModelRegistry] Project : - Registering model element 'tasks.wrapper' (hidden = false)
15:41:59.025 [DEBUG] [org.gradle.model.internal.registry.DefaultModelRegistry] Project : - Registering model element 'tasks.help' (hidden = false)
15:41:59.027 [DEBUG] [org.gradle.model.internal.registry.DefaultModelRegistry] Project : - Registering model element 'tasks.projects' (hidden = false)
15:41:59.028 [DEBUG] [org.gradle.model.internal.registry.DefaultModelRegistry] Project : - Registering model element 'tasks.tasks' (hidden = false)
15:41:59.029 [DEBUG] [org.gradle.model.internal.registry.DefaultModelRegistry] Project : - Registering model element 'tasks.properties' (hidden = false)
15:41:59.030 [DEBUG] [org.gradle.model.internal.registry.DefaultModelRegistry] Project : - Registering model element 'tasks.dependencyInsight' (hidden = false)
15:41:59.031 [DEBUG] [org.gradle.model.internal.registry.DefaultModelRegistry] Project : - Registering model element 'tasks.dependencies' (hidden = false)
15:41:59.032 [DEBUG] [org.gradle.model.internal.registry.DefaultModelRegistry] Project : - Registering model element 'tasks.buildEnvironment' (hidden = false)
15:41:59.033 [DEBUG] [org.gradle.model.internal.registry.DefaultModelRegistry] Project : - Registering model element 'tasks.components' (hidden = false)
15:41:59.034 [DEBUG] [org.gradle.model.internal.registry.DefaultModelRegistry] Project : - Registering model element 'tasks.model' (hidden = false)
15:41:59.041 [INFO] [org.gradle.configuration.project.BuildScriptProcessor] Evaluating root project 'HelloAndroid' using build file '/Users/below/AndroidStudioProjects/HelloAndroid/build.gradle'.
15:41:59.044 [DEBUG] [org.gradle.cache.internal.DefaultFileLockManager] Waiting to acquire shared lock on cp_proj remapped class cache for 5s2k5r9u4psfguk3sec0nvzd1 (/Users/below/.gradle/caches/2.14.1/scripts-remapped/build_67fqicdqbuq01j2957j29n1xl/5s2k5r9u4psfguk3sec0nvzd1/cp_proj57408229).
15:41:59.044 [DEBUG] [org.gradle.cache.internal.DefaultFileLockManager] Lock acquired.
15:41:59.045 [DEBUG] [org.gradle.cache.internal.DefaultFileLockManager] Releasing lock on cp_proj remapped class cache for 5s2k5r9u4psfguk3sec0nvzd1 (/Users/below/.gradle/caches/2.14.1/scripts-remapped/build_67fqicdqbuq01j2957j29n1xl/5s2k5r9u4psfguk3sec0nvzd1/cp_proj57408229).
15:41:59.162 [DEBUG] [org.gradle.api.internal.artifacts.mvnsettings.DefaultLocalMavenRepositoryLocator] No local repository in Settings file defined. Using default path: /Users/below/.m2/repository
15:41:59.330 [DEBUG] [org.gradle.cache.internal.DefaultFileLockManager] Waiting to acquire exclusive lock on artifact cache (/Users/below/.gradle/caches/modules-2).
15:41:59.331 [DEBUG] [org.gradle.cache.internal.DefaultFileLockManager] Lock acquired.
15:41:59.332 [DEBUG] [org.gradle.cache.internal.locklistener.DefaultFileLockContentionHandler] Starting file lock listener thread.
15:41:59.350 [DEBUG] [org.gradle.api.internal.artifacts.ivyservice.IvyLoggingAdaper] setting 'ivy.default.settings.dir' to 'jar:file:/Users/below/.gradle/wrapper/dists/gradle-2.14.1-all/8bnwg5hd3w55iofp58khbp6yv/gradle-2.14.1/lib/plugins/ivy-2.2.0.jar!/org/apache/ivy/core/settings'
15:41:59.352 [DEBUG] [org.gradle.api.internal.artifacts.ivyservice.IvyLoggingAdaper] setting 'ivy.basedir' to '/Users/below/AndroidStudioProjects/HelloAndroid/.'
15:41:59.352 [DEBUG] [org.gradle.api.internal.artifacts.ivyservice.IvyLoggingAdaper] setting 'ivy.default.conf.dir' to 'jar:file:/Users/below/.gradle/wrapper/dists/gradle-2.14.1-all/8bnwg5hd3w55iofp58khbp6yv/gradle-2.14.1/lib/plugins/ivy-2.2.0.jar!/org/apache/ivy/core/settings'
15:41:59.384 [DEBUG] [org.gradle.api.internal.artifacts.ivyservice.IvyLoggingAdaper] setting 'jna.platform.library.path' to '/usr/lib:/usr/lib'
15:41:59.384 [DEBUG] [org.gradle.api.internal.artifacts.ivyservice.IvyLoggingAdaper] setting 'java.runtime.name' to 'Java(TM) SE Runtime Environment'
15:41:59.384 [DEBUG] [org.gradle.api.internal.artifacts.ivyservice.IvyLoggingAdaper] setting 'sun.boot.library.path' to '/Library/Java/JavaVirtualMachines/jdk1.8.0_121.jdk/Contents/Home/jre/lib'
15:41:59.384 [DEBUG] [org.gradle.api.internal.artifacts.ivyservice.IvyLoggingAdaper] setting 'java.vm.version' to '25.121-b13'
15:41:59.385 [DEBUG] [org.gradle.api.internal.artifacts.ivyservice.IvyLoggingAdaper] setting 'gopherProxySet' to 'false'
15:41:59.385 [DEBUG] [org.gradle.api.internal.artifacts.ivyservice.IvyLoggingAdaper] setting 'java.vm.vendor' to 'Oracle Corporation'
15:41:59.385 [DEBUG] [org.gradle.api.internal.artifacts.ivyservice.IvyLoggingAdaper] setting 'java.vendor.url' to 'http://java.oracle.com/'
15:41:59.385 [DEBUG] [org.gradle.api.internal.artifacts.ivyservice.IvyLoggingAdaper] setting 'path.separator' to ':'
15:41:59.385 [DEBUG] [org.gradle.api.internal.artifacts.ivyservice.IvyLoggingAdaper] setting 'java.vm.name' to 'Java HotSpot(TM) 64-Bit Server VM'
15:41:59.385 [DEBUG] [org.gradle.api.internal.artifacts.ivyservice.IvyLoggingAdaper] setting 'file.encoding.pkg' to 'sun.io'
15:41:59.386 [DEBUG] [org.gradle.api.internal.artifacts.ivyservice.IvyLoggingAdaper] setting 'sun.java.launcher' to 'SUN_STANDARD'
15:41:59.386 [DEBUG] [org.gradle.api.internal.artifacts.ivyservice.IvyLoggingAdaper] setting 'user.country' to 'DE'
15:41:59.386 [DEBUG] [org.gradle.api.internal.artifacts.ivyservice.IvyLoggingAdaper] setting 'sun.os.patch.level' to 'unknown'
15:41:59.386 [DEBUG] [org.gradle.api.internal.artifacts.ivyservice.IvyLoggingAdaper] setting 'java.vm.specification.name' to 'Java Virtual Machine Specification'
15:41:59.386 [DEBUG] [org.gradle.api.internal.artifacts.ivyservice.IvyLoggingAdaper] setting 'user.dir' to '/Users/below/AndroidStudioProjects/HelloAndroid'
15:41:59.387 [DEBUG] [org.gradle.api.internal.artifacts.ivyservice.IvyLoggingAdaper] setting 'java.runtime.version' to '1.8.0_121-b13'
15:41:59.387 [DEBUG] [org.gradle.api.internal.artifacts.ivyservice.IvyLoggingAdaper] setting 'java.awt.graphicsenv' to 'sun.awt.CGraphicsEnvironment'
15:41:59.387 [DEBUG] [org.gradle.api.internal.artifacts.ivyservice.IvyLoggingAdaper] setting 'java.endorsed.dirs' to '/Library/Java/JavaVirtualMachines/jdk1.8.0_121.jdk/Contents/Home/jre/lib/endorsed'
15:41:59.387 [DEBUG] [org.gradle.api.internal.artifacts.ivyservice.IvyLoggingAdaper] setting 'os.arch' to 'x86_64'
15:41:59.387 [DEBUG] [org.gradle.api.internal.artifacts.ivyservice.IvyLoggingAdaper] setting 'java.io.tmpdir' to '/var/folders/vk/9s7n8tyn00nfp69b29wdvqz80000gn/T/'
15:41:59.388 [DEBUG] [org.gradle.api.internal.artifacts.ivyservice.IvyLoggingAdaper] setting 'line.separator' to '
'
15:41:59.388 [DEBUG] [org.gradle.api.internal.artifacts.ivyservice.IvyLoggingAdaper] setting 'org.gradle.appname' to 'gradlew'
15:41:59.388 [DEBUG] [org.gradle.api.internal.artifacts.ivyservice.IvyLoggingAdaper] setting 'java.vm.specification.vendor' to 'Oracle Corporation'
15:41:59.388 [DEBUG] [org.gradle.api.internal.artifacts.ivyservice.IvyLoggingAdaper] setting 'user.variant' to ''
15:41:59.388 [DEBUG] [org.gradle.api.internal.artifacts.ivyservice.IvyLoggingAdaper] setting 'os.name' to 'Mac OS X'
15:41:59.389 [DEBUG] [org.gradle.api.internal.artifacts.ivyservice.IvyLoggingAdaper] setting 'sun.jnu.encoding' to 'UTF-8'
15:41:59.389 [DEBUG] [org.gradle.api.internal.artifacts.ivyservice.IvyLoggingAdaper] setting 'java.library.path' to '/Users/below/Library/Java/Extensions:/Library/Java/Extensions:/Network/Library/Java/Extensions:/System/Library/Java/Extensions:/usr/lib/java:.'
15:41:59.389 [DEBUG] [org.gradle.api.internal.artifacts.ivyservice.IvyLoggingAdaper] setting 'java.specification.name' to 'Java Platform API Specification'
15:41:59.389 [DEBUG] [org.gradle.api.internal.artifacts.ivyservice.IvyLoggingAdaper] setting 'java.class.version' to '52.0'
15:41:59.389 [DEBUG] [org.gradle.api.internal.artifacts.ivyservice.IvyLoggingAdaper] setting 'sun.management.compiler' to 'HotSpot 64-Bit Tiered Compilers'
15:41:59.390 [DEBUG] [org.gradle.api.internal.artifacts.ivyservice.IvyLoggingAdaper] setting 'os.version' to '10.12.3'
15:41:59.390 [DEBUG] [org.gradle.api.internal.artifacts.ivyservice.IvyLoggingAdaper] setting 'http.nonProxyHosts' to 'local|*.local|169.254/16|*.169.254/16'
15:41:59.390 [DEBUG] [org.gradle.api.internal.artifacts.ivyservice.IvyLoggingAdaper] setting 'user.home' to '/Users/below'
15:41:59.390 [DEBUG] [org.gradle.api.internal.artifacts.ivyservice.IvyLoggingAdaper] setting 'user.timezone' to 'Europe/Berlin'
15:41:59.390 [DEBUG] [org.gradle.api.internal.artifacts.ivyservice.IvyLoggingAdaper] setting 'java.awt.printerjob' to 'sun.lwawt.macosx.CPrinterJob'
15:41:59.391 [DEBUG] [org.gradle.api.internal.artifacts.ivyservice.IvyLoggingAdaper] setting 'file.encoding' to 'UTF-8'
15:41:59.391 [DEBUG] [org.gradle.api.internal.artifacts.ivyservice.IvyLoggingAdaper] setting 'java.specification.version' to '1.8'
15:41:59.391 [DEBUG] [org.gradle.api.internal.artifacts.ivyservice.IvyLoggingAdaper] setting 'java.class.path' to '/Users/below/.gradle/wrapper/dists/gradle-2.14.1-all/8bnwg5hd3w55iofp58khbp6yv/gradle-2.14.1/lib/gradle-launcher-2.14.1.jar'
15:41:59.391 [DEBUG] [org.gradle.api.internal.artifacts.ivyservice.IvyLoggingAdaper] setting 'user.name' to 'below'
15:41:59.391 [DEBUG] [org.gradle.api.internal.artifacts.ivyservice.IvyLoggingAdaper] setting 'java.vm.specification.version' to '1.8'
15:41:59.391 [DEBUG] [org.gradle.api.internal.artifacts.ivyservice.IvyLoggingAdaper] setting 'sun.java.command' to 'org.gradle.launcher.daemon.bootstrap.GradleDaemon 2.14.1'
15:41:59.392 [DEBUG] [org.gradle.api.internal.artifacts.ivyservice.IvyLoggingAdaper] setting 'java.home' to '/Library/Java/JavaVirtualMachines/jdk1.8.0_121.jdk/Contents/Home/jre'
15:41:59.392 [DEBUG] [org.gradle.api.internal.artifacts.ivyservice.IvyLoggingAdaper] setting 'sun.arch.data.model' to '64'
15:41:59.392 [DEBUG] [org.gradle.api.internal.artifacts.ivyservice.IvyLoggingAdaper] setting 'user.language' to 'de'
15:41:59.392 [DEBUG] [org.gradle.api.internal.artifacts.ivyservice.IvyLoggingAdaper] setting 'java.specification.vendor' to 'Oracle Corporation'
15:41:59.393 [DEBUG] [org.gradle.api.internal.artifacts.ivyservice.IvyLoggingAdaper] setting 'awt.toolkit' to 'sun.lwawt.macosx.LWCToolkit'
15:41:59.393 [DEBUG] [org.gradle.api.internal.artifacts.ivyservice.IvyLoggingAdaper] setting 'java.vm.info' to 'mixed mode'
15:41:59.393 [DEBUG] [org.gradle.api.internal.artifacts.ivyservice.IvyLoggingAdaper] setting 'java.version' to '1.8.0_121'
15:41:59.393 [DEBUG] [org.gradle.api.internal.artifacts.ivyservice.IvyLoggingAdaper] setting 'java.ext.dirs' to '/Users/below/Library/Java/Extensions:/Library/Java/JavaVirtualMachines/jdk1.8.0_121.jdk/Contents/Home/jre/lib/ext:/Library/Java/Extensions:/Network/Library/Java/Extensions:/System/Library/Java/Extensions:/usr/lib/java'
15:41:59.394 [DEBUG] [org.gradle.api.internal.artifacts.ivyservice.IvyLoggingAdaper] setting 'sun.boot.class.path' to '/Library/Java/JavaVirtualMachines/jdk1.8.0_121.jdk/Contents/Home/jre/lib/resources.jar:/Library/Java/JavaVirtualMachines/jdk1.8.0_121.jdk/Contents/Home/jre/lib/rt.jar:/Library/Java/JavaVirtualMachines/jdk1.8.0_121.jdk/Contents/Home/jre/lib/sunrsasign.jar:/Library/Java/JavaVirtualMachines/jdk1.8.0_121.jdk/Contents/Home/jre/lib/jsse.jar:/Library/Java/JavaVirtualMachines/jdk1.8.0_121.jdk/Contents/Home/jre/lib/jce.jar:/Library/Java/JavaVirtualMachines/jdk1.8.0_121.jdk/Contents/Home/jre/lib/charsets.jar:/Library/Java/JavaVirtualMachines/jdk1.8.0_121.jdk/Contents/Home/jre/lib/jfr.jar:/Library/Java/JavaVirtualMachines/jdk1.8.0_121.jdk/Contents/Home/jre/classes'
15:41:59.394 [DEBUG] [org.gradle.api.internal.artifacts.ivyservice.IvyLoggingAdaper] setting 'java.vendor' to 'Oracle Corporation'
15:41:59.394 [DEBUG] [org.gradle.api.internal.artifacts.ivyservice.IvyLoggingAdaper] setting 'file.separator' to '/'
15:41:59.394 [DEBUG] [org.gradle.api.internal.artifacts.ivyservice.IvyLoggingAdaper] setting 'java.vendor.url.bug' to 'http://bugreport.sun.com/bugreport/'
15:41:59.394 [DEBUG] [org.gradle.api.internal.artifacts.ivyservice.IvyLoggingAdaper] setting 'sun.io.unicode.encoding' to 'UnicodeBig'
15:41:59.395 [DEBUG] [org.gradle.api.internal.artifacts.ivyservice.IvyLoggingAdaper] setting 'sun.cpu.endian' to 'little'
15:41:59.395 [DEBUG] [org.gradle.api.internal.artifacts.ivyservice.IvyLoggingAdaper] setting 'socksNonProxyHosts' to 'local|*.local|169.254/16|*.169.254/16'
15:41:59.395 [DEBUG] [org.gradle.api.internal.artifacts.ivyservice.IvyLoggingAdaper] setting 'ftp.nonProxyHosts' to 'local|*.local|169.254/16|*.169.254/16'
15:41:59.395 [DEBUG] [org.gradle.api.internal.artifacts.ivyservice.IvyLoggingAdaper] setting 'sun.cpu.isalist' to ''
15:41:59.411 [DEBUG] [org.gradle.api.internal.artifacts.ivyservice.resolveengine.DefaultArtifactDependencyResolver] Resolving configuration ':classpath'
15:41:59.432 [DEBUG] [org.gradle.internal.resource.transport.http.JavaSystemPropertiesProxySettings] Found java system property 'http.nonProxyHosts': local|*.local|169.254/16|*.169.254/16. Will ignore proxy settings for these hosts.
15:41:59.449 [DEBUG] [org.gradle.api.internal.artifacts.ivyservice.ivyresolve.memcache.InMemoryCachedRepositoryFactory] Creating new in-memory cache for repo 'BintrayJCenter' [22da77b0d76ea8df17298218f3ec1f87].
15:41:59.484 [DEBUG] [org.gradle.api.internal.artifacts.ivyservice.resolveengine.graph.DependencyGraphBuilder] Visiting configuration :HelloAndroid:unspecified(classpath).
15:41:59.489 [DEBUG] [org.gradle.api.internal.artifacts.ivyservice.resolveengine.graph.DependencyGraphBuilder] Visiting dependency :HelloAndroid:unspecified(classpath) -> com.android.tools.build:gradle:2.2.3(classpath)
15:41:59.493 [DEBUG] [org.gradle.api.internal.artifacts.ivyservice.resolveengine.graph.DependencyGraphBuilder] Selecting new module version com.android.tools.build:gradle:2.2.3
15:41:59.494 [DEBUG] [org.gradle.api.internal.artifacts.ivyservice.ivyresolve.RepositoryChainComponentMetaDataResolver] Attempting to resolve component for com.android.tools.build:gradle:2.2.3 using repositories [BintrayJCenter]
15:41:59.507 [DEBUG] [org.gradle.cache.internal.btree.BTreePersistentIndexedCache] Opening cache module-metadata.bin (/Users/below/.gradle/caches/modules-2/metadata-2.16/module-metadata.bin)
15:41:59.518 [DEBUG] [org.gradle.api.internal.artifacts.repositories.resolver.DefaultExternalResourceArtifactResolver] Loading https://jcenter.bintray.com/com/android/tools/build/gradle/2.2.3/gradle-2.2.3.pom
15:41:59.520 [DEBUG] [org.gradle.internal.resource.transfer.DefaultCacheAwareExternalResourceAccessor] Constructing external resource: https://jcenter.bintray.com/com/android/tools/build/gradle/2.2.3/gradle-2.2.3.pom
15:41:59.521 [DEBUG] [org.gradle.cache.internal.btree.BTreePersistentIndexedCache] Opening cache artifact-at-url.bin (/Users/below/.gradle/caches/modules-2/metadata-2.16/artifact-at-url.bin)
15:41:59.523 [DEBUG] [org.gradle.internal.resource.transport.http.HttpResourceAccessor] Constructing external resource: https://jcenter.bintray.com/com/android/tools/build/gradle/2.2.3/gradle-2.2.3.pom
15:41:59.524 [DEBUG] [org.gradle.internal.resource.transport.http.HttpClientHelper] Performing HTTP GET: https://jcenter.bintray.com/com/android/tools/build/gradle/2.2.3/gradle-2.2.3.pom
15:41:59.774 [DEBUG] [org.gradle.api.internal.artifacts.ivyservice.resolveengine.oldresult.TransientConfigurationResultsBuilder] Flushing resolved configuration data in Binary store in /private/var/folders/vk/9s7n8tyn00nfp69b29wdvqz80000gn/T/gradle2218860925573922292.bin. Wrote root :HelloAndroid:unspecified:classpath.
15:41:59.782 [DEBUG] [org.gradle.configuration.project.BuildScriptProcessor] Timing: Running the build script took 0.74 secs
15:41:59.789 [ERROR] [org.gradle.BuildExceptionReporter]
15:41:59.791 [ERROR] [org.gradle.BuildExceptionReporter] FAILURE: Build failed with an exception.
15:41:59.791 [ERROR] [org.gradle.BuildExceptionReporter]
15:41:59.791 [ERROR] [org.gradle.BuildExceptionReporter] * What went wrong:
15:41:59.791 [ERROR] [org.gradle.BuildExceptionReporter] A problem occurred configuring root project 'HelloAndroid'.
15:41:59.791 [ERROR] [org.gradle.BuildExceptionReporter] > Could not resolve all dependencies for configuration ':classpath'.
15:41:59.792 [ERROR] [org.gradle.BuildExceptionReporter] > Could not resolve com.android.tools.build:gradle:2.2.3.
15:41:59.792 [ERROR] [org.gradle.BuildExceptionReporter] Required by:
15:41:59.792 [ERROR] [org.gradle.BuildExceptionReporter] :HelloAndroid:unspecified
15:41:59.793 [ERROR] [org.gradle.BuildExceptionReporter] > Could not resolve com.android.tools.build:gradle:2.2.3.
15:41:59.793 [ERROR] [org.gradle.BuildExceptionReporter] > org.apache.http.conn.ssl.SSLConnectionSocketFactory.<init>(Ljavax/net/ssl/SSLContext;Ljavax/net/ssl/HostnameVerifier;)V
15:41:59.793 [ERROR] [org.gradle.BuildExceptionReporter]
15:41:59.794 [ERROR] [org.gradle.BuildExceptionReporter] * Exception is:
15:41:59.795 [ERROR] [org.gradle.BuildExceptionReporter] org.gradle.api.ProjectConfigurationException: A problem occurred configuring root project 'HelloAndroid'.
15:41:59.795 [ERROR] [org.gradle.BuildExceptionReporter] at org.gradle.configuration.project.LifecycleProjectEvaluator.addConfigurationFailure(LifecycleProjectEvaluator.java:79)
15:41:59.795 [ERROR] [org.gradle.BuildExceptionReporter] at org.gradle.configuration.project.LifecycleProjectEvaluator.evaluate(LifecycleProjectEvaluator.java:57)
15:41:59.796 [ERROR] [org.gradle.BuildExceptionReporter] at org.gradle.api.internal.project.AbstractProject.evaluate(AbstractProject.java:540)
15:41:59.796 [ERROR] [org.gradle.BuildExceptionReporter] at org.gradle.api.internal.project.AbstractProject.evaluate(AbstractProject.java:93)
15:41:59.796 [ERROR] [org.gradle.BuildExceptionReporter] at org.gradle.execution.TaskPathProjectEvaluator.configureHierarchy(TaskPathProjectEvaluator.java:42)
15:41:59.796 [ERROR] [org.gradle.BuildExceptionReporter] at org.gradle.configuration.DefaultBuildConfigurer.configure(DefaultBuildConfigurer.java:35)
15:41:59.796 [ERROR] [org.gradle.BuildExceptionReporter] at org.gradle.initialization.DefaultGradleLauncher$2.run(DefaultGradleLauncher.java:124)
15:41:59.797 [ERROR] [org.gradle.BuildExceptionReporter] at org.gradle.internal.Factories$1.create(Factories.java:22)
15:41:59.797 [ERROR] [org.gradle.BuildExceptionReporter] at org.gradle.internal.progress.DefaultBuildOperationExecutor.run(DefaultBuildOperationExecutor.java:91)
15:41:59.797 [ERROR] [org.gradle.BuildExceptionReporter] at org.gradle.internal.progress.DefaultBuildOperationExecutor.run(DefaultBuildOperationExecutor.java:53)
15:41:59.797 [ERROR] [org.gradle.BuildExceptionReporter] at org.gradle.initialization.DefaultGradleLauncher.doBuildStages(DefaultGradleLauncher.java:121)
15:41:59.797 [ERROR] [org.gradle.BuildExceptionReporter] at org.gradle.initialization.DefaultGradleLauncher.access$200(DefaultGradleLauncher.java:32)
15:41:59.798 [ERROR] [org.gradle.BuildExceptionReporter] at org.gradle.initialization.DefaultGradleLauncher$1.create(DefaultGradleLauncher.java:98)
15:41:59.798 [ERROR] [org.gradle.BuildExceptionReporter] at org.gradle.initialization.DefaultGradleLauncher$1.create(DefaultGradleLauncher.java:92)
15:41:59.798 [ERROR] [org.gradle.BuildExceptionReporter] at org.gradle.internal.progress.DefaultBuildOperationExecutor.run(DefaultBuildOperationExecutor.java:91)
15:41:59.798 [ERROR] [org.gradle.BuildExceptionReporter] at org.gradle.internal.progress.DefaultBuildOperationExecutor.run(DefaultBuildOperationExecutor.java:63)
15:41:59.798 [ERROR] [org.gradle.BuildExceptionReporter] at org.gradle.initialization.DefaultGradleLauncher.doBuild(DefaultGradleLauncher.java:92)
15:41:59.798 [ERROR] [org.gradle.BuildExceptionReporter] at org.gradle.initialization.DefaultGradleLauncher.run(DefaultGradleLauncher.java:83)
15:41:59.799 [ERROR] [org.gradle.BuildExceptionReporter] at org.gradle.launcher.exec.InProcessBuildActionExecuter$DefaultBuildController.run(InProcessBuildActionExecuter.java:99)
15:41:59.799 [ERROR] [org.gradle.BuildExceptionReporter] at org.gradle.tooling.internal.provider.ExecuteBuildActionRunner.run(ExecuteBuildActionRunner.java:28)
15:41:59.799 [ERROR] [org.gradle.BuildExceptionReporter] at org.gradle.launcher.exec.ChainingBuildActionRunner.run(ChainingBuildActionRunner.java:35)
15:41:59.799 [ERROR] [org.gradle.BuildExceptionReporter] at org.gradle.launcher.exec.InProcessBuildActionExecuter.execute(InProcessBuildActionExecuter.java:48)
15:41:59.799 [ERROR] [org.gradle.BuildExceptionReporter] at org.gradle.launcher.exec.InProcessBuildActionExecuter.execute(InProcessBuildActionExecuter.java:30)
15:41:59.799 [ERROR] [org.gradle.BuildExceptionReporter] at org.gradle.launcher.exec.ContinuousBuildActionExecuter.execute(ContinuousBuildActionExecuter.java:81)
15:41:59.800 [ERROR] [org.gradle.BuildExceptionReporter] at org.gradle.launcher.exec.ContinuousBuildActionExecuter.execute(ContinuousBuildActionExecuter.java:46)
15:41:59.800 [ERROR] [org.gradle.BuildExceptionReporter] at org.gradle.launcher.daemon.server.exec.ExecuteBuild.doBuild(ExecuteBuild.java:52)
15:41:59.800 [ERROR] [org.gradle.BuildExceptionReporter] at org.gradle.launcher.daemon.server.exec.BuildCommandOnly.execute(BuildCommandOnly.java:36)
15:41:59.800 [ERROR] [org.gradle.BuildExceptionReporter] at org.gradle.launcher.daemon.server.api.DaemonCommandExecution.proceed(DaemonCommandExecution.java:120)
15:41:59.800 [ERROR] [org.gradle.BuildExceptionReporter] at org.gradle.launcher.daemon.server.exec.WatchForDisconnection.execute(WatchForDisconnection.java:37)
15:41:59.801 [ERROR] [org.gradle.BuildExceptionReporter] at org.gradle.launcher.daemon.server.api.DaemonCommandExecution.proceed(DaemonCommandExecution.java:120)
15:41:59.801 [ERROR] [org.gradle.BuildExceptionReporter] at org.gradle.launcher.daemon.server.exec.ResetDeprecationLogger.execute(ResetDeprecationLogger.java:26)
15:41:59.801 [ERROR] [org.gradle.BuildExceptionReporter] at org.gradle.launcher.daemon.server.api.DaemonCommandExecution.proceed(DaemonCommandExecution.java:120)
15:41:59.801 [ERROR] [org.gradle.BuildExceptionReporter] at org.gradle.launcher.daemon.server.exec.RequestStopIfSingleUsedDaemon.execute(RequestStopIfSingleUsedDaemon.java:34)
15:41:59.801 [ERROR] [org.gradle.BuildExceptionReporter] at org.gradle.launcher.daemon.server.api.DaemonCommandExecution.proceed(DaemonCommandExecution.java:120)
15:41:59.801 [ERROR] [org.gradle.BuildExceptionReporter] at org.gradle.launcher.daemon.server.exec.ForwardClientInput$2.call(ForwardClientInput.java:74)
15:41:59.801 [ERROR] [org.gradle.BuildExceptionReporter] at org.gradle.launcher.daemon.server.exec.ForwardClientInput$2.call(ForwardClientInput.java:72)
15:41:59.801 [ERROR] [org.gradle.BuildExceptionReporter] at org.gradle.util.Swapper.swap(Swapper.java:38)
15:41:59.802 [ERROR] [org.gradle.BuildExceptionReporter] at org.gradle.launcher.daemon.server.exec.ForwardClientInput.execute(ForwardClientInput.java:72)
15:41:59.802 [ERROR] [org.gradle.BuildExceptionReporter] at org.gradle.launcher.daemon.server.api.DaemonCommandExecution.proceed(DaemonCommandExecution.java:120)
15:41:59.802 [ERROR] [org.gradle.BuildExceptionReporter] at org.gradle.launcher.daemon.server.health.DaemonHealthTracker.execute(DaemonHealthTracker.java:40)
15:41:59.802 [ERROR] [org.gradle.BuildExceptionReporter] at org.gradle.launcher.daemon.server.api.DaemonCommandExecution.proceed(DaemonCommandExecution.java:120)
15:41:59.802 [ERROR] [org.gradle.BuildExceptionReporter] at org.gradle.launcher.daemon.server.exec.LogToClient.doBuild(LogToClient.java:60)
15:41:59.802 [ERROR] [org.gradle.BuildExceptionReporter] at org.gradle.launcher.daemon.server.exec.BuildCommandOnly.execute(BuildCommandOnly.java:36)
15:41:59.803 [ERROR] [org.gradle.BuildExceptionReporter] at org.gradle.launcher.daemon.server.api.DaemonCommandExecution.proceed(DaemonCommandExecution.java:120)
15:41:59.803 [ERROR] [org.gradle.BuildExceptionReporter] at org.gradle.launcher.daemon.server.exec.EstablishBuildEnvironment.doBuild(EstablishBuildEnvironment.java:72)
15:41:59.803 [ERROR] [org.gradle.BuildExceptionReporter] at org.gradle.launcher.daemon.server.exec.BuildCommandOnly.execute(BuildCommandOnly.java:36)
15:41:59.803 [ERROR] [org.gradle.BuildExceptionReporter] at org.gradle.launcher.daemon.server.api.DaemonCommandExecution.proceed(DaemonCommandExecution.java:120)
15:41:59.803 [ERROR] [org.gradle.BuildExceptionReporter] at org.gradle.launcher.daemon.server.health.HintGCAfterBuild.execute(HintGCAfterBuild.java:41)
15:41:59.804 [ERROR] [org.gradle.BuildExceptionReporter] at org.gradle.launcher.daemon.server.api.DaemonCommandExecution.proceed(DaemonCommandExecution.java:120)
15:41:59.804 [ERROR] [org.gradle.BuildExceptionReporter] at org.gradle.launcher.daemon.server.exec.StartBuildOrRespondWithBusy$1.run(StartBuildOrRespondWithBusy.java:50)
15:41:59.804 [ERROR] [org.gradle.BuildExceptionReporter] at org.gradle.launcher.daemon.server.DaemonStateCoordinator$1.run(DaemonStateCoordinator.java:237)
15:41:59.804 [ERROR] [org.gradle.BuildExceptionReporter] at org.gradle.internal.concurrent.ExecutorPolicy$CatchAndRecordFailures.onExecute(ExecutorPolicy.java:54)
15:41:59.804 [ERROR] [org.gradle.BuildExceptionReporter] at org.gradle.internal.concurrent.StoppableExecutorImpl$1.run(StoppableExecutorImpl.java:40)
15:41:59.805 [ERROR] [org.gradle.BuildExceptionReporter] Caused by: org.gradle.api.artifacts.ResolveException: Could not resolve all dependencies for configuration ':classpath'.
15:41:59.805 [ERROR] [org.gradle.BuildExceptionReporter] at org.gradle.api.internal.artifacts.ivyservice.DefaultLenientConfiguration.rethrowFailure(DefaultLenientConfiguration.java:62)
15:41:59.805 [ERROR] [org.gradle.BuildExceptionReporter] at org.gradle.api.internal.artifacts.ivyservice.DefaultResolvedConfiguration.rethrowFailure(DefaultResolvedConfiguration.java:36)
15:41:59.806 [ERROR] [org.gradle.BuildExceptionReporter] at org.gradle.api.internal.artifacts.ivyservice.SelfResolvingDependencyConfigurationResolver$FilesAggregatingResolvedConfiguration.rethrowFailure(SelfResolvingDependencyConfigurationResolver.java:112)
15:41:59.806 [ERROR] [org.gradle.BuildExceptionReporter] at org.gradle.api.internal.artifacts.ivyservice.ErrorHandlingConfigurationResolver$ErrorHandlingResolvedConfiguration.rethrowFailure(ErrorHandlingConfigurationResolver.java:189)
15:41:59.806 [ERROR] [org.gradle.BuildExceptionReporter] at org.gradle.api.internal.artifacts.configurations.DefaultConfiguration$ConfigurationFileCollection.getFiles(DefaultConfiguration.java:669)
15:41:59.806 [ERROR] [org.gradle.BuildExceptionReporter] at org.gradle.api.internal.artifacts.configurations.DefaultConfiguration.getFiles(DefaultConfiguration.java:293)
15:41:59.806 [ERROR] [org.gradle.BuildExceptionReporter] at org.gradle.api.internal.artifacts.configurations.DefaultConfiguration_Decorated.getFiles(Unknown Source)
15:41:59.807 [ERROR] [org.gradle.BuildExceptionReporter] at org.gradle.api.internal.initialization.DefaultScriptHandler.getScriptClassPath(DefaultScriptHandler.java:69)
15:41:59.807 [ERROR] [org.gradle.BuildExceptionReporter] at org.gradle.plugin.use.internal.DefaultPluginRequestApplicator.defineScriptHandlerClassScope(DefaultPluginRequestApplicator.java:186)
15:41:59.807 [ERROR] [org.gradle.BuildExceptionReporter] at org.gradle.plugin.use.internal.DefaultPluginRequestApplicator.applyPlugins(DefaultPluginRequestApplicator.java:75)
15:41:59.807 [ERROR] [org.gradle.BuildExceptionReporter] at org.gradle.configuration.DefaultScriptPluginFactory$ScriptPluginImpl.apply(DefaultScriptPluginFactory.java:157)
15:41:59.808 [ERROR] [org.gradle.BuildExceptionReporter] at org.gradle.configuration.project.BuildScriptProcessor.execute(BuildScriptProcessor.java:38)
15:41:59.808 [ERROR] [org.gradle.BuildExceptionReporter] at org.gradle.configuration.project.BuildScriptProcessor.execute(BuildScriptProcessor.java:25)
15:41:59.808 [ERROR] [org.gradle.BuildExceptionReporter] at org.gradle.configuration.project.ConfigureActionsProjectEvaluator.evaluate(ConfigureActionsProjectEvaluator.java:34)
15:41:59.808 [ERROR] [org.gradle.BuildExceptionReporter] at org.gradle.configuration.project.LifecycleProjectEvaluator.evaluate(LifecycleProjectEvaluator.java:55)
15:41:59.808 [ERROR] [org.gradle.BuildExceptionReporter] ... 51 more
15:41:59.809 [ERROR] [org.gradle.BuildExceptionReporter] Caused by: org.gradle.internal.resolve.ModuleVersionResolveException: Could not resolve com.android.tools.build:gradle:2.2.3.
15:41:59.809 [ERROR] [org.gradle.BuildExceptionReporter] Required by:
15:41:59.809 [ERROR] [org.gradle.BuildExceptionReporter] :HelloAndroid:unspecified
15:41:59.810 [ERROR] [org.gradle.BuildExceptionReporter] at org.gradle.api.internal.artifacts.ivyservice.ivyresolve.RepositoryChainComponentMetaDataResolver.resolveModule(RepositoryChainComponentMetaDataResolver.java:83)
15:41:59.810 [ERROR] [org.gradle.BuildExceptionReporter] at org.gradle.api.internal.artifacts.ivyservice.ivyresolve.RepositoryChainComponentMetaDataResolver.resolve(RepositoryChainComponentMetaDataResolver.java:59)
15:41:59.810 [ERROR] [org.gradle.BuildExceptionReporter] at org.gradle.api.internal.artifacts.ivyservice.resolveengine.ComponentResolversChain$ComponentMetaDataResolverChain.resolve(ComponentResolversChain.java:80)
15:41:59.810 [ERROR] [org.gradle.BuildExceptionReporter] at org.gradle.api.internal.artifacts.ivyservice.clientmodule.ClientModuleResolver.resolve(ClientModuleResolver.java:44)
15:41:59.810 [ERROR] [org.gradle.BuildExceptionReporter] at org.gradle.api.internal.artifacts.ivyservice.resolveengine.graph.DependencyGraphBuilder$ModuleVersionResolveState.resolve(DependencyGraphBuilder.java:564)
15:41:59.811 [ERROR] [org.gradle.BuildExceptionReporter] at org.gradle.api.internal.artifacts.ivyservice.resolveengine.graph.DependencyGraphBuilder$ModuleVersionResolveState.getMetaData(DependencyGraphBuilder.java:574)
15:41:59.811 [ERROR] [org.gradle.BuildExceptionReporter] at org.gradle.api.internal.artifacts.ivyservice.resolveengine.graph.DependencyGraphBuilder$DependencyEdge.calculateTargetConfigurations(DependencyGraphBuilder.java:260)
15:41:59.811 [ERROR] [org.gradle.BuildExceptionReporter] at org.gradle.api.internal.artifacts.ivyservice.resolveengine.graph.DependencyGraphBuilder$DependencyEdge.attachToTargetConfigurations(DependencyGraphBuilder.java:234)
15:41:59.811 [ERROR] [org.gradle.BuildExceptionReporter] at org.gradle.api.internal.artifacts.ivyservice.resolveengine.graph.DependencyGraphBuilder.traverseGraph(DependencyGraphBuilder.java:141)
15:41:59.812 [ERROR] [org.gradle.BuildExceptionReporter] at org.gradle.api.internal.artifacts.ivyservice.resolveengine.graph.DependencyGraphBuilder.resolve(DependencyGraphBuilder.java:79)
15:41:59.812 [ERROR] [org.gradle.BuildExceptionReporter] at org.gradle.api.internal.artifacts.ivyservice.resolveengine.DefaultArtifactDependencyResolver$1.execute(DefaultArtifactDependencyResolver.java:90)
15:41:59.812 [ERROR] [org.gradle.BuildExceptionReporter] at org.gradle.api.internal.artifacts.ivyservice.resolveengine.DefaultArtifactDependencyResolver$1.execute(DefaultArtifactDependencyResolver.java:80)
15:41:59.812 [ERROR] [org.gradle.BuildExceptionReporter] at org.gradle.internal.Transformers$4.transform(Transformers.java:169)
15:41:59.812 [ERROR] [org.gradle.BuildExceptionReporter] at org.gradle.api.internal.artifacts.ivyservice.DefaultIvyContextManager.withIvy(DefaultIvyContextManager.java:61)
15:41:59.813 [ERROR] [org.gradle.BuildExceptionReporter] at org.gradle.api.internal.artifacts.ivyservice.DefaultIvyContextManager.withIvy(DefaultIvyContextManager.java:39)
15:41:59.813 [ERROR] [org.gradle.BuildExceptionReporter] at org.gradle.api.internal.artifacts.ivyservice.resolveengine.DefaultArtifactDependencyResolver.resolve(DefaultArtifactDependencyResolver.java:80)
15:41:59.813 [ERROR] [org.gradle.BuildExceptionReporter] at org.gradle.api.internal.artifacts.ivyservice.CacheLockingArtifactDependencyResolver$1.run(CacheLockingArtifactDependencyResolver.java:41)
15:41:59.813 [ERROR] [org.gradle.BuildExceptionReporter] at org.gradle.internal.Factories$1.create(Factories.java:22)
15:41:59.814 [ERROR] [org.gradle.BuildExceptionReporter] at org.gradle.cache.internal.DefaultCacheAccess.useCache(DefaultCacheAccess.java:192)
15:41:59.814 [ERROR] [org.gradle.BuildExceptionReporter] at org.gradle.cache.internal.DefaultCacheAccess.useCache(DefaultCacheAccess.java:175)
15:41:59.814 [ERROR] [org.gradle.BuildExceptionReporter] at org.gradle.cache.internal.DefaultPersistentDirectoryStore.useCache(DefaultPersistentDirectoryStore.java:106)
15:41:59.814 [ERROR] [org.gradle.BuildExceptionReporter] at org.gradle.cache.internal.DefaultCacheFactory$ReferenceTrackingCache.useCache(DefaultCacheFactory.java:187)
15:41:59.814 [ERROR] [org.gradle.BuildExceptionReporter] at org.gradle.api.internal.artifacts.ivyservice.DefaultCacheLockingManager.useCache(DefaultCacheLockingManager.java:64)
15:41:59.815 [ERROR] [org.gradle.BuildExceptionReporter] at org.gradle.api.internal.artifacts.ivyservice.CacheLockingArtifactDependencyResolver.resolve(CacheLockingArtifactDependencyResolver.java:39)
15:41:59.815 [ERROR] [org.gradle.BuildExceptionReporter] at org.gradle.api.internal.artifacts.ivyservice.DefaultConfigurationResolver.resolve(DefaultConfigurationResolver.java:91)
15:41:59.815 [ERROR] [org.gradle.BuildExceptionReporter] at org.gradle.api.internal.artifacts.ivyservice.SelfResolvingDependencyConfigurationResolver.resolve(SelfResolvingDependencyConfigurationResolver.java:40)
15:41:59.815 [ERROR] [org.gradle.BuildExceptionReporter] at org.gradle.api.internal.artifacts.ivyservice.ShortCircuitEmptyConfigurationResolver.resolve(ShortCircuitEmptyConfigurationResolver.java:52)
15:41:59.816 [ERROR] [org.gradle.BuildExceptionReporter] at org.gradle.api.internal.artifacts.ivyservice.ErrorHandlingConfigurationResolver.resolve(ErrorHandlingConfigurationResolver.java:43)
15:41:59.816 [ERROR] [org.gradle.BuildExceptionReporter] at org.gradle.api.internal.artifacts.configurations.DefaultConfiguration.resolveGraphIfRequired(DefaultConfiguration.java:372)
15:41:59.817 [ERROR] [org.gradle.BuildExceptionReporter] at org.gradle.api.internal.artifacts.configurations.DefaultConfiguration.resolveNow(DefaultConfiguration.java:347)
15:41:59.817 [ERROR] [org.gradle.BuildExceptionReporter] at org.gradle.api.internal.artifacts.configurations.DefaultConfiguration.getResolvedConfiguration(DefaultConfiguration.java:340)
15:41:59.818 [ERROR] [org.gradle.BuildExceptionReporter] at org.gradle.api.internal.artifacts.configurations.DefaultConfiguration_Decorated.getResolvedConfiguration(Unknown Source)
15:41:59.818 [ERROR] [org.gradle.BuildExceptionReporter] at org.gradle.api.internal.artifacts.configurations.DefaultConfiguration$ConfigurationFileCollection.getFiles(DefaultConfiguration.java:667)
15:41:59.819 [ERROR] [org.gradle.BuildExceptionReporter] ... 61 more
15:41:59.820 [ERROR] [org.gradle.BuildExceptionReporter] Caused by: org.gradle.internal.resolve.ModuleVersionResolveException: Could not resolve com.android.tools.build:gradle:2.2.3.
15:41:59.820 [ERROR] [org.gradle.BuildExceptionReporter] at org.gradle.api.internal.artifacts.ivyservice.ivyresolve.ErrorHandlingModuleComponentRepository$ErrorHandlingModuleComponentRepositoryAccess.resolveComponentMetaData(ErrorHandlingModuleComponentRepository.java:91)
15:41:59.820 [ERROR] [org.gradle.BuildExceptionReporter] at org.gradle.api.internal.artifacts.ivyservice.ivyresolve.ComponentMetaDataResolveState.process(ComponentMetaDataResolveState.java:66)
15:41:59.821 [ERROR] [org.gradle.BuildExceptionReporter] at org.gradle.api.internal.artifacts.ivyservice.ivyresolve.ComponentMetaDataResolveState.resolve(ComponentMetaDataResolveState.java:58)
15:41:59.822 [ERROR] [org.gradle.BuildExceptionReporter] at org.gradle.api.internal.artifacts.ivyservice.ivyresolve.RepositoryChainComponentMetaDataResolver.findBestMatch(RepositoryChainComponentMetaDataResolver.java:116)
15:41:59.822 [ERROR] [org.gradle.BuildExceptionReporter] at org.gradle.api.internal.artifacts.ivyservice.ivyresolve.RepositoryChainComponentMetaDataResolver.findBestMatch(RepositoryChainComponentMetaDataResolver.java:99)
15:41:59.822 [ERROR] [org.gradle.BuildExceptionReporter] at org.gradle.api.internal.artifacts.ivyservice.ivyresolve.RepositoryChainComponentMetaDataResolver.resolveModule(RepositoryChainComponentMetaDataResolver.java:72)
15:41:59.823 [ERROR] [org.gradle.BuildExceptionReporter] ... 93 more
15:41:59.823 [ERROR] [org.gradle.BuildExceptionReporter] Caused by: java.lang.NoSuchMethodError: org.apache.http.conn.ssl.SSLConnectionSocketFactory.<init>(Ljavax/net/ssl/SSLContext;Ljavax/net/ssl/HostnameVerifier;)V
15:41:59.823 [ERROR] [org.gradle.BuildExceptionReporter] at org.gradle.internal.resource.transport.http.HttpClientConfigurer.configureSslSocketConnectionFactory(HttpClientConfigurer.java:78)
15:41:59.824 [ERROR] [org.gradle.BuildExceptionReporter] at org.gradle.internal.resource.transport.http.HttpClientConfigurer.configure(HttpClientConfigurer.java:69)
15:41:59.824 [ERROR] [org.gradle.BuildExceptionReporter] at org.gradle.internal.resource.transport.http.HttpClientHelper.getClient(HttpClientHelper.java:123)
15:41:59.825 [ERROR] [org.gradle.BuildExceptionReporter] at org.gradle.internal.resource.transport.http.HttpClientHelper.performHttpRequest(HttpClientHelper.java:102)
15:41:59.825 [ERROR] [org.gradle.BuildExceptionReporter] at org.gradle.internal.resource.transport.http.HttpClientHelper.executeGetOrHead(HttpClientHelper.java:79)
15:41:59.825 [ERROR] [org.gradle.BuildExceptionReporter] at org.gradle.internal.resource.transport.http.HttpClientHelper.performRequest(HttpClientHelper.java:70)
15:41:59.825 [ERROR] [org.gradle.BuildExceptionReporter] at org.gradle.internal.resource.transport.http.HttpClientHelper.performRawGet(HttpClientHelper.java:58)
15:41:59.825 [ERROR] [org.gradle.BuildExceptionReporter] at org.gradle.internal.resource.transport.http.HttpClientHelper.performGet(HttpClientHelper.java:62)
15:41:59.826 [ERROR] [org.gradle.BuildExceptionReporter] at org.gradle.internal.resource.transport.http.HttpResourceAccessor.openResource(HttpResourceAccessor.java:51)
15:41:59.826 [ERROR] [org.gradle.BuildExceptionReporter] at org.gradle.internal.resource.transport.http.HttpResourceAccessor.openResource(HttpResourceAccessor.java:34)
15:41:59.826 [ERROR] [org.gradle.BuildExceptionReporter] at org.gradle.internal.resource.transfer.DefaultExternalResourceConnector.openResource(DefaultExternalResourceConnector.java:56)
15:41:59.827 [ERROR] [org.gradle.BuildExceptionReporter] at org.gradle.internal.resource.transfer.ProgressLoggingExternalResourceAccessor.openResource(ProgressLoggingExternalResourceAccessor.java:36)
15:41:59.827 [ERROR] [org.gradle.BuildExceptionReporter] at org.gradle.internal.resource.transport.DefaultExternalResourceRepository.getResource(DefaultExternalResourceRepository.java:63)
15:41:59.827 [ERROR] [org.gradle.BuildExceptionReporter] at org.gradle.internal.resource.transfer.DefaultCacheAwareExternalResourceAccessor.getResource(DefaultCacheAwareExternalResourceAccessor.java:76)
15:41:59.827 [ERROR] [org.gradle.BuildExceptionReporter] at org.gradle.api.internal.artifacts.repositories.resolver.DefaultExternalResourceArtifactResolver.downloadStaticResource(DefaultExternalResourceArtifactResolver.java:86)
15:41:59.827 [ERROR] [org.gradle.BuildExceptionReporter] at org.gradle.api.internal.artifacts.repositories.resolver.DefaultExternalResourceArtifactResolver.resolveArtifact(DefaultExternalResourceArtifactResolver.java:54)
15:41:59.828 [ERROR] [org.gradle.BuildExceptionReporter] at org.gradle.api.internal.artifacts.repositories.resolver.ExternalResourceResolver.parseMetaDataFromArtifact(ExternalResourceResolver.java:164)
15:41:59.828 [ERROR] [org.gradle.BuildExceptionReporter] at org.gradle.api.internal.artifacts.repositories.resolver.ExternalResourceResolver.resolveStaticDependency(ExternalResourceResolver.java:143)
15:41:59.828 [ERROR] [org.gradle.BuildExceptionReporter] at org.gradle.api.internal.artifacts.repositories.resolver.MavenResolver.doResolveComponentMetaData(MavenResolver.java:93)
15:41:59.828 [ERROR] [org.gradle.BuildExceptionReporter] at org.gradle.api.internal.artifacts.repositories.resolver.ExternalResourceResolver$RemoteRepositoryAccess.resolveComponentMetaData(ExternalResourceResolver.java:409)
15:41:59.829 [ERROR] [org.gradle.BuildExceptionReporter] at org.gradle.api.internal.artifacts.ivyservice.ivyresolve.CacheLockReleasingModuleComponentsRepository$LockReleasingRepositoryAccess$2.run(CacheLockReleasingModuleComponentsRepository.java:71)
15:41:59.829 [ERROR] [org.gradle.BuildExceptionReporter] at org.gradle.internal.Factories$1.create(Factories.java:22)
15:41:59.829 [ERROR] [org.gradle.BuildExceptionReporter] at org.gradle.cache.internal.DefaultCacheAccess.longRunningOperation(DefaultCacheAccess.java:242)
15:41:59.829 [ERROR] [org.gradle.BuildExceptionReporter] at org.gradle.cache.internal.DefaultCacheAccess.longRunningOperation(DefaultCacheAccess.java:313)
15:41:59.829 [ERROR] [org.gradle.BuildExceptionReporter] at org.gradle.cache.internal.DefaultPersistentDirectoryStore.longRunningOperation(DefaultPersistentDirectoryStore.java:114)
15:41:59.829 [ERROR] [org.gradle.BuildExceptionReporter] at org.gradle.cache.internal.DefaultCacheFactory$ReferenceTrackingCache.longRunningOperation(DefaultCacheFactory.java:179)
15:41:59.830 [ERROR] [org.gradle.BuildExceptionReporter] at org.gradle.api.internal.artifacts.ivyservice.DefaultCacheLockingManager.longRunningOperation(DefaultCacheLockingManager.java:56)
15:41:59.830 [ERROR] [org.gradle.BuildExceptionReporter] at org.gradle.api.internal.artifacts.ivyservice.ivyresolve.CacheLockReleasingModuleComponentsRepository$LockReleasingRepositoryAccess.resolveComponentMetaData(CacheLockReleasingModuleComponentsRepository.java:69)
15:41:59.830 [ERROR] [org.gradle.BuildExceptionReporter] at org.gradle.api.internal.artifacts.ivyservice.ivyresolve.CachingModuleComponentRepository$ResolveAndCacheRepositoryAccess.resolveComponentMetaData(CachingModuleComponentRepository.java:297)
15:41:59.830 [ERROR] [org.gradle.BuildExceptionReporter] at org.gradle.api.internal.artifacts.ivyservice.ivyresolve.BaseModuleComponentRepositoryAccess.resolveComponentMetaData(BaseModuleComponentRepositoryAccess.java:42)
15:41:59.830 [ERROR] [org.gradle.BuildExceptionReporter] at org.gradle.api.internal.artifacts.ivyservice.ivyresolve.memcache.InMemoryCachedModuleComponentRepository$CachedAccess.resolveComponentMetaData(InMemoryCachedModuleComponentRepository.java:75)
15:41:59.830 [ERROR] [org.gradle.BuildExceptionReporter] at org.gradle.api.internal.artifacts.ivyservice.ivyresolve.ErrorHandlingModuleComponentRepository$ErrorHandlingModuleComponentRepositoryAccess.resolveComponentMetaData(ErrorHandlingModuleComponentRepository.java:89)
15:41:59.831 [ERROR] [org.gradle.BuildExceptionReporter] ... 98 more
15:41:59.831 [ERROR] [org.gradle.BuildExceptionReporter]
15:41:59.831 [LIFECYCLE] [org.gradle.BuildResultLogger]
15:41:59.831 [LIFECYCLE] [org.gradle.BuildResultLogger] BUILD FAILED
15:41:59.831 [LIFECYCLE] [org.gradle.BuildResultLogger]
15:41:59.832 [LIFECYCLE] [org.gradle.BuildResultLogger] Total time: 3.93 secs
15:41:59.834 [DEBUG] [org.gradle.api.internal.artifacts.ivyservice.ivyresolve.memcache.InMemoryCachedRepositoryFactory] In-memory dependency metadata cache closed. Repos cached: 1, cache instances: 1, modules served from cache: 0, artifacts: 0
15:41:59.834 [DEBUG] [org.gradle.cache.internal.DefaultCacheAccess] Cache Generated Gradle JARs cache (/Users/below/.gradle/caches/2.14.1/generated-gradle-jars) was closed 0 times.
15:41:59.835 [DEBUG] [org.gradle.cache.internal.btree.BTreePersistentIndexedCache] Closing cache artifact-at-url.bin (/Users/below/.gradle/caches/modules-2/metadata-2.16/artifact-at-url.bin)
15:41:59.835 [DEBUG] [org.gradle.cache.internal.btree.BTreePersistentIndexedCache] Closing cache module-metadata.bin (/Users/below/.gradle/caches/modules-2/metadata-2.16/module-metadata.bin)
15:41:59.836 [DEBUG] [org.gradle.cache.internal.DefaultFileLockManager] Releasing lock on artifact cache (/Users/below/.gradle/caches/modules-2).
15:41:59.836 [DEBUG] [org.gradle.api.internal.artifacts.ivyservice.resolveengine.store.CachedStoreFactory] Resolution result cache closed. Cache reads: 0, disk reads: 0 (avg: 0.0 secs, total: 0.0 secs)
15:41:59.837 [DEBUG] [org.gradle.api.internal.artifacts.ivyservice.resolveengine.store.CachedStoreFactory] Resolution result cache closed. Cache reads: 0, disk reads: 0 (avg: 0.0 secs, total: 0.0 secs)
15:41:59.838 [DEBUG] [org.gradle.api.internal.artifacts.ivyservice.resolveengine.store.ResolutionResultsStoreFactory] Deleted 2 resolution results binary files in 0.002 secs
15:41:59.838 [DEBUG] [org.gradle.cache.internal.DefaultCacheAccess] Cache Plugin Resolution Cache (/Users/below/.gradle/caches/2.14.1/plugin-resolution) was closed 0 times.
15:41:59.839 [DEBUG] [org.gradle.launcher.daemon.server.exec.ExecuteBuild] The daemon has finished executing the build.
15:41:59.987 [DEBUG] [org.gradle.launcher.daemon.client.DaemonClientInputForwarder] Dispatching close input message: org.gradle.launcher.daemon.protocol.CloseInput@5d65b65b
15:41:59.987 [DEBUG] [org.gradle.launcher.daemon.client.DaemonClientConnection] thread 19: dispatching class org.gradle.launcher.daemon.protocol.CloseInput
15:41:59.988 [INFO] [org.gradle.launcher.daemon.client.DaemonClient] Received result Failure[value=org.gradle.initialization.ReportedException: org.gradle.internal.exceptions.LocationAwareException: A problem occurred configuring root project 'HelloAndroid'.] from daemon DaemonInfo{pid=5992, address=[15865a0a-481e-4b9a-960b-77b2790cd599 port:53813, addresses:[/0:0:0:0:0:0:0:1, /127.0.0.1]], idle=false, lastBusy=1488552117814, context=DefaultDaemonContext[uid=4de86e8b-b8d2-4b84-b77a-e0243a45db90,javaHome=/Library/Java/JavaVirtualMachines/jdk1.8.0_121.jdk/Contents/Home,daemonRegistryDir=/Users/below/.gradle/daemon,pid=5992,idleTimeout=120000,daemonOpts=-Xmx1536m,-Dfile.encoding=UTF-8,-Duser.country=DE,-Duser.language=de,-Duser.variant]} (build should be done).
15:41:59.988 [DEBUG] [org.gradle.launcher.daemon.client.DaemonClientConnection] thread 1: dispatching class org.gradle.launcher.daemon.protocol.Finished
Sign up for free to join this conversation on GitHub. Already have an account? Sign in to comment
You can’t perform that action at this time.