Skip to content

Instantly share code, notes, and snippets.

Embed
What would you like to do?
$ make
running build_ext
/var/folders/sb/4qv5j4m90pz1rw7m70rj1b1r0000gn/T/tmpe6cpp83s/x86_64-53430/dicts/74dccd35e261cf60_ACLiC_dict.cxx:203:10: warning: 'const' qualifier on reference type
'vector<RooStats::HistFactory::HistoSys, allocator<RooStats::HistFactory::HistoSys> >::reference' (aka 'RooStats::HistFactory::HistoSys &') has no effect
[-Wignored-qualifiers]
const vector<RooStats::HistFactory::HistoSys,allocator<RooStats::HistFactory::HistoSys> >::reference obj = ((vector<RooStats::HistFactory::HistoSys,allo...
^~~~~~
/var/folders/sb/4qv5j4m90pz1rw7m70rj1b1r0000gn/T/tmpe6cpp83s/x86_64-53430/dicts/74dccd35e261cf60_ACLiC_dict.cxx:313:10: warning: 'const' qualifier on reference type
'vector<RooStats::HistFactory::HistoSys, allocator<RooStats::HistFactory::HistoSys> >::reference' (aka 'RooStats::HistFactory::HistoSys &') has no effect
[-Wignored-qualifiers]
const vector<RooStats::HistFactory::HistoSys,allocator<RooStats::HistFactory::HistoSys> >::reference obj = ((vector<RooStats::HistFactory::HistoSys,allo...
^~~~~~
/var/folders/sb/4qv5j4m90pz1rw7m70rj1b1r0000gn/T/tmpe6cpp83s/x86_64-53430/dicts/74dccd35e261cf60_ACLiC_dict.cxx:589:10: warning: 'const' qualifier on reference type
'vector<RooStats::HistFactory::HistoSys, allocator<RooStats::HistFactory::HistoSys> >::iterator::reference' (aka 'RooStats::HistFactory::HistoSys &') has no effect
[-Wignored-qualifiers]
const vector<RooStats::HistFactory::HistoSys,allocator<RooStats::HistFactory::HistoSys> >::iterator::reference obj = ((const vector<RooStats::HistFactor...
^~~~~~
/var/folders/sb/4qv5j4m90pz1rw7m70rj1b1r0000gn/T/tmpe6cpp83s/x86_64-53430/dicts/74dccd35e261cf60_ACLiC_dict.cxx:651:10: warning: 'const' qualifier on reference type
'vector<RooStats::HistFactory::HistoSys, allocator<RooStats::HistFactory::HistoSys> >::iterator::reference' (aka 'RooStats::HistFactory::HistoSys &') has no effect
[-Wignored-qualifiers]
const vector<RooStats::HistFactory::HistoSys,allocator<RooStats::HistFactory::HistoSys> >::iterator::reference obj = ((const vector<RooStats::HistFactor...
^~~~~~
4 warnings generated.
/var/folders/sb/4qv5j4m90pz1rw7m70rj1b1r0000gn/T/tmpe6cpp83s/x86_64-53430/dicts/8ec4fdeb406132ac_ACLiC_dict.cxx:203:10: warning: 'const' qualifier on reference type
'vector<RooStats::HistFactory::HistoFactor, allocator<RooStats::HistFactory::HistoFactor> >::reference' (aka 'RooStats::HistFactory::HistoFactor &') has no effect
[-Wignored-qualifiers]
const vector<RooStats::HistFactory::HistoFactor,allocator<RooStats::HistFactory::HistoFactor> >::reference obj = ((vector<RooStats::HistFactory::HistoFa...
^~~~~~
/var/folders/sb/4qv5j4m90pz1rw7m70rj1b1r0000gn/T/tmpe6cpp83s/x86_64-53430/dicts/8ec4fdeb406132ac_ACLiC_dict.cxx:313:10: warning: 'const' qualifier on reference type
'vector<RooStats::HistFactory::HistoFactor, allocator<RooStats::HistFactory::HistoFactor> >::reference' (aka 'RooStats::HistFactory::HistoFactor &') has no effect
[-Wignored-qualifiers]
const vector<RooStats::HistFactory::HistoFactor,allocator<RooStats::HistFactory::HistoFactor> >::reference obj = ((vector<RooStats::HistFactory::HistoFa...
^~~~~~
/var/folders/sb/4qv5j4m90pz1rw7m70rj1b1r0000gn/T/tmpe6cpp83s/x86_64-53430/dicts/8ec4fdeb406132ac_ACLiC_dict.cxx:589:10: warning: 'const' qualifier on reference type
'vector<RooStats::HistFactory::HistoFactor, allocator<RooStats::HistFactory::HistoFactor> >::iterator::reference' (aka 'RooStats::HistFactory::HistoFactor &') has
no effect [-Wignored-qualifiers]
const vector<RooStats::HistFactory::HistoFactor,allocator<RooStats::HistFactory::HistoFactor> >::iterator::reference obj = ((const vector<RooStats::Hist...
^~~~~~
/var/folders/sb/4qv5j4m90pz1rw7m70rj1b1r0000gn/T/tmpe6cpp83s/x86_64-53430/dicts/8ec4fdeb406132ac_ACLiC_dict.cxx:651:10: warning: 'const' qualifier on reference type
'vector<RooStats::HistFactory::HistoFactor, allocator<RooStats::HistFactory::HistoFactor> >::iterator::reference' (aka 'RooStats::HistFactory::HistoFactor &') has
no effect [-Wignored-qualifiers]
const vector<RooStats::HistFactory::HistoFactor,allocator<RooStats::HistFactory::HistoFactor> >::iterator::reference obj = ((const vector<RooStats::Hist...
^~~~~~
4 warnings generated.
/var/folders/sb/4qv5j4m90pz1rw7m70rj1b1r0000gn/T/tmpe6cpp83s/x86_64-53430/dicts/a9a04aa43df476fa_ACLiC_dict.cxx:203:10: warning: 'const' qualifier on reference type
'vector<RooStats::HistFactory::NormFactor, allocator<RooStats::HistFactory::NormFactor> >::reference' (aka 'RooStats::HistFactory::NormFactor &') has no effect
[-Wignored-qualifiers]
const vector<RooStats::HistFactory::NormFactor,allocator<RooStats::HistFactory::NormFactor> >::reference obj = ((vector<RooStats::HistFactory::NormFacto...
^~~~~~
/var/folders/sb/4qv5j4m90pz1rw7m70rj1b1r0000gn/T/tmpe6cpp83s/x86_64-53430/dicts/a9a04aa43df476fa_ACLiC_dict.cxx:313:10: warning: 'const' qualifier on reference type
'vector<RooStats::HistFactory::NormFactor, allocator<RooStats::HistFactory::NormFactor> >::reference' (aka 'RooStats::HistFactory::NormFactor &') has no effect
[-Wignored-qualifiers]
const vector<RooStats::HistFactory::NormFactor,allocator<RooStats::HistFactory::NormFactor> >::reference obj = ((vector<RooStats::HistFactory::NormFacto...
^~~~~~
/var/folders/sb/4qv5j4m90pz1rw7m70rj1b1r0000gn/T/tmpe6cpp83s/x86_64-53430/dicts/a9a04aa43df476fa_ACLiC_dict.cxx:589:10: warning: 'const' qualifier on reference type
'vector<RooStats::HistFactory::NormFactor, allocator<RooStats::HistFactory::NormFactor> >::iterator::reference' (aka 'RooStats::HistFactory::NormFactor &') has no
effect [-Wignored-qualifiers]
const vector<RooStats::HistFactory::NormFactor,allocator<RooStats::HistFactory::NormFactor> >::iterator::reference obj = ((const vector<RooStats::HistFa...
^~~~~~
/var/folders/sb/4qv5j4m90pz1rw7m70rj1b1r0000gn/T/tmpe6cpp83s/x86_64-53430/dicts/a9a04aa43df476fa_ACLiC_dict.cxx:651:10: warning: 'const' qualifier on reference type
'vector<RooStats::HistFactory::NormFactor, allocator<RooStats::HistFactory::NormFactor> >::iterator::reference' (aka 'RooStats::HistFactory::NormFactor &') has no
effect [-Wignored-qualifiers]
const vector<RooStats::HistFactory::NormFactor,allocator<RooStats::HistFactory::NormFactor> >::iterator::reference obj = ((const vector<RooStats::HistFa...
^~~~~~
4 warnings generated.
/var/folders/sb/4qv5j4m90pz1rw7m70rj1b1r0000gn/T/tmpe6cpp83s/x86_64-53430/dicts/ffb8d077a9f22fe2_ACLiC_dict.cxx:203:10: warning: 'const' qualifier on reference type
'vector<RooStats::HistFactory::OverallSys, allocator<RooStats::HistFactory::OverallSys> >::reference' (aka 'RooStats::HistFactory::OverallSys &') has no effect
[-Wignored-qualifiers]
const vector<RooStats::HistFactory::OverallSys,allocator<RooStats::HistFactory::OverallSys> >::reference obj = ((vector<RooStats::HistFactory::OverallSy...
^~~~~~
/var/folders/sb/4qv5j4m90pz1rw7m70rj1b1r0000gn/T/tmpe6cpp83s/x86_64-53430/dicts/ffb8d077a9f22fe2_ACLiC_dict.cxx:313:10: warning: 'const' qualifier on reference type
'vector<RooStats::HistFactory::OverallSys, allocator<RooStats::HistFactory::OverallSys> >::reference' (aka 'RooStats::HistFactory::OverallSys &') has no effect
[-Wignored-qualifiers]
const vector<RooStats::HistFactory::OverallSys,allocator<RooStats::HistFactory::OverallSys> >::reference obj = ((vector<RooStats::HistFactory::OverallSy...
^~~~~~
/var/folders/sb/4qv5j4m90pz1rw7m70rj1b1r0000gn/T/tmpe6cpp83s/x86_64-53430/dicts/ffb8d077a9f22fe2_ACLiC_dict.cxx:589:10: warning: 'const' qualifier on reference type
'vector<RooStats::HistFactory::OverallSys, allocator<RooStats::HistFactory::OverallSys> >::iterator::reference' (aka 'RooStats::HistFactory::OverallSys &') has no
effect [-Wignored-qualifiers]
const vector<RooStats::HistFactory::OverallSys,allocator<RooStats::HistFactory::OverallSys> >::iterator::reference obj = ((const vector<RooStats::HistFa...
^~~~~~
/var/folders/sb/4qv5j4m90pz1rw7m70rj1b1r0000gn/T/tmpe6cpp83s/x86_64-53430/dicts/ffb8d077a9f22fe2_ACLiC_dict.cxx:651:10: warning: 'const' qualifier on reference type
'vector<RooStats::HistFactory::OverallSys, allocator<RooStats::HistFactory::OverallSys> >::iterator::reference' (aka 'RooStats::HistFactory::OverallSys &') has no
effect [-Wignored-qualifiers]
const vector<RooStats::HistFactory::OverallSys,allocator<RooStats::HistFactory::OverallSys> >::iterator::reference obj = ((const vector<RooStats::HistFa...
^~~~~~
4 warnings generated.
/var/folders/sb/4qv5j4m90pz1rw7m70rj1b1r0000gn/T/tmpe6cpp83s/x86_64-53430/dicts/c984498d808e63de_ACLiC_dict.cxx:203:10: warning: 'const' qualifier on reference type
'vector<RooStats::HistFactory::ShapeFactor, allocator<RooStats::HistFactory::ShapeFactor> >::reference' (aka 'RooStats::HistFactory::ShapeFactor &') has no effect
[-Wignored-qualifiers]
const vector<RooStats::HistFactory::ShapeFactor,allocator<RooStats::HistFactory::ShapeFactor> >::reference obj = ((vector<RooStats::HistFactory::ShapeFa...
^~~~~~
/var/folders/sb/4qv5j4m90pz1rw7m70rj1b1r0000gn/T/tmpe6cpp83s/x86_64-53430/dicts/c984498d808e63de_ACLiC_dict.cxx:313:10: warning: 'const' qualifier on reference type
'vector<RooStats::HistFactory::ShapeFactor, allocator<RooStats::HistFactory::ShapeFactor> >::reference' (aka 'RooStats::HistFactory::ShapeFactor &') has no effect
[-Wignored-qualifiers]
const vector<RooStats::HistFactory::ShapeFactor,allocator<RooStats::HistFactory::ShapeFactor> >::reference obj = ((vector<RooStats::HistFactory::ShapeFa...
^~~~~~
/var/folders/sb/4qv5j4m90pz1rw7m70rj1b1r0000gn/T/tmpe6cpp83s/x86_64-53430/dicts/c984498d808e63de_ACLiC_dict.cxx:589:10: warning: 'const' qualifier on reference type
'vector<RooStats::HistFactory::ShapeFactor, allocator<RooStats::HistFactory::ShapeFactor> >::iterator::reference' (aka 'RooStats::HistFactory::ShapeFactor &') has
no effect [-Wignored-qualifiers]
const vector<RooStats::HistFactory::ShapeFactor,allocator<RooStats::HistFactory::ShapeFactor> >::iterator::reference obj = ((const vector<RooStats::Hist...
^~~~~~
/var/folders/sb/4qv5j4m90pz1rw7m70rj1b1r0000gn/T/tmpe6cpp83s/x86_64-53430/dicts/c984498d808e63de_ACLiC_dict.cxx:651:10: warning: 'const' qualifier on reference type
'vector<RooStats::HistFactory::ShapeFactor, allocator<RooStats::HistFactory::ShapeFactor> >::iterator::reference' (aka 'RooStats::HistFactory::ShapeFactor &') has
no effect [-Wignored-qualifiers]
const vector<RooStats::HistFactory::ShapeFactor,allocator<RooStats::HistFactory::ShapeFactor> >::iterator::reference obj = ((const vector<RooStats::Hist...
^~~~~~
4 warnings generated.
/var/folders/sb/4qv5j4m90pz1rw7m70rj1b1r0000gn/T/tmpe6cpp83s/x86_64-53430/dicts/966401057ba7ed3e_ACLiC_dict.cxx:203:10: warning: 'const' qualifier on reference type
'vector<RooStats::HistFactory::ShapeSys, allocator<RooStats::HistFactory::ShapeSys> >::reference' (aka 'RooStats::HistFactory::ShapeSys &') has no effect
[-Wignored-qualifiers]
const vector<RooStats::HistFactory::ShapeSys,allocator<RooStats::HistFactory::ShapeSys> >::reference obj = ((vector<RooStats::HistFactory::ShapeSys,allo...
^~~~~~
/var/folders/sb/4qv5j4m90pz1rw7m70rj1b1r0000gn/T/tmpe6cpp83s/x86_64-53430/dicts/966401057ba7ed3e_ACLiC_dict.cxx:313:10: warning: 'const' qualifier on reference type
'vector<RooStats::HistFactory::ShapeSys, allocator<RooStats::HistFactory::ShapeSys> >::reference' (aka 'RooStats::HistFactory::ShapeSys &') has no effect
[-Wignored-qualifiers]
const vector<RooStats::HistFactory::ShapeSys,allocator<RooStats::HistFactory::ShapeSys> >::reference obj = ((vector<RooStats::HistFactory::ShapeSys,allo...
^~~~~~
/var/folders/sb/4qv5j4m90pz1rw7m70rj1b1r0000gn/T/tmpe6cpp83s/x86_64-53430/dicts/966401057ba7ed3e_ACLiC_dict.cxx:589:10: warning: 'const' qualifier on reference type
'vector<RooStats::HistFactory::ShapeSys, allocator<RooStats::HistFactory::ShapeSys> >::iterator::reference' (aka 'RooStats::HistFactory::ShapeSys &') has no effect
[-Wignored-qualifiers]
const vector<RooStats::HistFactory::ShapeSys,allocator<RooStats::HistFactory::ShapeSys> >::iterator::reference obj = ((const vector<RooStats::HistFactor...
^~~~~~
/var/folders/sb/4qv5j4m90pz1rw7m70rj1b1r0000gn/T/tmpe6cpp83s/x86_64-53430/dicts/966401057ba7ed3e_ACLiC_dict.cxx:651:10: warning: 'const' qualifier on reference type
'vector<RooStats::HistFactory::ShapeSys, allocator<RooStats::HistFactory::ShapeSys> >::iterator::reference' (aka 'RooStats::HistFactory::ShapeSys &') has no effect
[-Wignored-qualifiers]
const vector<RooStats::HistFactory::ShapeSys,allocator<RooStats::HistFactory::ShapeSys> >::iterator::reference obj = ((const vector<RooStats::HistFactor...
^~~~~~
4 warnings generated.
/var/folders/sb/4qv5j4m90pz1rw7m70rj1b1r0000gn/T/tmpe6cpp83s/x86_64-53430/dicts/d314910f83d9e62a_ACLiC_dict.cxx:203:10: warning: 'const' qualifier on reference type
'vector<RooStats::HistFactory::Sample, allocator<RooStats::HistFactory::Sample> >::reference' (aka 'RooStats::HistFactory::Sample &') has no effect
[-Wignored-qualifiers]
const vector<RooStats::HistFactory::Sample,allocator<RooStats::HistFactory::Sample> >::reference obj = ((vector<RooStats::HistFactory::Sample,allocator<...
^~~~~~
/var/folders/sb/4qv5j4m90pz1rw7m70rj1b1r0000gn/T/tmpe6cpp83s/x86_64-53430/dicts/d314910f83d9e62a_ACLiC_dict.cxx:313:10: warning: 'const' qualifier on reference type
'vector<RooStats::HistFactory::Sample, allocator<RooStats::HistFactory::Sample> >::reference' (aka 'RooStats::HistFactory::Sample &') has no effect
[-Wignored-qualifiers]
const vector<RooStats::HistFactory::Sample,allocator<RooStats::HistFactory::Sample> >::reference obj = ((vector<RooStats::HistFactory::Sample,allocator<...
^~~~~~
/var/folders/sb/4qv5j4m90pz1rw7m70rj1b1r0000gn/T/tmpe6cpp83s/x86_64-53430/dicts/d314910f83d9e62a_ACLiC_dict.cxx:589:10: warning: 'const' qualifier on reference type
'vector<RooStats::HistFactory::Sample, allocator<RooStats::HistFactory::Sample> >::iterator::reference' (aka 'RooStats::HistFactory::Sample &') has no effect
[-Wignored-qualifiers]
const vector<RooStats::HistFactory::Sample,allocator<RooStats::HistFactory::Sample> >::iterator::reference obj = ((const vector<RooStats::HistFactory::S...
^~~~~~
/var/folders/sb/4qv5j4m90pz1rw7m70rj1b1r0000gn/T/tmpe6cpp83s/x86_64-53430/dicts/d314910f83d9e62a_ACLiC_dict.cxx:651:10: warning: 'const' qualifier on reference type
'vector<RooStats::HistFactory::Sample, allocator<RooStats::HistFactory::Sample> >::iterator::reference' (aka 'RooStats::HistFactory::Sample &') has no effect
[-Wignored-qualifiers]
const vector<RooStats::HistFactory::Sample,allocator<RooStats::HistFactory::Sample> >::iterator::reference obj = ((const vector<RooStats::HistFactory::S...
^~~~~~
4 warnings generated.
/var/folders/sb/4qv5j4m90pz1rw7m70rj1b1r0000gn/T/tmpe6cpp83s/x86_64-53430/dicts/8bf929a4aac0d05c_ACLiC_dict.cxx:203:10: warning: 'const' qualifier on reference type
'vector<RooStats::HistFactory::Data, allocator<RooStats::HistFactory::Data> >::reference' (aka 'RooStats::HistFactory::Data &') has no effect
[-Wignored-qualifiers]
const vector<RooStats::HistFactory::Data,allocator<RooStats::HistFactory::Data> >::reference obj = ((vector<RooStats::HistFactory::Data,allocator<RooSta...
^~~~~~
/var/folders/sb/4qv5j4m90pz1rw7m70rj1b1r0000gn/T/tmpe6cpp83s/x86_64-53430/dicts/8bf929a4aac0d05c_ACLiC_dict.cxx:313:10: warning: 'const' qualifier on reference type
'vector<RooStats::HistFactory::Data, allocator<RooStats::HistFactory::Data> >::reference' (aka 'RooStats::HistFactory::Data &') has no effect
[-Wignored-qualifiers]
const vector<RooStats::HistFactory::Data,allocator<RooStats::HistFactory::Data> >::reference obj = ((vector<RooStats::HistFactory::Data,allocator<RooSta...
^~~~~~
/var/folders/sb/4qv5j4m90pz1rw7m70rj1b1r0000gn/T/tmpe6cpp83s/x86_64-53430/dicts/8bf929a4aac0d05c_ACLiC_dict.cxx:589:10: warning: 'const' qualifier on reference type
'vector<RooStats::HistFactory::Data, allocator<RooStats::HistFactory::Data> >::iterator::reference' (aka 'RooStats::HistFactory::Data &') has no effect
[-Wignored-qualifiers]
const vector<RooStats::HistFactory::Data,allocator<RooStats::HistFactory::Data> >::iterator::reference obj = ((const vector<RooStats::HistFactory::Data,...
^~~~~~
/var/folders/sb/4qv5j4m90pz1rw7m70rj1b1r0000gn/T/tmpe6cpp83s/x86_64-53430/dicts/8bf929a4aac0d05c_ACLiC_dict.cxx:651:10: warning: 'const' qualifier on reference type
'vector<RooStats::HistFactory::Data, allocator<RooStats::HistFactory::Data> >::iterator::reference' (aka 'RooStats::HistFactory::Data &') has no effect
[-Wignored-qualifiers]
const vector<RooStats::HistFactory::Data,allocator<RooStats::HistFactory::Data> >::iterator::reference obj = ((const vector<RooStats::HistFactory::Data,...
^~~~~~
4 warnings generated.
/var/folders/sb/4qv5j4m90pz1rw7m70rj1b1r0000gn/T/tmpe6cpp83s/x86_64-53430/dicts/a89c939e1ca292f8_ACLiC_dict.cxx:203:10: warning: 'const' qualifier on reference type
'vector<RooStats::HistFactory::Channel, allocator<RooStats::HistFactory::Channel> >::reference' (aka 'RooStats::HistFactory::Channel &') has no effect
[-Wignored-qualifiers]
const vector<RooStats::HistFactory::Channel,allocator<RooStats::HistFactory::Channel> >::reference obj = ((vector<RooStats::HistFactory::Channel,allocat...
^~~~~~
/var/folders/sb/4qv5j4m90pz1rw7m70rj1b1r0000gn/T/tmpe6cpp83s/x86_64-53430/dicts/a89c939e1ca292f8_ACLiC_dict.cxx:313:10: warning: 'const' qualifier on reference type
'vector<RooStats::HistFactory::Channel, allocator<RooStats::HistFactory::Channel> >::reference' (aka 'RooStats::HistFactory::Channel &') has no effect
[-Wignored-qualifiers]
const vector<RooStats::HistFactory::Channel,allocator<RooStats::HistFactory::Channel> >::reference obj = ((vector<RooStats::HistFactory::Channel,allocat...
^~~~~~
/var/folders/sb/4qv5j4m90pz1rw7m70rj1b1r0000gn/T/tmpe6cpp83s/x86_64-53430/dicts/a89c939e1ca292f8_ACLiC_dict.cxx:589:10: warning: 'const' qualifier on reference type
'vector<RooStats::HistFactory::Channel, allocator<RooStats::HistFactory::Channel> >::iterator::reference' (aka 'RooStats::HistFactory::Channel &') has no effect
[-Wignored-qualifiers]
const vector<RooStats::HistFactory::Channel,allocator<RooStats::HistFactory::Channel> >::iterator::reference obj = ((const vector<RooStats::HistFactory:...
^~~~~~
/var/folders/sb/4qv5j4m90pz1rw7m70rj1b1r0000gn/T/tmpe6cpp83s/x86_64-53430/dicts/a89c939e1ca292f8_ACLiC_dict.cxx:651:10: warning: 'const' qualifier on reference type
'vector<RooStats::HistFactory::Channel, allocator<RooStats::HistFactory::Channel> >::iterator::reference' (aka 'RooStats::HistFactory::Channel &') has no effect
[-Wignored-qualifiers]
const vector<RooStats::HistFactory::Channel,allocator<RooStats::HistFactory::Channel> >::iterator::reference obj = ((const vector<RooStats::HistFactory:...
^~~~~~
4 warnings generated.
/var/folders/sb/4qv5j4m90pz1rw7m70rj1b1r0000gn/T/tmpe6cpp83s/x86_64-53430/dicts/2673847ffb6c1ecd_ACLiC_dict.cxx:203:10: warning: 'const' qualifier on reference type
'vector<RooStats::HistFactory::Measurement, allocator<RooStats::HistFactory::Measurement> >::reference' (aka 'RooStats::HistFactory::Measurement &') has no effect
[-Wignored-qualifiers]
const vector<RooStats::HistFactory::Measurement,allocator<RooStats::HistFactory::Measurement> >::reference obj = ((vector<RooStats::HistFactory::Measure...
^~~~~~
/var/folders/sb/4qv5j4m90pz1rw7m70rj1b1r0000gn/T/tmpe6cpp83s/x86_64-53430/dicts/2673847ffb6c1ecd_ACLiC_dict.cxx:313:10: warning: 'const' qualifier on reference type
'vector<RooStats::HistFactory::Measurement, allocator<RooStats::HistFactory::Measurement> >::reference' (aka 'RooStats::HistFactory::Measurement &') has no effect
[-Wignored-qualifiers]
const vector<RooStats::HistFactory::Measurement,allocator<RooStats::HistFactory::Measurement> >::reference obj = ((vector<RooStats::HistFactory::Measure...
^~~~~~
/var/folders/sb/4qv5j4m90pz1rw7m70rj1b1r0000gn/T/tmpe6cpp83s/x86_64-53430/dicts/2673847ffb6c1ecd_ACLiC_dict.cxx:589:10: warning: 'const' qualifier on reference type
'vector<RooStats::HistFactory::Measurement, allocator<RooStats::HistFactory::Measurement> >::iterator::reference' (aka 'RooStats::HistFactory::Measurement &') has
no effect [-Wignored-qualifiers]
const vector<RooStats::HistFactory::Measurement,allocator<RooStats::HistFactory::Measurement> >::iterator::reference obj = ((const vector<RooStats::Hist...
^~~~~~
/var/folders/sb/4qv5j4m90pz1rw7m70rj1b1r0000gn/T/tmpe6cpp83s/x86_64-53430/dicts/2673847ffb6c1ecd_ACLiC_dict.cxx:651:10: warning: 'const' qualifier on reference type
'vector<RooStats::HistFactory::Measurement, allocator<RooStats::HistFactory::Measurement> >::iterator::reference' (aka 'RooStats::HistFactory::Measurement &') has
no effect [-Wignored-qualifiers]
const vector<RooStats::HistFactory::Measurement,allocator<RooStats::HistFactory::Measurement> >::iterator::reference obj = ((const vector<RooStats::Hist...
^~~~~~
4 warnings generated.
Failure: AttributeError ('function' object has no attribute 'im_func') ... ERROR
rootpy.io.tests.test_file.test_tempfile ... ok
rootpy.io.tests.test_file.test_memfile ... ok
rootpy.io.tests.test_file.test_file_open ... ok
rootpy.io.tests.test_file.test_context ... ok
rootpy.io.tests.test_file.test_file_get ... ok
rootpy.io.tests.test_file.test_file_item ... ok
rootpy.io.tests.test_file.test_file_attr ... ok
rootpy.io.tests.test_file.test_file_contains ... ok
rootpy.io.tests.test_file.test_no_dangling_files ... ok
rootpy.io.tests.test_file.test_keepalive ... ok
rootpy.io.tests.test_file.test_keepalive_canvas ... ok
rootpy.io.tests.test_pickler.test_pickler ... ok
Failure: SkipTest () ... SKIP
rootpy.logger.tests.test_threading.test_multithread_exceptions ... SKIP
rootpy.memory.tests.test_getownership.test_getownership ... ok
Failure: NameError (name 'CalledProcessError' is not defined) ... ERROR
Failure: AttributeError ('function' object has no attribute 'im_func') ... ERROR
Failure: AttributeError ('function' object has no attribute 'im_func') ... ERROR
Failure: AttributeError ('function' object has no attribute 'im_func') ... ERROR
rootpy.plotting.style.tests.test_style.test_get_style ... ok
rootpy.plotting.tests.test_graph.test_init ... ok
rootpy.plotting.tests.test_graph.test_init_from_hist ... ok
rootpy.plotting.tests.test_graph.test_init_from_file_1d ... ok
rootpy.plotting.tests.test_graph.test_init_from_file_2d ... ok
rootpy.plotting.tests.test_graph.test_xerr ... ok
rootpy.plotting.tests.test_graph.test_divide ... ok
rootpy.plotting.tests.test_hist.test_init ... ok
rootpy.plotting.tests.test_hist.test_init_from_graph ... ok
rootpy.plotting.tests.test_hist.test_init_edge_order ... ok
rootpy.plotting.tests.test_hist.test_init_edge_repeated ... ok
rootpy.plotting.tests.test_hist.test_edges ... ok
rootpy.plotting.tests.test_hist.test_edgesl ... ok
rootpy.plotting.tests.test_hist.test_edgesh ... ok
rootpy.plotting.tests.test_hist.test_width ... ok
rootpy.plotting.tests.test_hist.test_bounds ... ok
rootpy.plotting.tests.test_hist.test_ravel ... ok
rootpy.plotting.tests.test_hist.test_uniform ... ok
rootpy.plotting.tests.test_hist.test_stack ... ok
rootpy.plotting.tests.test_hist.test_indexing ... ok
rootpy.plotting.tests.test_hist.test_slice_assign ... ok
rootpy.plotting.tests.test_hist.test_slice_assign_bad ... ok
rootpy.plotting.tests.test_hist.test_overflow_underflow ... ok
rootpy.plotting.tests.test_hist.test_merge_bins ... ok
rootpy.plotting.tests.test_hist.test_rebinning ... ok
rootpy.plotting.tests.test_hist.test_quantiles ... ok
rootpy.plotting.tests.test_hist.test_compatibility ... ok
rootpy.plotting.tests.test_hist.test_power ... ok
rootpy.plotting.tests.test_hist.test_integral ... ok
rootpy.plotting.tests.test_hist.test_integral_error ... ok
rootpy.plotting.tests.test_hist.test_poisson_errors ... ok
rootpy.plotting.tests.test_hist.test_overall_efficiency ... ok
rootpy.plotting.tests.test_hist.test_efficiency ... ok
rootpy.plotting.tests.test_hist.test_uniform_binned ... ok
rootpy.plotting.tests.test_legend.test_init ... ok
rootpy.plotting.tests.test_plottable.test_plottable_clone ... ok
rootpy.plotting.tests.test_profile.test_init ... ok
rootpy.plotting.tests.test_profile.test_init_profiled_edges ... ok
rootpy.plotting.tests.test_profile.test_init_option ... ok
rootpy.plotting.tests.test_profile.test_init_edge_order ... ok
rootpy.plotting.tests.test_profile.test_init_edge_repeated ... ok
rootpy.plotting.tests.test_profile.test_init_profiled_edge_order ... ok
rootpy.plotting.tests.test_profile.test_init_profiled_edge_repeated ... ok
rootpy.plotting.tests.test_root2matplotlib.test_errorbar ... ERROR
rootpy.plotting.tests.test_root2matplotlib.test_bar ... ERROR
rootpy.plotting.tests.test_root2matplotlib.test_hist ... ERROR
rootpy.plotting.tests.test_root2matplotlib.test_hist2d ... ERROR
rootpy.plotting.tests.test_root2matplotlib.test_imshow ... ERROR
rootpy.plotting.tests.test_root2matplotlib.test_contour ... ERROR
rootpy.plotting.tests.test_utils.test_limits ... ok
rootpy.stats.tests.test_correlated_values.test_correlated_values ... ok
rootpy.tree.tests.test_categories.test_from_string ... ok
rootpy.tree.tests.test_categories.test_len ... ok
rootpy.tree.tests.test_cut.test_safe ... ok
rootpy.tree.tests.test_tree.test_attrs ... /var/folders/sb/4qv5j4m90pz1rw7m70rj1b1r0000gn/T/tmpe6cpp83s/x86_64-53430/dicts/ccad4664192b899b_ACLiC_dict.cxx:203:10: warning: 'const' qualifier on reference type
'vector<int, allocator<int> >::reference' (aka 'int &') has no effect [-Wignored-qualifiers]
const vector<int,allocator<int> >::reference obj = ((vector<int,allocator<int> >*) G__getstructoffset())->at((vector<int,allocator<int> >::size_type) G_...
^~~~~~
/var/folders/sb/4qv5j4m90pz1rw7m70rj1b1r0000gn/T/tmpe6cpp83s/x86_64-53430/dicts/ccad4664192b899b_ACLiC_dict.cxx:313:10: warning: 'const' qualifier on reference type
'vector<int, allocator<int> >::reference' (aka 'int &') has no effect [-Wignored-qualifiers]
const vector<int,allocator<int> >::reference obj = ((vector<int,allocator<int> >*) G__getstructoffset())->operator[]((vector<int,allocator<int> >::size_...
^~~~~~
/var/folders/sb/4qv5j4m90pz1rw7m70rj1b1r0000gn/T/tmpe6cpp83s/x86_64-53430/dicts/ccad4664192b899b_ACLiC_dict.cxx:589:10: warning: 'const' qualifier on reference type
'vector<int, allocator<int> >::iterator::reference' (aka 'int &') has no effect [-Wignored-qualifiers]
const vector<int,allocator<int> >::iterator::reference obj = ((const vector<int,allocator<int> >::iterator*) G__getstructoffset())->operator*();
^~~~~~
/var/folders/sb/4qv5j4m90pz1rw7m70rj1b1r0000gn/T/tmpe6cpp83s/x86_64-53430/dicts/ccad4664192b899b_ACLiC_dict.cxx:651:10: warning: 'const' qualifier on reference type
'vector<int, allocator<int> >::iterator::reference' (aka 'int &') has no effect [-Wignored-qualifiers]
const vector<int,allocator<int> >::iterator::reference obj = ((const vector<int,allocator<int> >::iterator*) G__getstructoffset())->operator[](*(vector<...
^~~~~~
4 warnings generated.
Note: Link requested for already precompiled class vector<float,allocator<float> > (ignore this message) :0:
Note: Link requested for already precompiled class vector<float,allocator<float> >::iterator (ignore this message) :0:
/var/folders/sb/4qv5j4m90pz1rw7m70rj1b1r0000gn/T/tmpe6cpp83s/x86_64-53430/dicts/2ef178159fa4e463_ACLiC_dict.cxx:203:10: warning: 'const' qualifier on reference type
'vector<TLorentzVector, allocator<TLorentzVector> >::reference' (aka 'TLorentzVector &') has no effect [-Wignored-qualifiers]
const vector<TLorentzVector,allocator<TLorentzVector> >::reference obj = ((vector<TLorentzVector,allocator<TLorentzVector> >*) G__getstructoffset())->at...
^~~~~~
/var/folders/sb/4qv5j4m90pz1rw7m70rj1b1r0000gn/T/tmpe6cpp83s/x86_64-53430/dicts/2ef178159fa4e463_ACLiC_dict.cxx:313:10: warning: 'const' qualifier on reference type
'vector<TLorentzVector, allocator<TLorentzVector> >::reference' (aka 'TLorentzVector &') has no effect [-Wignored-qualifiers]
const vector<TLorentzVector,allocator<TLorentzVector> >::reference obj = ((vector<TLorentzVector,allocator<TLorentzVector> >*) G__getstructoffset())->op...
^~~~~~
/var/folders/sb/4qv5j4m90pz1rw7m70rj1b1r0000gn/T/tmpe6cpp83s/x86_64-53430/dicts/2ef178159fa4e463_ACLiC_dict.cxx:589:10: warning: 'const' qualifier on reference type
'vector<TLorentzVector, allocator<TLorentzVector> >::iterator::reference' (aka 'TLorentzVector &') has no effect [-Wignored-qualifiers]
const vector<TLorentzVector,allocator<TLorentzVector> >::iterator::reference obj = ((const vector<TLorentzVector,allocator<TLorentzVector> >::iterator*...
^~~~~~
/var/folders/sb/4qv5j4m90pz1rw7m70rj1b1r0000gn/T/tmpe6cpp83s/x86_64-53430/dicts/2ef178159fa4e463_ACLiC_dict.cxx:651:10: warning: 'const' qualifier on reference type
'vector<TLorentzVector, allocator<TLorentzVector> >::iterator::reference' (aka 'TLorentzVector &') has no effect [-Wignored-qualifiers]
const vector<TLorentzVector,allocator<TLorentzVector> >::iterator::reference obj = ((const vector<TLorentzVector,allocator<TLorentzVector> >::iterator*...
^~~~~~
4 warnings generated.
ERROR
rootpy.tree.tests.test_tree.test_draw ... ok
rootpy.tree.tests.test_tree.test_chain_draw ... SKIP: Python 3 support not implemented
rootpy.tree.tests.test_tree.test_chain_draw_hist_init_first ... SKIP: Python 3 support not implemented
rootpy.tree.tests.test_tree.test_require_file_bad ... ok
rootpy.tree.tests.test_tree.test_require_file_good ... ok
rootpy.tree.tests.test_tree.test_require_file_not_writable ... ok
rootpy.tree.tests.test_tree.test_draw_regex ... ok
rootpy.tree.tests.test_tree.test_file_assoc ... ok
rootpy.tree.tests.test_tree.test_csv ... ERROR
rootpy.tree.tests.test_tree.test_ntuple ... ok
rootpy.tree.tests.test_treetypes.test_convert ... ok
rootpy.utils.tests.test_hook.test_inject ... ERROR
rootpy.utils.tests.test_hook.test_hooks ... ok
rootpy.utils.tests.test_module_facade.test_module_facade ... ok
rootpy.utils.tests.test_module_facade.test_internal_facade ... ok
rootpy.tests.test_ROOT.test_ROOT ... ok
rootpy.tests.test_base.test_object ... ok
rootpy.tests.test_compiled.test_compiled ... ok
rootpy.tests.test_decorators.test_snake_case_methods ... ok
rootpy.tests.test_decorators.test_snake_case_methods_descriptor ... ok
rootpy.tests.test_decorators.test_method_file_check_good ... ok
rootpy.tests.test_decorators.test_method_file_check_bad ... ok
rootpy.tests.test_decorators.test_method_file_cd ... ok
rootpy.tests.test_root2hdf5.test_root2hdf5 ... /opt/local/Library/Frameworks/Python.framework/Versions/3.4/lib/python3.4/site-packages/pkg_resources/__init__.py:197: RuntimeWarning: You have iterated over the result of pkg_resources.parse_version. This is a legacy behavior which is inconsistent with the new version class introduced in setuptools 8.0. In most cases, conversion to a tuple is unnecessary. For comparison of versions, sort the Version instances directly. If you have another use case requiring the tuple, please file a bug with the setuptools project describing that need.
stacklevel=1,
ERROR
rootpy.tests.test_root2hdf5.test_root2hdf5_chunked ... ERROR
rootpy.tests.test_root2hdf5.test_root2hdf5_chunked_selected ... ERROR
rootpy.tests.test_stl.test_parse ... ok
======================================================================
ERROR: Failure: AttributeError ('function' object has no attribute 'im_func')
----------------------------------------------------------------------
Traceback (most recent call last):
File "/opt/local/Library/Frameworks/Python.framework/Versions/3.4/lib/python3.4/site-packages/nose/failure.py", line 39, in runTest
raise self.exc_val.with_traceback(self.tb)
File "/opt/local/Library/Frameworks/Python.framework/Versions/3.4/lib/python3.4/site-packages/nose/loader.py", line 411, in loadTestsFromName
addr.filename, addr.module)
File "/opt/local/Library/Frameworks/Python.framework/Versions/3.4/lib/python3.4/site-packages/nose/importer.py", line 47, in importFromPath
return self.importFromDir(dir_path, fqname)
File "/opt/local/Library/Frameworks/Python.framework/Versions/3.4/lib/python3.4/site-packages/nose/importer.py", line 94, in importFromDir
mod = load_module(part_fqname, fh, filename, desc)
File "/opt/local/Library/Frameworks/Python.framework/Versions/3.4/lib/python3.4/imp.py", line 245, in load_module
return load_package(name, filename)
File "/opt/local/Library/Frameworks/Python.framework/Versions/3.4/lib/python3.4/imp.py", line 217, in load_package
return methods.load()
File "<frozen importlib._bootstrap>", line 1220, in load
File "<frozen importlib._bootstrap>", line 1200, in _load_unlocked
File "<frozen importlib._bootstrap>", line 1129, in _exec
File "<frozen importlib._bootstrap>", line 1471, in exec_module
File "<frozen importlib._bootstrap>", line 321, in _call_with_frames_removed
File "/Users/deil/code/rootpy/rootpy/interactive/__init__.py", line 12, in <module>
from .console import interact
File "/opt/local/Library/Frameworks/Python.framework/Versions/3.4/lib/python3.4/site-packages/ROOT.py", line 352, in _importhook
return _orig_ihook( name, *args, **kwds )
File "/Users/deil/code/rootpy/rootpy/interactive/console.py", line 74, in <module>
fix_ipython_startup(_finalSetup)
File "/Users/deil/code/rootpy/rootpy/logger/magic.py", line 385, in fix_ipython_startup
consts = fn.im_func.__code__.co_consts
nose.proxy.AttributeError: 'function' object has no attribute 'im_func'
-------------------- >> begin captured logging << --------------------
rootpy.userdata: INFO: Placing user data in /tmp.
rootpy.userdata: WARNING: Make sure '~/.cache/rootpy' or $ROOTPY_DATA is a writable directory so that it isn't necessary to recreate all user data each time
rootpy.stl: INFO: generating dictionary for deque<RooAbsArg*> ...
ROOT.TMacOSXSystem.ACLiC: INFO: creating shared library /var/folders/sb/4qv5j4m90pz1rw7m70rj1b1r0000gn/T/tmpe6cpp83s/x86_64-53430/dicts/d834ad667ff712a7.so
rootpy.stl: INFO: generating dictionary for stack<RooAbsArg*, deque<RooAbsArg*> > ...
ROOT.TMacOSXSystem.ACLiC: INFO: creating shared library /var/folders/sb/4qv5j4m90pz1rw7m70rj1b1r0000gn/T/tmpe6cpp83s/x86_64-53430/dicts/deb57d21332feb79.so
ROOT.TClassTable.Add: WARNING: class stack<RooAbsArg*,deque<RooAbsArg*,allocator<RooAbsArg*> > > already in TClassTable
rootpy.stl: INFO: generating dictionary for vector<RooStats::HistFactory::HistoSys> ...
ROOT.TMacOSXSystem.ACLiC: INFO: creating shared library /var/folders/sb/4qv5j4m90pz1rw7m70rj1b1r0000gn/T/tmpe6cpp83s/x86_64-53430/dicts/74dccd35e261cf60.so
rootpy.stl: INFO: generating dictionary for vector<RooStats::HistFactory::HistoFactor> ...
ROOT.TMacOSXSystem.ACLiC: INFO: creating shared library /var/folders/sb/4qv5j4m90pz1rw7m70rj1b1r0000gn/T/tmpe6cpp83s/x86_64-53430/dicts/8ec4fdeb406132ac.so
rootpy.stl: INFO: generating dictionary for vector<RooStats::HistFactory::NormFactor> ...
ROOT.TMacOSXSystem.ACLiC: INFO: creating shared library /var/folders/sb/4qv5j4m90pz1rw7m70rj1b1r0000gn/T/tmpe6cpp83s/x86_64-53430/dicts/a9a04aa43df476fa.so
rootpy.stl: INFO: generating dictionary for vector<RooStats::HistFactory::OverallSys> ...
ROOT.TMacOSXSystem.ACLiC: INFO: creating shared library /var/folders/sb/4qv5j4m90pz1rw7m70rj1b1r0000gn/T/tmpe6cpp83s/x86_64-53430/dicts/ffb8d077a9f22fe2.so
rootpy.stl: INFO: generating dictionary for vector<RooStats::HistFactory::ShapeFactor> ...
ROOT.TMacOSXSystem.ACLiC: INFO: creating shared library /var/folders/sb/4qv5j4m90pz1rw7m70rj1b1r0000gn/T/tmpe6cpp83s/x86_64-53430/dicts/c984498d808e63de.so
rootpy.stl: INFO: generating dictionary for vector<RooStats::HistFactory::ShapeSys> ...
ROOT.TMacOSXSystem.ACLiC: INFO: creating shared library /var/folders/sb/4qv5j4m90pz1rw7m70rj1b1r0000gn/T/tmpe6cpp83s/x86_64-53430/dicts/966401057ba7ed3e.so
rootpy.stl: INFO: generating dictionary for vector<RooStats::HistFactory::Sample> ...
ROOT.TMacOSXSystem.ACLiC: INFO: creating shared library /var/folders/sb/4qv5j4m90pz1rw7m70rj1b1r0000gn/T/tmpe6cpp83s/x86_64-53430/dicts/d314910f83d9e62a.so
rootpy.stl: INFO: generating dictionary for vector<RooStats::HistFactory::Data> ...
ROOT.TMacOSXSystem.ACLiC: INFO: creating shared library /var/folders/sb/4qv5j4m90pz1rw7m70rj1b1r0000gn/T/tmpe6cpp83s/x86_64-53430/dicts/8bf929a4aac0d05c.so
rootpy.stl: INFO: generating dictionary for vector<RooStats::HistFactory::Channel> ...
ROOT.TMacOSXSystem.ACLiC: INFO: creating shared library /var/folders/sb/4qv5j4m90pz1rw7m70rj1b1r0000gn/T/tmpe6cpp83s/x86_64-53430/dicts/a89c939e1ca292f8.so
rootpy.stl: INFO: generating dictionary for vector<RooStats::HistFactory::Measurement> ...
ROOT.TMacOSXSystem.ACLiC: INFO: creating shared library /var/folders/sb/4qv5j4m90pz1rw7m70rj1b1r0000gn/T/tmpe6cpp83s/x86_64-53430/dicts/2673847ffb6c1ecd.so
--------------------- >> end captured logging << ---------------------
======================================================================
ERROR: Failure: NameError (name 'CalledProcessError' is not defined)
----------------------------------------------------------------------
Traceback (most recent call last):
File "/Users/deil/code/rootpy/rootpy/compiled.py", line 230, in pkgconfig
output = checkoutput(cmd)
NameError: name 'checkoutput' is not defined
During handling of the above exception, another exception occurred:
Traceback (most recent call last):
File "/opt/local/Library/Frameworks/Python.framework/Versions/3.4/lib/python3.4/site-packages/nose/failure.py", line 39, in runTest
raise self.exc_val.with_traceback(self.tb)
File "/opt/local/Library/Frameworks/Python.framework/Versions/3.4/lib/python3.4/site-packages/nose/loader.py", line 411, in loadTestsFromName
addr.filename, addr.module)
File "/opt/local/Library/Frameworks/Python.framework/Versions/3.4/lib/python3.4/site-packages/nose/importer.py", line 47, in importFromPath
return self.importFromDir(dir_path, fqname)
File "/opt/local/Library/Frameworks/Python.framework/Versions/3.4/lib/python3.4/site-packages/nose/importer.py", line 94, in importFromDir
mod = load_module(part_fqname, fh, filename, desc)
File "/opt/local/Library/Frameworks/Python.framework/Versions/3.4/lib/python3.4/imp.py", line 235, in load_module
return load_source(name, filename, file)
File "/opt/local/Library/Frameworks/Python.framework/Versions/3.4/lib/python3.4/imp.py", line 171, in load_source
module = methods.load()
File "<frozen importlib._bootstrap>", line 1220, in load
File "<frozen importlib._bootstrap>", line 1200, in _load_unlocked
File "<frozen importlib._bootstrap>", line 1129, in _exec
File "<frozen importlib._bootstrap>", line 1471, in exec_module
File "<frozen importlib._bootstrap>", line 321, in _call_with_frames_removed
File "/Users/deil/code/rootpy/rootpy/memory/tests/test_keepalive.py", line 11, in <module>
from rootpy.memory.deletion import monitor_deletion
File "/opt/local/Library/Frameworks/Python.framework/Versions/3.4/lib/python3.4/site-packages/ROOT.py", line 352, in _importhook
return _orig_ihook( name, *args, **kwds )
File "/Users/deil/code/rootpy/rootpy/memory/deletion.py", line 61, in <module>
C.add_python_includepath()
File "/Users/deil/code/rootpy/rootpy/compiled.py", line 272, in add_python_includepath
'-I"{0}"'.format(self.python_include_path))
File "/Users/deil/code/rootpy/rootpy/utils/module_facade.py", line 17, in __get__
result = super(computed_once_classproperty, self).__get__(object_, type_)
File "/Users/deil/code/rootpy/rootpy/compiled.py", line 255, in python_include_path
path = path()
File "/Users/deil/code/rootpy/rootpy/compiled.py", line 231, in pkgconfig
except CalledProcessError as e:
NameError: name 'CalledProcessError' is not defined
======================================================================
ERROR: Failure: AttributeError ('function' object has no attribute 'im_func')
----------------------------------------------------------------------
Traceback (most recent call last):
File "/opt/local/Library/Frameworks/Python.framework/Versions/3.4/lib/python3.4/site-packages/nose/failure.py", line 39, in runTest
raise self.exc_val.with_traceback(self.tb)
File "/opt/local/Library/Frameworks/Python.framework/Versions/3.4/lib/python3.4/site-packages/nose/loader.py", line 411, in loadTestsFromName
addr.filename, addr.module)
File "/opt/local/Library/Frameworks/Python.framework/Versions/3.4/lib/python3.4/site-packages/nose/importer.py", line 47, in importFromPath
return self.importFromDir(dir_path, fqname)
File "/opt/local/Library/Frameworks/Python.framework/Versions/3.4/lib/python3.4/site-packages/nose/importer.py", line 94, in importFromDir
mod = load_module(part_fqname, fh, filename, desc)
File "/opt/local/Library/Frameworks/Python.framework/Versions/3.4/lib/python3.4/imp.py", line 235, in load_module
return load_source(name, filename, file)
File "/opt/local/Library/Frameworks/Python.framework/Versions/3.4/lib/python3.4/imp.py", line 171, in load_source
module = methods.load()
File "<frozen importlib._bootstrap>", line 1220, in load
File "<frozen importlib._bootstrap>", line 1200, in _load_unlocked
File "<frozen importlib._bootstrap>", line 1129, in _exec
File "<frozen importlib._bootstrap>", line 1471, in exec_module
File "<frozen importlib._bootstrap>", line 321, in _call_with_frames_removed
File "/Users/deil/code/rootpy/rootpy/plotting/style/atlas/test.py", line 7, in <module>
from rootpy.interactive import wait
File "/opt/local/Library/Frameworks/Python.framework/Versions/3.4/lib/python3.4/site-packages/ROOT.py", line 352, in _importhook
return _orig_ihook( name, *args, **kwds )
File "/Users/deil/code/rootpy/rootpy/interactive/__init__.py", line 12, in <module>
from .console import interact
File "/opt/local/Library/Frameworks/Python.framework/Versions/3.4/lib/python3.4/site-packages/ROOT.py", line 352, in _importhook
return _orig_ihook( name, *args, **kwds )
File "/Users/deil/code/rootpy/rootpy/interactive/console.py", line 74, in <module>
fix_ipython_startup(_finalSetup)
File "/Users/deil/code/rootpy/rootpy/logger/magic.py", line 385, in fix_ipython_startup
consts = fn.im_func.__code__.co_consts
AttributeError: 'function' object has no attribute 'im_func'
======================================================================
ERROR: Failure: AttributeError ('function' object has no attribute 'im_func')
----------------------------------------------------------------------
Traceback (most recent call last):
File "/opt/local/Library/Frameworks/Python.framework/Versions/3.4/lib/python3.4/site-packages/nose/failure.py", line 39, in runTest
raise self.exc_val.with_traceback(self.tb)
File "/opt/local/Library/Frameworks/Python.framework/Versions/3.4/lib/python3.4/site-packages/nose/loader.py", line 411, in loadTestsFromName
addr.filename, addr.module)
File "/opt/local/Library/Frameworks/Python.framework/Versions/3.4/lib/python3.4/site-packages/nose/importer.py", line 47, in importFromPath
return self.importFromDir(dir_path, fqname)
File "/opt/local/Library/Frameworks/Python.framework/Versions/3.4/lib/python3.4/site-packages/nose/importer.py", line 94, in importFromDir
mod = load_module(part_fqname, fh, filename, desc)
File "/opt/local/Library/Frameworks/Python.framework/Versions/3.4/lib/python3.4/imp.py", line 235, in load_module
return load_source(name, filename, file)
File "/opt/local/Library/Frameworks/Python.framework/Versions/3.4/lib/python3.4/imp.py", line 171, in load_source
module = methods.load()
File "<frozen importlib._bootstrap>", line 1220, in load
File "<frozen importlib._bootstrap>", line 1200, in _load_unlocked
File "<frozen importlib._bootstrap>", line 1129, in _exec
File "<frozen importlib._bootstrap>", line 1471, in exec_module
File "<frozen importlib._bootstrap>", line 321, in _call_with_frames_removed
File "/Users/deil/code/rootpy/rootpy/plotting/style/cmstdr/test.py", line 7, in <module>
from rootpy.interactive import wait
File "/opt/local/Library/Frameworks/Python.framework/Versions/3.4/lib/python3.4/site-packages/ROOT.py", line 352, in _importhook
return _orig_ihook( name, *args, **kwds )
File "/Users/deil/code/rootpy/rootpy/interactive/__init__.py", line 12, in <module>
from .console import interact
File "/opt/local/Library/Frameworks/Python.framework/Versions/3.4/lib/python3.4/site-packages/ROOT.py", line 352, in _importhook
return _orig_ihook( name, *args, **kwds )
File "/Users/deil/code/rootpy/rootpy/interactive/console.py", line 74, in <module>
fix_ipython_startup(_finalSetup)
File "/Users/deil/code/rootpy/rootpy/logger/magic.py", line 385, in fix_ipython_startup
consts = fn.im_func.__code__.co_consts
AttributeError: 'function' object has no attribute 'im_func'
======================================================================
ERROR: Failure: AttributeError ('function' object has no attribute 'im_func')
----------------------------------------------------------------------
Traceback (most recent call last):
File "/opt/local/Library/Frameworks/Python.framework/Versions/3.4/lib/python3.4/site-packages/nose/failure.py", line 39, in runTest
raise self.exc_val.with_traceback(self.tb)
File "/opt/local/Library/Frameworks/Python.framework/Versions/3.4/lib/python3.4/site-packages/nose/loader.py", line 411, in loadTestsFromName
addr.filename, addr.module)
File "/opt/local/Library/Frameworks/Python.framework/Versions/3.4/lib/python3.4/site-packages/nose/importer.py", line 47, in importFromPath
return self.importFromDir(dir_path, fqname)
File "/opt/local/Library/Frameworks/Python.framework/Versions/3.4/lib/python3.4/site-packages/nose/importer.py", line 94, in importFromDir
mod = load_module(part_fqname, fh, filename, desc)
File "/opt/local/Library/Frameworks/Python.framework/Versions/3.4/lib/python3.4/imp.py", line 235, in load_module
return load_source(name, filename, file)
File "/opt/local/Library/Frameworks/Python.framework/Versions/3.4/lib/python3.4/imp.py", line 171, in load_source
module = methods.load()
File "<frozen importlib._bootstrap>", line 1220, in load
File "<frozen importlib._bootstrap>", line 1200, in _load_unlocked
File "<frozen importlib._bootstrap>", line 1129, in _exec
File "<frozen importlib._bootstrap>", line 1471, in exec_module
File "<frozen importlib._bootstrap>", line 321, in _call_with_frames_removed
File "/Users/deil/code/rootpy/rootpy/plotting/style/lhcb/test.py", line 7, in <module>
from rootpy.interactive import wait
File "/opt/local/Library/Frameworks/Python.framework/Versions/3.4/lib/python3.4/site-packages/ROOT.py", line 352, in _importhook
return _orig_ihook( name, *args, **kwds )
File "/Users/deil/code/rootpy/rootpy/interactive/__init__.py", line 12, in <module>
from .console import interact
File "/opt/local/Library/Frameworks/Python.framework/Versions/3.4/lib/python3.4/site-packages/ROOT.py", line 352, in _importhook
return _orig_ihook( name, *args, **kwds )
File "/Users/deil/code/rootpy/rootpy/interactive/console.py", line 74, in <module>
fix_ipython_startup(_finalSetup)
File "/Users/deil/code/rootpy/rootpy/logger/magic.py", line 385, in fix_ipython_startup
consts = fn.im_func.__code__.co_consts
AttributeError: 'function' object has no attribute 'im_func'
======================================================================
ERROR: rootpy.plotting.tests.test_root2matplotlib.test_errorbar
----------------------------------------------------------------------
Traceback (most recent call last):
File "/opt/local/Library/Frameworks/Python.framework/Versions/3.4/lib/python3.4/site-packages/nose/case.py", line 198, in runTest
self.test(*self.arg)
File "/Users/deil/code/rootpy/rootpy/plotting/tests/test_root2matplotlib.py", line 20, in test_errorbar
from rootpy.plotting import root2matplotlib as rplt
File "/opt/local/Library/Frameworks/Python.framework/Versions/3.4/lib/python3.4/site-packages/ROOT.py", line 352, in _importhook
return _orig_ihook( name, *args, **kwds )
File "/opt/local/Library/Frameworks/Python.framework/Versions/3.4/lib/python3.4/site-packages/ROOT.py", line 352, in _importhook
return _orig_ihook( name, *args, **kwds )
File "/Users/deil/code/rootpy/rootpy/plotting/root2matplotlib.py", line 24, in <module>
from itertools import izip
ImportError: cannot import name 'izip'
======================================================================
ERROR: rootpy.plotting.tests.test_root2matplotlib.test_bar
----------------------------------------------------------------------
Traceback (most recent call last):
File "/opt/local/Library/Frameworks/Python.framework/Versions/3.4/lib/python3.4/site-packages/nose/case.py", line 198, in runTest
self.test(*self.arg)
File "/Users/deil/code/rootpy/rootpy/plotting/tests/test_root2matplotlib.py", line 30, in test_bar
from rootpy.plotting import root2matplotlib as rplt
File "/opt/local/Library/Frameworks/Python.framework/Versions/3.4/lib/python3.4/site-packages/ROOT.py", line 352, in _importhook
return _orig_ihook( name, *args, **kwds )
File "/opt/local/Library/Frameworks/Python.framework/Versions/3.4/lib/python3.4/site-packages/ROOT.py", line 352, in _importhook
return _orig_ihook( name, *args, **kwds )
File "/Users/deil/code/rootpy/rootpy/plotting/root2matplotlib.py", line 24, in <module>
from itertools import izip
ImportError: cannot import name 'izip'
======================================================================
ERROR: rootpy.plotting.tests.test_root2matplotlib.test_hist
----------------------------------------------------------------------
Traceback (most recent call last):
File "/opt/local/Library/Frameworks/Python.framework/Versions/3.4/lib/python3.4/site-packages/nose/case.py", line 198, in runTest
self.test(*self.arg)
File "/Users/deil/code/rootpy/rootpy/plotting/tests/test_root2matplotlib.py", line 44, in test_hist
from rootpy.plotting import root2matplotlib as rplt
File "/opt/local/Library/Frameworks/Python.framework/Versions/3.4/lib/python3.4/site-packages/ROOT.py", line 352, in _importhook
return _orig_ihook( name, *args, **kwds )
File "/opt/local/Library/Frameworks/Python.framework/Versions/3.4/lib/python3.4/site-packages/ROOT.py", line 352, in _importhook
return _orig_ihook( name, *args, **kwds )
File "/Users/deil/code/rootpy/rootpy/plotting/root2matplotlib.py", line 24, in <module>
from itertools import izip
ImportError: cannot import name 'izip'
======================================================================
ERROR: rootpy.plotting.tests.test_root2matplotlib.test_hist2d
----------------------------------------------------------------------
Traceback (most recent call last):
File "/opt/local/Library/Frameworks/Python.framework/Versions/3.4/lib/python3.4/site-packages/nose/case.py", line 198, in runTest
self.test(*self.arg)
File "/Users/deil/code/rootpy/rootpy/plotting/tests/test_root2matplotlib.py", line 58, in test_hist2d
from rootpy.plotting import root2matplotlib as rplt
File "/opt/local/Library/Frameworks/Python.framework/Versions/3.4/lib/python3.4/site-packages/ROOT.py", line 352, in _importhook
return _orig_ihook( name, *args, **kwds )
File "/opt/local/Library/Frameworks/Python.framework/Versions/3.4/lib/python3.4/site-packages/ROOT.py", line 352, in _importhook
return _orig_ihook( name, *args, **kwds )
File "/Users/deil/code/rootpy/rootpy/plotting/root2matplotlib.py", line 24, in <module>
from itertools import izip
ImportError: cannot import name 'izip'
======================================================================
ERROR: rootpy.plotting.tests.test_root2matplotlib.test_imshow
----------------------------------------------------------------------
Traceback (most recent call last):
File "/opt/local/Library/Frameworks/Python.framework/Versions/3.4/lib/python3.4/site-packages/nose/case.py", line 198, in runTest
self.test(*self.arg)
File "/Users/deil/code/rootpy/rootpy/plotting/tests/test_root2matplotlib.py", line 73, in test_imshow
from rootpy.plotting import root2matplotlib as rplt
File "/opt/local/Library/Frameworks/Python.framework/Versions/3.4/lib/python3.4/site-packages/ROOT.py", line 352, in _importhook
return _orig_ihook( name, *args, **kwds )
File "/opt/local/Library/Frameworks/Python.framework/Versions/3.4/lib/python3.4/site-packages/ROOT.py", line 352, in _importhook
return _orig_ihook( name, *args, **kwds )
File "/Users/deil/code/rootpy/rootpy/plotting/root2matplotlib.py", line 24, in <module>
from itertools import izip
ImportError: cannot import name 'izip'
======================================================================
ERROR: rootpy.plotting.tests.test_root2matplotlib.test_contour
----------------------------------------------------------------------
Traceback (most recent call last):
File "/opt/local/Library/Frameworks/Python.framework/Versions/3.4/lib/python3.4/site-packages/nose/case.py", line 198, in runTest
self.test(*self.arg)
File "/Users/deil/code/rootpy/rootpy/plotting/tests/test_root2matplotlib.py", line 85, in test_contour
from rootpy.plotting import root2matplotlib as rplt
File "/opt/local/Library/Frameworks/Python.framework/Versions/3.4/lib/python3.4/site-packages/ROOT.py", line 352, in _importhook
return _orig_ihook( name, *args, **kwds )
File "/opt/local/Library/Frameworks/Python.framework/Versions/3.4/lib/python3.4/site-packages/ROOT.py", line 352, in _importhook
return _orig_ihook( name, *args, **kwds )
File "/Users/deil/code/rootpy/rootpy/plotting/root2matplotlib.py", line 24, in <module>
from itertools import izip
ImportError: cannot import name 'izip'
======================================================================
ERROR: rootpy.tree.tests.test_tree.test_attrs
----------------------------------------------------------------------
Traceback (most recent call last):
File "/opt/local/Library/Frameworks/Python.framework/Versions/3.4/lib/python3.4/site-packages/nose/case.py", line 198, in runTest
self.test(*self.arg)
File "/Users/deil/code/rootpy/rootpy/tree/tests/test_tree.py", line 116, in test_attrs
for event in tree:
File "/Users/deil/code/rootpy/rootpy/tree/tree.py", line 405, in __iter__
self.create_buffer()
File "/Users/deil/code/rootpy/rootpy/tree/tree.py", line 126, in create_buffer
ignore_unsupported=ignore_unsupported))
File "/Users/deil/code/rootpy/rootpy/tree/tree.py", line 237, in set_buffer
self.SetBranchAddress(name, value)
nose.proxy.TypeError: none of the 3 overloaded methods succeeded. Full details:
Int_t TTree::SetBranchAddress(const char* bname, void** add, TBranch** ptr = 0) =>
could not convert argument 1 (must be bytes, not str)
Int_t TTree::SetBranchAddress(const char* bname, void* add, TClass* realClass, EDataType datatype, Bool_t isptr) =>
takes at least 5 arguments (2 given)
Int_t TTree::SetBranchAddress(const char* bname, void* add, TBranch** ptr, TClass* realClass, EDataType datatype, Bool_t isptr) =>
takes at least 6 arguments (2 given)
-------------------- >> begin captured logging << --------------------
rootpy.stl: INFO: generating dictionary for vector<int> ...
ROOT.TMacOSXSystem.ACLiC: INFO: creating shared library /var/folders/sb/4qv5j4m90pz1rw7m70rj1b1r0000gn/T/tmpe6cpp83s/x86_64-53430/dicts/ccad4664192b899b.so
ROOT.TClassTable.Add: WARNING: class vector<int,allocator<int> >::iterator already in TClassTable
rootpy.stl: INFO: generating dictionary for vector<float> ...
ROOT.TMacOSXSystem.ACLiC: INFO: creating shared library /var/folders/sb/4qv5j4m90pz1rw7m70rj1b1r0000gn/T/tmpe6cpp83s/x86_64-53430/dicts/15fe54d5c4df2bfd.so
rootpy.stl: INFO: generating dictionary for vector<TLorentzVector> ...
ROOT.TMacOSXSystem.ACLiC: INFO: creating shared library /var/folders/sb/4qv5j4m90pz1rw7m70rj1b1r0000gn/T/tmpe6cpp83s/x86_64-53430/dicts/2ef178159fa4e463.so
ROOT.TTree.Bronch: WARNING: Using split mode on a class: TLorentzVector with a custom Streamer
--------------------- >> end captured logging << ---------------------
======================================================================
ERROR: rootpy.tree.tests.test_tree.test_csv
----------------------------------------------------------------------
Traceback (most recent call last):
File "/opt/local/Library/Frameworks/Python.framework/Versions/3.4/lib/python3.4/site-packages/nose/case.py", line 198, in runTest
self.test(*self.arg)
File "/Users/deil/code/rootpy/rootpy/tree/tests/test_tree.py", line 262, in test_csv
tree.create_buffer(ignore_unsupported=True)
File "/Users/deil/code/rootpy/rootpy/tree/tree.py", line 126, in create_buffer
ignore_unsupported=ignore_unsupported))
File "/Users/deil/code/rootpy/rootpy/tree/tree.py", line 237, in set_buffer
self.SetBranchAddress(name, value)
TypeError: none of the 3 overloaded methods succeeded. Full details:
Int_t TTree::SetBranchAddress(const char* bname, void** add, TBranch** ptr = 0) =>
could not convert argument 1 (must be bytes, not str)
Int_t TTree::SetBranchAddress(const char* bname, void* add, TClass* realClass, EDataType datatype, Bool_t isptr) =>
takes at least 5 arguments (2 given)
Int_t TTree::SetBranchAddress(const char* bname, void* add, TBranch** ptr, TClass* realClass, EDataType datatype, Bool_t isptr) =>
takes at least 6 arguments (2 given)
======================================================================
ERROR: rootpy.utils.tests.test_hook.test_inject
----------------------------------------------------------------------
Traceback (most recent call last):
File "/opt/local/Library/Frameworks/Python.framework/Versions/3.4/lib/python3.4/site-packages/nose/case.py", line 198, in runTest
self.test(*self.arg)
File "/Users/deil/code/rootpy/rootpy/utils/tests/test_hook.py", line 57, in test_inject
hooked = H.inject_closure_values(wrap, ANOTHER=NEWANOTHER, nonexist=999)
File "/Users/deil/code/rootpy/rootpy/utils/inject_closure.py", line 145, in inject_closure_values
newfunc = _inject_closure_values(func, **kwargs)
File "/Users/deil/code/rootpy/rootpy/utils/inject_closure.py", line 110, in _inject_closure_values
c = byteplay.Code.from_code(func_code)
File "/Users/deil/code/rootpy/rootpy/extern/byteplay3.py", line 148, in from_code
code[-1]=(LOAD_CONST,Code.from_code(lastarg))
File "/Users/deil/code/rootpy/rootpy/extern/byteplay3.py", line 133, in from_code
co_code=co.co_code
AttributeError: 'str' object has no attribute 'co_code'
======================================================================
ERROR: rootpy.tests.test_root2hdf5.test_root2hdf5
----------------------------------------------------------------------
Traceback (most recent call last):
File "/opt/local/Library/Frameworks/Python.framework/Versions/3.4/lib/python3.4/site-packages/nose/case.py", line 198, in runTest
self.test(*self.arg)
File "/Users/deil/code/rootpy/rootpy/tests/test_root2hdf5.py", line 35, in test_root2hdf5
from rootpy.root2hdf5 import root2hdf5
File "/opt/local/Library/Frameworks/Python.framework/Versions/3.4/lib/python3.4/site-packages/ROOT.py", line 352, in _importhook
return _orig_ihook( name, *args, **kwds )
File "/Users/deil/code/rootpy/rootpy/root2hdf5.py", line 21, in <module>
from root_numpy import tree2rec, RootNumpyUnconvertibleWarning
File "/opt/local/Library/Frameworks/Python.framework/Versions/3.4/lib/python3.4/site-packages/ROOT.py", line 352, in _importhook
return _orig_ihook( name, *args, **kwds )
ImportError: No module named 'root_numpy'
======================================================================
ERROR: rootpy.tests.test_root2hdf5.test_root2hdf5_chunked
----------------------------------------------------------------------
Traceback (most recent call last):
File "/opt/local/Library/Frameworks/Python.framework/Versions/3.4/lib/python3.4/site-packages/nose/case.py", line 198, in runTest
self.test(*self.arg)
File "/Users/deil/code/rootpy/rootpy/tests/test_root2hdf5.py", line 54, in test_root2hdf5_chunked
from rootpy.root2hdf5 import root2hdf5
File "/opt/local/Library/Frameworks/Python.framework/Versions/3.4/lib/python3.4/site-packages/ROOT.py", line 352, in _importhook
return _orig_ihook( name, *args, **kwds )
File "/Users/deil/code/rootpy/rootpy/root2hdf5.py", line 21, in <module>
from root_numpy import tree2rec, RootNumpyUnconvertibleWarning
File "/opt/local/Library/Frameworks/Python.framework/Versions/3.4/lib/python3.4/site-packages/ROOT.py", line 352, in _importhook
return _orig_ihook( name, *args, **kwds )
ImportError: No module named 'root_numpy'
======================================================================
ERROR: rootpy.tests.test_root2hdf5.test_root2hdf5_chunked_selected
----------------------------------------------------------------------
Traceback (most recent call last):
File "/opt/local/Library/Frameworks/Python.framework/Versions/3.4/lib/python3.4/site-packages/nose/case.py", line 198, in runTest
self.test(*self.arg)
File "/Users/deil/code/rootpy/rootpy/tests/test_root2hdf5.py", line 73, in test_root2hdf5_chunked_selected
from rootpy.root2hdf5 import root2hdf5
File "/opt/local/Library/Frameworks/Python.framework/Versions/3.4/lib/python3.4/site-packages/ROOT.py", line 352, in _importhook
return _orig_ihook( name, *args, **kwds )
File "/Users/deil/code/rootpy/rootpy/root2hdf5.py", line 21, in <module>
from root_numpy import tree2rec, RootNumpyUnconvertibleWarning
File "/opt/local/Library/Frameworks/Python.framework/Versions/3.4/lib/python3.4/site-packages/ROOT.py", line 352, in _importhook
return _orig_ihook( name, *args, **kwds )
ImportError: No module named 'root_numpy'
----------------------------------------------------------------------
Ran 102 tests in 17.203s
FAILED (SKIP=4, errors=17)
make: *** [test-code] Error 1
Sign up for free to join this conversation on GitHub. Already have an account? Sign in to comment