Skip to content

Instantly share code, notes, and snippets.

@ceteri
Last active Dec 14, 2015
Embed
What would you like to do?
Cascalog testing with Cascading 2.2-wip
bash-3.2$ lein do sub install, deps, compile, repl
Could not find artifact lein-newnew:lein-newnew:pom:0.3.5 in central (http://repo1.maven.org/maven2)
Retrieving lein-newnew/lein-newnew/0.3.5/lein-newnew-0.3.5.pom (3k)
from https://clojars.org/repo/
Could not find artifact stencil:stencil:pom:0.3.0 in central (http://repo1.maven.org/maven2)
Retrieving stencil/stencil/0.3.0/stencil-0.3.0.pom (3k)
from https://clojars.org/repo/
Retrieving org/clojure/clojure/1.3.0/clojure-1.3.0.pom (5k)
from http://repo1.maven.org/maven2/
Retrieving org/sonatype/oss/oss-parent/5/oss-parent-5.pom (4k)
from http://repo1.maven.org/maven2/
Could not find artifact scout:scout:pom:0.1.0 in central (http://repo1.maven.org/maven2)
Retrieving scout/scout/0.1.0/scout-0.1.0.pom (2k)from https://clojars.org/repo/
Could not find artifact quoin:quoin:pom:0.1.0 in central (http://repo1.maven.org/maven2)
Retrieving quoin/quoin/0.1.0/quoin-0.1.0.pom (2k)from https://clojars.org/repo/
Could not find artifact slingshot:slingshot:pom:0.8.0 in central (http://repo1.maven.org/maven2)
Retrieving slingshot/slingshot/0.8.0/slingshot-0.8.0.pom (1k)
from https://clojars.org/repo/
Retrieving org/clojure/clojure/1.2.1/clojure-1.2.1.pom (1k)
from http://repo1.maven.org/maven2/
Retrieving org/clojure/core.cache/0.6.1/core.cache-0.6.1.pom (2k)
from http://repo1.maven.org/maven2/
Retrieving org/clojure/pom.contrib/0.0.26/pom.contrib-0.0.26.pom (5k)
from http://repo1.maven.org/maven2/
Retrieving org/clojure/clojure/1.4.0/clojure-1.4.0.pom (5k)
from http://repo1.maven.org/maven2/
Could not find artifact bultitude:bultitude:pom:0.1.7 in central (http://repo1.maven.org/maven2)
Retrieving bultitude/bultitude/0.1.7/bultitude-0.1.7.pom (2k)
from https://clojars.org/repo/
Could not find artifact lein-sub:lein-sub:pom:0.2.1 in central (http://repo1.maven.org/maven2)
Retrieving lein-sub/lein-sub/0.2.1/lein-sub-0.2.1.pom (2k)
from https://clojars.org/repo/
Could not find artifact codox:codox:pom:0.6.4 in central (http://repo1.maven.org/maven2)
Retrieving codox/codox/0.6.4/codox-0.6.4.pom (2k)from https://clojars.org/repo/
Could not find artifact codox:codox.leiningen:pom:0.6.4 in central (http://repo1.maven.org/maven2)
Retrieving codox/codox.leiningen/0.6.4/codox.leiningen-0.6.4.pom (2k)
from https://clojars.org/repo/
Could not find artifact leinjacker:leinjacker:pom:0.4.1 in central (http://repo1.maven.org/maven2)
Retrieving leinjacker/leinjacker/0.4.1/leinjacker-0.4.1.pom (3k)
from https://clojars.org/repo/
Retrieving org/clojure/core.contracts/0.0.1/core.contracts-0.0.1.pom (1k)
from http://repo1.maven.org/maven2/
Retrieving org/clojure/core.unify/0.5.3/core.unify-0.5.3.pom (1k)
from http://repo1.maven.org/maven2/
Could not find artifact lein-newnew:lein-newnew:jar:0.3.5 in central (http://repo1.maven.org/maven2)
Could not find artifact quoin:quoin:jar:0.1.0 in central (http://repo1.maven.org/maven2)
Could not find artifact scout:scout:jar:0.1.0 in central (http://repo1.maven.org/maven2)
Could not find artifact stencil:stencil:jar:0.3.0 in central (http://repo1.maven.org/maven2)
Retrieving org/clojure/clojure/1.3.0/clojure-1.3.0.jar (3311k)
from http://repo1.maven.org/maven2/
Retrieving org/clojure/core.cache/0.6.1/core.cache-0.6.1.jar (11k)
from http://repo1.maven.org/maven2/
Could not find artifact slingshot:slingshot:jar:0.8.0 in central (http://repo1.maven.org/maven2)
Could not find artifact bultitude:bultitude:jar:0.1.7 in central (http://repo1.maven.org/maven2)
Could not find artifact lein-sub:lein-sub:jar:0.2.1 in central (http://repo1.maven.org/maven2)
Could not find artifact codox:codox.leiningen:jar:0.6.4 in central (http://repo1.maven.org/maven2)
Could not find artifact leinjacker:leinjacker:jar:0.4.1 in central (http://repo1.maven.org/maven2)
Could not find artifact codox:codox:jar:0.6.4 in central (http://repo1.maven.org/maven2)
Retrieving org/clojure/core.contracts/0.0.1/core.contracts-0.0.1.jar (5k)
from http://repo1.maven.org/maven2/
Retrieving org/clojure/core.unify/0.5.3/core.unify-0.5.3.jar (4k)
from http://repo1.maven.org/maven2/
Retrieving stencil/stencil/0.3.0/stencil-0.3.0.jar (13k)
from https://clojars.org/repo/
Retrieving slingshot/slingshot/0.8.0/slingshot-0.8.0.jar (6k)
from https://clojars.org/repo/
Retrieving scout/scout/0.1.0/scout-0.1.0.jar (4k)from https://clojars.org/repo/
Retrieving quoin/quoin/0.1.0/quoin-0.1.0.jar (3k)from https://clojars.org/repo/
Retrieving bultitude/bultitude/0.1.7/bultitude-0.1.7.jar (4k)
from https://clojars.org/repo/
Retrieving lein-newnew/lein-newnew/0.3.5/lein-newnew-0.3.5.jar (15k)
from https://clojars.org/repo/
Retrieving lein-sub/lein-sub/0.2.1/lein-sub-0.2.1.jar (2k)
from https://clojars.org/repo/
Retrieving codox/codox/0.6.4/codox-0.6.4.jar (2k)from https://clojars.org/repo/
Retrieving codox/codox.leiningen/0.6.4/codox.leiningen-0.6.4.jar (2k)
from https://clojars.org/repo/
Retrieving leinjacker/leinjacker/0.4.1/leinjacker-0.4.1.jar (8k)
from https://clojars.org/repo/
Reading project from cascalog-core
Retrieving org/apache/hadoop/hadoop-core/1.0.3/hadoop-core-1.0.3.pom (4k)
from http://repo1.maven.org/maven2/
Retrieving commons-cli/commons-cli/1.2/commons-cli-1.2.pom (8k)
from http://repo1.maven.org/maven2/
Retrieving org/apache/commons/commons-parent/11/commons-parent-11.pom (24k)
from http://repo1.maven.org/maven2/
Retrieving org/apache/apache/4/apache-4.pom (4k)
from http://repo1.maven.org/maven2/
Retrieving xmlenc/xmlenc/0.52/xmlenc-0.52.pom (1k)
from http://repo1.maven.org/maven2/
Retrieving commons-httpclient/commons-httpclient/3.0.1/commons-httpclient-3.0.1.pom (8k)
from http://repo1.maven.org/maven2/
Retrieving junit/junit/3.8.1/junit-3.8.1.pom (1k)
from http://repo1.maven.org/maven2/
Retrieving commons-logging/commons-logging/1.0.3/commons-logging-1.0.3.pom (1k)
from http://repo1.maven.org/maven2/
Retrieving commons-codec/commons-codec/1.2/commons-codec-1.2.pom (4k)
from http://repo1.maven.org/maven2/
Retrieving commons-codec/commons-codec/1.4/commons-codec-1.4.pom (10k)
from http://repo1.maven.org/maven2/
Retrieving org/apache/commons/commons-math/2.1/commons-math-2.1.pom (10k)
from http://repo1.maven.org/maven2/
Retrieving org/apache/commons/commons-parent/14/commons-parent-14.pom (31k)
from http://repo1.maven.org/maven2/
Retrieving org/apache/apache/7/apache-7.pom (14k)
from http://repo1.maven.org/maven2/
Retrieving commons-configuration/commons-configuration/1.6/commons-configuration-1.6.pom (13k)
from http://repo1.maven.org/maven2/
Retrieving commons-collections/commons-collections/3.2.1/commons-collections-3.2.1.pom (12k)
from http://repo1.maven.org/maven2/
Retrieving org/apache/commons/commons-parent/9/commons-parent-9.pom (21k)
from http://repo1.maven.org/maven2/
Retrieving commons-lang/commons-lang/2.4/commons-lang-2.4.pom (14k)
from http://repo1.maven.org/maven2/
Retrieving commons-logging/commons-logging/1.1.1/commons-logging-1.1.1.pom (18k)
from http://repo1.maven.org/maven2/
Retrieving org/apache/commons/commons-parent/5/commons-parent-5.pom (16k)
from http://repo1.maven.org/maven2/
Retrieving commons-digester/commons-digester/1.8/commons-digester-1.8.pom (7k)
from http://repo1.maven.org/maven2/
Retrieving commons-beanutils/commons-beanutils/1.7.0/commons-beanutils-1.7.0.pom (1k)
from http://repo1.maven.org/maven2/
Retrieving commons-logging/commons-logging/1.1/commons-logging-1.1.pom (6k)
from http://repo1.maven.org/maven2/
Retrieving logkit/logkit/1.0.1/logkit-1.0.1.pom (1k)
from http://repo1.maven.org/maven2/
Retrieving avalon-framework/avalon-framework/4.1.3/avalon-framework-4.1.3.pom (1k)
from http://repo1.maven.org/maven2/
Retrieving javax/servlet/servlet-api/2.3/servlet-api-2.3.pom (1k)
from http://repo1.maven.org/maven2/
Retrieving commons-beanutils/commons-beanutils-core/1.8.0/commons-beanutils-core-1.8.0.pom (2k)
from http://repo1.maven.org/maven2/
Retrieving commons-net/commons-net/1.4.1/commons-net-1.4.1.pom (5k)
from http://repo1.maven.org/maven2/
Retrieving oro/oro/2.0.8/oro-2.0.8.pom (1k)from http://repo1.maven.org/maven2/
Retrieving org/mortbay/jetty/jetty/6.1.26/jetty-6.1.26.pom (6k)
from http://repo1.maven.org/maven2/
Retrieving org/mortbay/jetty/project/6.1.26/project-6.1.26.pom (9k)
from http://repo1.maven.org/maven2/
Retrieving org/mortbay/jetty/jetty-parent/10/jetty-parent-10.pom (3k)
from http://repo1.maven.org/maven2/
Retrieving org/eclipse/jetty/jetty-parent/14/jetty-parent-14.pom (16k)
from http://repo1.maven.org/maven2/
^Cbash-3.2$
bash-3.2$ rm -rf ~/.m2/
bash-3.2$ lein clean
Could not find artifact lein-newnew:lein-newnew:pom:0.3.5 in central (http://repo1.maven.org/maven2)
Retrieving lein-newnew/lein-newnew/0.3.5/lein-newnew-0.3.5.pom (3k)
from https://clojars.org/repo/
Could not find artifact stencil:stencil:pom:0.3.0 in central (http://repo1.maven.org/maven2)
Retrieving stencil/stencil/0.3.0/stencil-0.3.0.pom (3k)
from https://clojars.org/repo/
Retrieving org/clojure/clojure/1.3.0/clojure-1.3.0.pom (5k)
from http://repo1.maven.org/maven2/
Retrieving org/sonatype/oss/oss-parent/5/oss-parent-5.pom (4k)
from http://repo1.maven.org/maven2/
Could not find artifact scout:scout:pom:0.1.0 in central (http://repo1.maven.org/maven2)
Retrieving scout/scout/0.1.0/scout-0.1.0.pom (2k)from https://clojars.org/repo/
Could not find artifact quoin:quoin:pom:0.1.0 in central (http://repo1.maven.org/maven2)
Retrieving quoin/quoin/0.1.0/quoin-0.1.0.pom (2k)from https://clojars.org/repo/
Could not find artifact slingshot:slingshot:pom:0.8.0 in central (http://repo1.maven.org/maven2)
Retrieving slingshot/slingshot/0.8.0/slingshot-0.8.0.pom (1k)
from https://clojars.org/repo/
Retrieving org/clojure/clojure/1.2.1/clojure-1.2.1.pom (1k)
from http://repo1.maven.org/maven2/
Retrieving org/clojure/core.cache/0.6.1/core.cache-0.6.1.pom (2k)
from http://repo1.maven.org/maven2/
Retrieving org/clojure/pom.contrib/0.0.26/pom.contrib-0.0.26.pom (5k)
from http://repo1.maven.org/maven2/
Retrieving org/clojure/clojure/1.4.0/clojure-1.4.0.pom (5k)
from http://repo1.maven.org/maven2/
Could not find artifact bultitude:bultitude:pom:0.1.7 in central (http://repo1.maven.org/maven2)
Retrieving bultitude/bultitude/0.1.7/bultitude-0.1.7.pom (2k)
from https://clojars.org/repo/
Could not find artifact lein-sub:lein-sub:pom:0.2.1 in central (http://repo1.maven.org/maven2)
Retrieving lein-sub/lein-sub/0.2.1/lein-sub-0.2.1.pom (2k)
from https://clojars.org/repo/
Could not find artifact codox:codox:pom:0.6.4 in central (http://repo1.maven.org/maven2)
Retrieving codox/codox/0.6.4/codox-0.6.4.pom (2k)from https://clojars.org/repo/
Could not find artifact codox:codox.leiningen:pom:0.6.4 in central (http://repo1.maven.org/maven2)
Retrieving codox/codox.leiningen/0.6.4/codox.leiningen-0.6.4.pom (2k)
from https://clojars.org/repo/
Could not find artifact leinjacker:leinjacker:pom:0.4.1 in central (http://repo1.maven.org/maven2)
Retrieving leinjacker/leinjacker/0.4.1/leinjacker-0.4.1.pom (3k)
from https://clojars.org/repo/
Retrieving org/clojure/core.contracts/0.0.1/core.contracts-0.0.1.pom (1k)
from http://repo1.maven.org/maven2/
Retrieving org/clojure/core.unify/0.5.3/core.unify-0.5.3.pom (1k)
from http://repo1.maven.org/maven2/
Could not find artifact lein-newnew:lein-newnew:jar:0.3.5 in central (http://repo1.maven.org/maven2)
Could not find artifact stencil:stencil:jar:0.3.0 in central (http://repo1.maven.org/maven2)
Could not find artifact scout:scout:jar:0.1.0 in central (http://repo1.maven.org/maven2)
Could not find artifact quoin:quoin:jar:0.1.0 in central (http://repo1.maven.org/maven2)
Retrieving org/clojure/clojure/1.3.0/clojure-1.3.0.jar (3311k)
from http://repo1.maven.org/maven2/
Could not find artifact slingshot:slingshot:jar:0.8.0 in central (http://repo1.maven.org/maven2)
Retrieving org/clojure/core.cache/0.6.1/core.cache-0.6.1.jar (11k)
from http://repo1.maven.org/maven2/
Could not find artifact lein-sub:lein-sub:jar:0.2.1 in central (http://repo1.maven.org/maven2)Could not find artifact bultitude:bultitude:jar:0.1.7 in central (http://repo1.maven.org/maven2)
Could not find artifact codox:codox:jar:0.6.4 in central (http://repo1.maven.org/maven2)Could not find artifact codox:codox.leiningen:jar:0.6.4 in central (http://repo1.maven.org/maven2)
Could not find artifact leinjacker:leinjacker:jar:0.4.1 in central (http://repo1.maven.org/maven2)
Retrieving org/clojure/core.contracts/0.0.1/core.contracts-0.0.1.jar (5k)
from http://repo1.maven.org/maven2/
Retrieving org/clojure/core.unify/0.5.3/core.unify-0.5.3.jar (4k)
from http://repo1.maven.org/maven2/
Retrieving slingshot/slingshot/0.8.0/slingshot-0.8.0.jar (6k)
from https://clojars.org/repo/
Retrieving quoin/quoin/0.1.0/quoin-0.1.0.jar (3k)from https://clojars.org/repo/
Retrieving scout/scout/0.1.0/scout-0.1.0.jar (4k)from https://clojars.org/repo/
Retrieving bultitude/bultitude/0.1.7/bultitude-0.1.7.jar (4k)
from https://clojars.org/repo/
Retrieving stencil/stencil/0.3.0/stencil-0.3.0.jar (13k)
from https://clojars.org/repo/
Retrieving lein-newnew/lein-newnew/0.3.5/lein-newnew-0.3.5.jar (15k)
from https://clojars.org/repo/
Retrieving lein-sub/lein-sub/0.2.1/lein-sub-0.2.1.jar (2k)
from https://clojars.org/repo/
Retrieving codox/codox.leiningen/0.6.4/codox.leiningen-0.6.4.jar (2k)
from https://clojars.org/repo/
Retrieving codox/codox/0.6.4/codox-0.6.4.jar (2k)from https://clojars.org/repo/
Retrieving leinjacker/leinjacker/0.4.1/leinjacker-0.4.1.jar (8k)
from https://clojars.org/repo/
bash-3.2$ lein do sub install, deps, compile, repl
Reading project from cascalog-core
Retrieving org/apache/hadoop/hadoop-core/1.0.3/hadoop-core-1.0.3.pom (4k)
from http://repo1.maven.org/maven2/
Retrieving commons-cli/commons-cli/1.2/commons-cli-1.2.pom (8k)
from http://repo1.maven.org/maven2/
Retrieving org/apache/commons/commons-parent/11/commons-parent-11.pom (24k)
from http://repo1.maven.org/maven2/
Retrieving org/apache/apache/4/apache-4.pom (4k)
from http://repo1.maven.org/maven2/
Retrieving xmlenc/xmlenc/0.52/xmlenc-0.52.pom (1k)
from http://repo1.maven.org/maven2/
Retrieving commons-httpclient/commons-httpclient/3.0.1/commons-httpclient-3.0.1.pom (8k)
from http://repo1.maven.org/maven2/
Retrieving junit/junit/3.8.1/junit-3.8.1.pom (1k)
from http://repo1.maven.org/maven2/
Retrieving commons-logging/commons-logging/1.0.3/commons-logging-1.0.3.pom (1k)
from http://repo1.maven.org/maven2/
Retrieving commons-codec/commons-codec/1.2/commons-codec-1.2.pom (4k)
from http://repo1.maven.org/maven2/
Retrieving commons-codec/commons-codec/1.4/commons-codec-1.4.pom (10k)
from http://repo1.maven.org/maven2/
Retrieving org/apache/commons/commons-math/2.1/commons-math-2.1.pom (10k)
from http://repo1.maven.org/maven2/
Retrieving org/apache/commons/commons-parent/14/commons-parent-14.pom (31k)
from http://repo1.maven.org/maven2/
Retrieving org/apache/apache/7/apache-7.pom (14k)
from http://repo1.maven.org/maven2/
Retrieving commons-configuration/commons-configuration/1.6/commons-configuration-1.6.pom (13k)
from http://repo1.maven.org/maven2/
Retrieving commons-collections/commons-collections/3.2.1/commons-collections-3.2.1.pom (12k)
from http://repo1.maven.org/maven2/
Retrieving org/apache/commons/commons-parent/9/commons-parent-9.pom (21k)
from http://repo1.maven.org/maven2/
Retrieving commons-lang/commons-lang/2.4/commons-lang-2.4.pom (14k)
from http://repo1.maven.org/maven2/
Retrieving commons-logging/commons-logging/1.1.1/commons-logging-1.1.1.pom (18k)
from http://repo1.maven.org/maven2/
Retrieving org/apache/commons/commons-parent/5/commons-parent-5.pom (16k)
from http://repo1.maven.org/maven2/
Retrieving commons-digester/commons-digester/1.8/commons-digester-1.8.pom (7k)
from http://repo1.maven.org/maven2/
Retrieving commons-beanutils/commons-beanutils/1.7.0/commons-beanutils-1.7.0.pom (1k)
from http://repo1.maven.org/maven2/
Retrieving commons-logging/commons-logging/1.1/commons-logging-1.1.pom (6k)
from http://repo1.maven.org/maven2/
Retrieving logkit/logkit/1.0.1/logkit-1.0.1.pom (1k)
from http://repo1.maven.org/maven2/
Retrieving avalon-framework/avalon-framework/4.1.3/avalon-framework-4.1.3.pom (1k)
from http://repo1.maven.org/maven2/
Retrieving javax/servlet/servlet-api/2.3/servlet-api-2.3.pom (1k)
from http://repo1.maven.org/maven2/
Retrieving commons-beanutils/commons-beanutils-core/1.8.0/commons-beanutils-core-1.8.0.pom (2k)
from http://repo1.maven.org/maven2/
Retrieving commons-net/commons-net/1.4.1/commons-net-1.4.1.pom (5k)
from http://repo1.maven.org/maven2/
Retrieving oro/oro/2.0.8/oro-2.0.8.pom (1k)from http://repo1.maven.org/maven2/
Retrieving org/mortbay/jetty/jetty/6.1.26/jetty-6.1.26.pom (6k)
from http://repo1.maven.org/maven2/
Retrieving org/mortbay/jetty/project/6.1.26/project-6.1.26.pom (9k)
from http://repo1.maven.org/maven2/
Retrieving org/mortbay/jetty/jetty-parent/10/jetty-parent-10.pom (3k)
from http://repo1.maven.org/maven2/
Retrieving org/eclipse/jetty/jetty-parent/14/jetty-parent-14.pom (16k)
from http://repo1.maven.org/maven2/
Retrieving org/mortbay/jetty/jetty-util/6.1.26/jetty-util-6.1.26.pom (4k)
from http://repo1.maven.org/maven2/
Retrieving org/mortbay/jetty/servlet-api/2.5-20081211/servlet-api-2.5-20081211.pom (3k)
from http://repo1.maven.org/maven2/
Retrieving org/mortbay/jetty/jetty-parent/7/jetty-parent-7.pom (13k)
from http://repo1.maven.org/maven2/
Retrieving tomcat/jasper-runtime/5.5.12/jasper-runtime-5.5.12.pom (1k)
from http://repo1.maven.org/maven2/
Retrieving tomcat/jasper-compiler/5.5.12/jasper-compiler-5.5.12.pom (1k)
from http://repo1.maven.org/maven2/
Retrieving org/mortbay/jetty/jsp-api-2.1/6.1.14/jsp-api-2.1-6.1.14.pom (4k)
from http://repo1.maven.org/maven2/
Retrieving org/mortbay/jetty/project/6.1.14/project-6.1.14.pom (9k)
from http://repo1.maven.org/maven2/
Retrieving org/mortbay/jetty/servlet-api-2.5/6.1.14/servlet-api-2.5-6.1.14.pom (3k)
from http://repo1.maven.org/maven2/
Retrieving org/mortbay/jetty/jsp-2.1/6.1.14/jsp-2.1-6.1.14.pom (6k)
from http://repo1.maven.org/maven2/
Retrieving org/eclipse/jdt/core/3.1.1/core-3.1.1.pom (1k)
from http://repo1.maven.org/maven2/
Retrieving ant/ant/1.6.5/ant-1.6.5.pom (1k)from http://repo1.maven.org/maven2/
Retrieving commons-el/commons-el/1.0/commons-el-1.0.pom (4k)
from http://repo1.maven.org/maven2/
Retrieving net/java/dev/jets3t/jets3t/0.7.1/jets3t-0.7.1.pom (1k)
from http://repo1.maven.org/maven2/
Retrieving commons-codec/commons-codec/1.3/commons-codec-1.3.pom (6k)
from http://repo1.maven.org/maven2/
Retrieving commons-httpclient/commons-httpclient/3.1/commons-httpclient-3.1.pom (8k)
from http://repo1.maven.org/maven2/
Retrieving commons-logging/commons-logging/1.0.4/commons-logging-1.0.4.pom (5k)
from http://repo1.maven.org/maven2/
Retrieving net/sf/kosmosfs/kfs/0.3/kfs-0.3.pom (1k)
from http://repo1.maven.org/maven2/
Retrieving hsqldb/hsqldb/1.8.0.10/hsqldb-1.8.0.10.pom (1k)
from http://repo1.maven.org/maven2/
Retrieving org/codehaus/jackson/jackson-mapper-asl/1.0.1/jackson-mapper-asl-1.0.1.pom (1k)
from http://repo1.maven.org/maven2/
Retrieving org/codehaus/jackson/jackson-core-asl/1.0.1/jackson-core-asl-1.0.1.pom (1k)
from http://repo1.maven.org/maven2/
Retrieving org/clojure/tools.macro/0.1.1/tools.macro-0.1.1.pom (1k)
from http://repo1.maven.org/maven2/
Retrieving org/clojure/pom.contrib/0.0.20/pom.contrib-0.0.20.pom (5k)
from http://repo1.maven.org/maven2/
Retrieving org/clojure/clojure/1.3.0-alpha5/clojure-1.3.0-alpha5.pom (5k)
from http://repo1.maven.org/maven2/
Retrieving log4j/log4j/1.2.16/log4j-1.2.16.pom (20k)
from http://repo1.maven.org/maven2/
Retrieving org/slf4j/slf4j-log4j12/1.6.6/slf4j-log4j12-1.6.6.pom (2k)
from http://repo1.maven.org/maven2/
Retrieving org/slf4j/slf4j-parent/1.6.6/slf4j-parent-1.6.6.pom (13k)
from http://repo1.maven.org/maven2/
Retrieving org/slf4j/slf4j-api/1.6.6/slf4j-api-1.6.6.pom (3k)
from http://repo1.maven.org/maven2/
Could not find artifact cascading:cascading-hadoop:pom:2.2.0-wip-19 in central (http://repo1.maven.org/maven2)
Could not find artifact cascading:cascading-hadoop:pom:2.2.0-wip-19 in clojars (https://clojars.org/repo/)
Retrieving cascading/cascading-hadoop/2.2.0-wip-19/cascading-hadoop-2.2.0-wip-19.pom (2k)
from http://conjars.org/repo/
Could not find artifact cascading:cascading-core:pom:2.2.0-wip-19 in central (http://repo1.maven.org/maven2)
Could not find artifact cascading:cascading-core:pom:2.2.0-wip-19 in clojars (https://clojars.org/repo/)
Retrieving cascading/cascading-core/2.2.0-wip-19/cascading-core-2.2.0-wip-19.pom (2k)
from http://conjars.org/repo/
Could not find artifact riffle:riffle:pom:0.1-dev in central (http://repo1.maven.org/maven2)
Could not find artifact riffle:riffle:pom:0.1-dev in clojars (https://clojars.org/repo/)
Retrieving riffle/riffle/0.1-dev/riffle-0.1-dev.pom (1k)
from http://conjars.org/repo/
Could not find artifact thirdparty:jgrapht-jdk1.6:pom:0.8.1 in central (http://repo1.maven.org/maven2)
Could not find artifact thirdparty:jgrapht-jdk1.6:pom:0.8.1 in clojars (https://clojars.org/repo/)
Retrieving thirdparty/jgrapht-jdk1.6/0.8.1/jgrapht-jdk1.6-0.8.1.pom (1k)
from http://conjars.org/repo/
Could not find artifact cascading.kryo:cascading.kryo:pom:0.4.6 in central (http://repo1.maven.org/maven2)
Could not find artifact cascading.kryo:cascading.kryo:pom:0.4.6 in clojars (https://clojars.org/repo/)
Retrieving cascading/kryo/cascading.kryo/0.4.6/cascading.kryo-0.4.6.pom (4k)
from http://conjars.org/repo/
Retrieving com/esotericsoftware/kryo/kryo/2.17/kryo-2.17.pom (5k)
from http://repo1.maven.org/maven2/
Retrieving org/sonatype/oss/oss-parent/7/oss-parent-7.pom (5k)
from http://repo1.maven.org/maven2/
Retrieving com/esotericsoftware/reflectasm/reflectasm/1.07/reflectasm-1.07.pom (3k)
from http://repo1.maven.org/maven2/
Retrieving org/ow2/asm/asm/4.0/asm-4.0.pom (2k)
from http://repo1.maven.org/maven2/
Retrieving org/ow2/asm/asm-parent/4.0/asm-parent-4.0.pom (5k)
from http://repo1.maven.org/maven2/
Retrieving org/ow2/ow2/1.3/ow2-1.3.pom (9k)from http://repo1.maven.org/maven2/
Retrieving com/esotericsoftware/minlog/minlog/1.2/minlog-1.2.pom (2k)
from http://repo1.maven.org/maven2/
Retrieving org/objenesis/objenesis/1.2/objenesis-1.2.pom (3k)
from http://repo1.maven.org/maven2/
Retrieving org/objenesis/objenesis-parent/1.2/objenesis-parent-1.2.pom (10k)
from http://repo1.maven.org/maven2/
Could not find artifact com.twitter:carbonite:pom:1.3.1 in central (http://repo1.maven.org/maven2)
Retrieving com/twitter/carbonite/1.3.1/carbonite-1.3.1.pom (2k)
from https://clojars.org/repo/
Could not find artifact com.twitter:meat-locker:pom:0.3.1 in central (http://repo1.maven.org/maven2)
Retrieving com/twitter/meat-locker/0.3.1/meat-locker-0.3.1.pom (3k)
from https://clojars.org/repo/
Could not find artifact com.twitter:maple:pom:0.2.2 in central (http://repo1.maven.org/maven2)
Could not find artifact com.twitter:maple:pom:0.2.2 in clojars (https://clojars.org/repo/)
Retrieving com/twitter/maple/0.2.2/maple-0.2.2.pom (3k)
from http://conjars.org/repo/
Could not find artifact jackknife:jackknife:pom:0.1.2 in central (http://repo1.maven.org/maven2)
Retrieving jackknife/jackknife/0.1.2/jackknife-0.1.2.pom (2k)
from https://clojars.org/repo/
Retrieving org/clojure/tools.logging/0.2.3/tools.logging-0.2.3.pom (2k)
from http://repo1.maven.org/maven2/
Retrieving org/clojure/pom.contrib/0.0.23/pom.contrib-0.0.23.pom (5k)
from http://repo1.maven.org/maven2/
Retrieving org/clojure/clojure/1.3.0-beta1/clojure-1.3.0-beta1.pom (5k)
from http://repo1.maven.org/maven2/
Could not find artifact hadoop-util:hadoop-util:pom:0.2.9 in central (http://repo1.maven.org/maven2)
Retrieving hadoop-util/hadoop-util/0.2.9/hadoop-util-0.2.9.pom (3k)
from https://clojars.org/repo/
Retrieving xmlenc/xmlenc/0.52/xmlenc-0.52.jar (15k)
from http://repo1.maven.org/maven2/
Retrieving commons-cli/commons-cli/1.2/commons-cli-1.2.jar (40k)
from http://repo1.maven.org/maven2/
Retrieving commons-httpclient/commons-httpclient/3.0.1/commons-httpclient-3.0.1.jar (273k)
from http://repo1.maven.org/maven2/
Retrieving junit/junit/3.8.1/junit-3.8.1.jar (118k)
from http://repo1.maven.org/maven2/
Retrieving org/apache/hadoop/hadoop-core/1.0.3/hadoop-core-1.0.3.jar (3836k)
from http://repo1.maven.org/maven2/
Retrieving commons-logging/commons-logging/1.0.3/commons-logging-1.0.3.jar (31k)
from http://repo1.maven.org/maven2/
Retrieving commons-codec/commons-codec/1.4/commons-codec-1.4.jar (57k)
from http://repo1.maven.org/maven2/
Retrieving org/apache/commons/commons-math/2.1/commons-math-2.1.jar (813k)
from http://repo1.maven.org/maven2/
Retrieving commons-configuration/commons-configuration/1.6/commons-configuration-1.6.jar (292k)
from http://repo1.maven.org/maven2/
Retrieving commons-collections/commons-collections/3.2.1/commons-collections-3.2.1.jar (562k)
from http://repo1.maven.org/maven2/
Retrieving commons-lang/commons-lang/2.4/commons-lang-2.4.jar (256k)
from http://repo1.maven.org/maven2/
Retrieving commons-digester/commons-digester/1.8/commons-digester-1.8.jar (140k)
from http://repo1.maven.org/maven2/
Retrieving commons-beanutils/commons-beanutils/1.7.0/commons-beanutils-1.7.0.jar (184k)
from http://repo1.maven.org/maven2/
Retrieving commons-beanutils/commons-beanutils-core/1.8.0/commons-beanutils-core-1.8.0.jar (201k)
from http://repo1.maven.org/maven2/
Retrieving commons-net/commons-net/1.4.1/commons-net-1.4.1.jar (177k)
from http://repo1.maven.org/maven2/
Retrieving org/mortbay/jetty/jetty/6.1.26/jetty-6.1.26.jar (527k)
from http://repo1.maven.org/maven2/
Retrieving org/mortbay/jetty/servlet-api/2.5-20081211/servlet-api-2.5-20081211.jar (131k)
from http://repo1.maven.org/maven2/
Retrieving org/mortbay/jetty/jetty-util/6.1.26/jetty-util-6.1.26.jar (173k)
from http://repo1.maven.org/maven2/
Retrieving tomcat/jasper-runtime/5.5.12/jasper-runtime-5.5.12.jar (75k)
from http://repo1.maven.org/maven2/
Retrieving tomcat/jasper-compiler/5.5.12/jasper-compiler-5.5.12.jar (396k)
from http://repo1.maven.org/maven2/
Retrieving org/mortbay/jetty/jsp-api-2.1/6.1.14/jsp-api-2.1-6.1.14.jar (132k)
from http://repo1.maven.org/maven2/
Retrieving org/mortbay/jetty/servlet-api-2.5/6.1.14/servlet-api-2.5-6.1.14.jar (129k)
from http://repo1.maven.org/maven2/
Retrieving org/mortbay/jetty/jsp-2.1/6.1.14/jsp-2.1-6.1.14.jar (1001k)
from http://repo1.maven.org/maven2/
Retrieving ant/ant/1.6.5/ant-1.6.5.jar (1010k)from http://repo1.maven.org/maven2/
Retrieving commons-el/commons-el/1.0/commons-el-1.0.jar (110k)
from http://repo1.maven.org/maven2/
Retrieving net/java/dev/jets3t/jets3t/0.7.1/jets3t-0.7.1.jar (369k)
from http://repo1.maven.org/maven2/
Retrieving net/sf/kosmosfs/kfs/0.3/kfs-0.3.jar (12k)
from http://repo1.maven.org/maven2/
Retrieving hsqldb/hsqldb/1.8.0.10/hsqldb-1.8.0.10.jar (690k)
from http://repo1.maven.org/maven2/
Retrieving oro/oro/2.0.8/oro-2.0.8.jar (64k)from http://repo1.maven.org/maven2/
Retrieving org/eclipse/jdt/core/3.1.1/core-3.1.1.jar (3483k)
from http://repo1.maven.org/maven2/
Retrieving org/codehaus/jackson/jackson-mapper-asl/1.0.1/jackson-mapper-asl-1.0.1.jar (264k)
from http://repo1.maven.org/maven2/
Retrieving org/codehaus/jackson/jackson-core-asl/1.0.1/jackson-core-asl-1.0.1.jar (133k)
from http://repo1.maven.org/maven2/
Retrieving org/clojure/clojure/1.4.0/clojure-1.4.0.jar (3341k)
from http://repo1.maven.org/maven2/
Retrieving org/clojure/tools.macro/0.1.1/tools.macro-0.1.1.jar (5k)
from http://repo1.maven.org/maven2/
Retrieving log4j/log4j/1.2.16/log4j-1.2.16.jar (470k)
from http://repo1.maven.org/maven2/
Retrieving org/slf4j/slf4j-log4j12/1.6.6/slf4j-log4j12-1.6.6.jar (9k)
from http://repo1.maven.org/maven2/
Retrieving org/slf4j/slf4j-api/1.6.6/slf4j-api-1.6.6.jar (26k)
from http://repo1.maven.org/maven2/
Could not find artifact cascading:cascading-hadoop:jar:2.2.0-wip-19 in central (http://repo1.maven.org/maven2)
Could not find artifact cascading:cascading-core:jar:2.2.0-wip-19 in central (http://repo1.maven.org/maven2)
Could not find artifact riffle:riffle:jar:0.1-dev in central (http://repo1.maven.org/maven2)
Could not find artifact cascading.kryo:cascading.kryo:jar:0.4.6 in central (http://repo1.maven.org/maven2)
Could not find artifact thirdparty:jgrapht-jdk1.6:jar:0.8.1 in central (http://repo1.maven.org/maven2)
Retrieving com/esotericsoftware/kryo/kryo/2.17/kryo-2.17.jar (157k)
from http://repo1.maven.org/maven2/
Retrieving com/esotericsoftware/reflectasm/reflectasm/1.07/reflectasm-1.07-shaded.jar (64k)
from http://repo1.maven.org/maven2/
Retrieving org/ow2/asm/asm/4.0/asm-4.0.jar (45k)
from http://repo1.maven.org/maven2/
Retrieving com/esotericsoftware/minlog/minlog/1.2/minlog-1.2.jar (5k)
from http://repo1.maven.org/maven2/
Retrieving org/objenesis/objenesis/1.2/objenesis-1.2.jar (35k)
from http://repo1.maven.org/maven2/
Could not find artifact com.twitter:carbonite:jar:1.3.1 in central (http://repo1.maven.org/maven2)
Could not find artifact com.twitter:meat-locker:jar:0.3.1 in central (http://repo1.maven.org/maven2)
Could not find artifact com.twitter:maple:jar:0.2.2 in central (http://repo1.maven.org/maven2)
Retrieving org/clojure/tools.logging/0.2.3/tools.logging-0.2.3.jar (7k)
from http://repo1.maven.org/maven2/
Could not find artifact jackknife:jackknife:jar:0.1.2 in central (http://repo1.maven.org/maven2)
Could not find artifact hadoop-util:hadoop-util:jar:0.2.9 in central (http://repo1.maven.org/maven2)
Could not find artifact cascading:cascading-hadoop:jar:2.2.0-wip-19 in clojars (https://clojars.org/repo/)
Could not find artifact cascading:cascading-core:jar:2.2.0-wip-19 in clojars (https://clojars.org/repo/)
Could not find artifact thirdparty:jgrapht-jdk1.6:jar:0.8.1 in clojars (https://clojars.org/repo/)
Could not find artifact cascading.kryo:cascading.kryo:jar:0.4.6 in clojars (https://clojars.org/repo/)
Could not find artifact riffle:riffle:jar:0.1-dev in clojars (https://clojars.org/repo/)
Retrieving com/twitter/carbonite/1.3.1/carbonite-1.3.1.jar (18k)
from https://clojars.org/repo/
Could not find artifact com.twitter:maple:jar:0.2.2 in clojars (https://clojars.org/repo/)
Retrieving com/twitter/meat-locker/0.3.1/meat-locker-0.3.1.jar (12k)
from https://clojars.org/repo/
Retrieving jackknife/jackknife/0.1.2/jackknife-0.1.2.jar (5k)
from https://clojars.org/repo/
Retrieving hadoop-util/hadoop-util/0.2.9/hadoop-util-0.2.9.jar (6k)
from https://clojars.org/repo/
Retrieving thirdparty/jgrapht-jdk1.6/0.8.1/jgrapht-jdk1.6-0.8.1.jar (229k)
from http://conjars.org/repo/
Retrieving cascading/kryo/cascading.kryo/0.4.6/cascading.kryo-0.4.6.jar (14k)
from http://conjars.org/repo/
Retrieving cascading/cascading-core/2.2.0-wip-19/cascading-core-2.2.0-wip-19.jar (604k)
from http://conjars.org/repo/
Retrieving cascading/cascading-hadoop/2.2.0-wip-19/cascading-hadoop-2.2.0-wip-19.jar (221k)
from http://conjars.org/repo/
Retrieving riffle/riffle/0.1-dev/riffle-0.1-dev.jar (11k)
from http://conjars.org/repo/
Retrieving com/twitter/maple/0.2.2/maple-0.2.2.jar (76k)
from http://conjars.org/repo/
Created /Users/ceteri/opt/cascalog/cascalog-core/target/cascalog-core-1.10.1-SNAPSHOT.jar
Wrote /Users/ceteri/opt/cascalog/cascalog-core/pom.xml
Reading project from cascalog-checkpoint
Could not find artifact hadoop-util:hadoop-util:pom:0.2.8 in central (http://repo1.maven.org/maven2)
Retrieving hadoop-util/hadoop-util/0.2.8/hadoop-util-0.2.8.pom (2k)
from https://clojars.org/repo/
Could not find artifact hadoop-util:hadoop-util:jar:0.2.8 in central (http://repo1.maven.org/maven2)
Retrieving hadoop-util/hadoop-util/0.2.8/hadoop-util-0.2.8.jar (5k)
from https://clojars.org/repo/
Created /Users/ceteri/opt/cascalog/cascalog-checkpoint/target/cascalog-checkpoint-1.10.1-SNAPSHOT.jar
Wrote /Users/ceteri/opt/cascalog/cascalog-checkpoint/pom.xml
Reading project from cascalog-more-taps
Created /Users/ceteri/opt/cascalog/cascalog-more-taps/target/cascalog-more-taps-1.10.1-SNAPSHOT.jar
Wrote /Users/ceteri/opt/cascalog/cascalog-more-taps/pom.xml
Reading project from cascalog-elephantdb
Could not find artifact elephantdb:elephantdb-cascading:pom:0.3.5 in central (http://repo1.maven.org/maven2)
Retrieving elephantdb/elephantdb-cascading/0.3.5/elephantdb-cascading-0.3.5.pom (4k)
from https://clojars.org/repo/
Could not find artifact elephantdb:elephantdb:pom:0.2.0 in central (http://repo1.maven.org/maven2)
Retrieving elephantdb/elephantdb/0.2.0/elephantdb-0.2.0.pom (6k)
from https://clojars.org/repo/
Could not find artifact jvyaml:jvyaml:pom:1.0.0 in central (http://repo1.maven.org/maven2)
Retrieving jvyaml/jvyaml/1.0.0/jvyaml-1.0.0.pom (1k)
from https://clojars.org/repo/
Retrieving org/yaml/snakeyaml/1.9/snakeyaml-1.9.pom (14k)
from http://repo1.maven.org/maven2/
Retrieving commons-io/commons-io/1.4/commons-io-1.4.pom (13k)
from http://repo1.maven.org/maven2/
Retrieving org/apache/commons/commons-parent/7/commons-parent-7.pom (17k)
from http://repo1.maven.org/maven2/
Retrieving org/apache/thrift/libthrift/0.8.0/libthrift-0.8.0.pom (3k)
from http://repo1.maven.org/maven2/
Retrieving commons-lang/commons-lang/2.5/commons-lang-2.5.pom (17k)
from http://repo1.maven.org/maven2/
Retrieving org/apache/commons/commons-parent/12/commons-parent-12.pom (26k)
from http://repo1.maven.org/maven2/
Retrieving org/apache/httpcomponents/httpclient/4.1.2/httpclient-4.1.2.pom (6k)
from http://repo1.maven.org/maven2/
Retrieving org/apache/httpcomponents/httpcomponents-client/4.1.2/httpcomponents-client-4.1.2.pom (11k)
from http://repo1.maven.org/maven2/
Retrieving org/apache/httpcomponents/project/4.1.1/project-4.1.1.pom (16k)
from http://repo1.maven.org/maven2/
Retrieving org/apache/httpcomponents/httpcore/4.1.2/httpcore-4.1.2.pom (7k)
from http://repo1.maven.org/maven2/
Retrieving org/apache/httpcomponents/httpcomponents-core/4.1.2/httpcomponents-core-4.1.2.pom (10k)
from http://repo1.maven.org/maven2/
Retrieving org/apache/httpcomponents/httpcore/4.1.3/httpcore-4.1.3.pom (7k)
from http://repo1.maven.org/maven2/
Retrieving org/apache/httpcomponents/httpcomponents-core/4.1.3/httpcomponents-core-4.1.3.pom (10k)
from http://repo1.maven.org/maven2/
Retrieving org/slf4j/slf4j-log4j12/1.6.4/slf4j-log4j12-1.6.4.pom (2k)
from http://repo1.maven.org/maven2/
Retrieving org/slf4j/slf4j-parent/1.6.4/slf4j-parent-1.6.4.pom (12k)
from http://repo1.maven.org/maven2/
Retrieving org/slf4j/slf4j-api/1.6.4/slf4j-api-1.6.4.pom (3k)
from http://repo1.maven.org/maven2/
Could not find artifact com.sleepycat:je:pom:5.0.58 in central (http://repo1.maven.org/maven2)
Could not find artifact com.sleepycat:je:pom:5.0.58 in clojars (https://clojars.org/repo/)
Could not find artifact com.sleepycat:je:pom:5.0.58 in conjars.org (http://conjars.org/repo)
Could not find artifact com.sleepycat:je:pom:5.0.58 in conjars (http://conjars.org/repo)
Could not find artifact com.sleepycat:je:pom:5.0.58 in fusesource.nexus.snapshot (http://repo.fusesource.com/nexus/content/groups/public-snapshots)
Retrieving com/sleepycat/je/5.0.58/je-5.0.58.pom (2k)
from http://download.oracle.com/maven/
Retrieving org/apache/lucene/lucene-core/3.0.3/lucene-core-3.0.3.pom (1k)
from http://repo1.maven.org/maven2/
Retrieving org/apache/lucene/lucene-parent/3.0.3/lucene-parent-3.0.3.pom (3k)
from http://repo1.maven.org/maven2/
Retrieving org/apache/lucene/lucene-queries/3.0.3/lucene-queries-3.0.3.pom (1k)
from http://repo1.maven.org/maven2/
Retrieving org/apache/lucene/lucene-contrib/3.0.3/lucene-contrib-3.0.3.pom (2k)
from http://repo1.maven.org/maven2/
Retrieving org/fusesource/leveldbjni/leveldbjni-all/1.4/leveldbjni-all-1.4.pom (1k)
from http://repo1.maven.org/maven2/
Retrieving org/fusesource/leveldbjni/leveldbjni-project/1.4/leveldbjni-project-1.4.pom (9k)
from http://repo1.maven.org/maven2/
Retrieving org/fusesource/fusesource-pom/1.9/fusesource-pom-1.9.pom (14k)
from http://repo1.maven.org/maven2/
Could not find artifact cascading:cascading-hadoop:pom:2.0.6 in central (http://repo1.maven.org/maven2)
Could not find artifact cascading:cascading-hadoop:pom:2.0.6 in clojars (https://clojars.org/repo/)
Retrieving cascading/cascading-hadoop/2.0.6/cascading-hadoop-2.0.6.pom (1k)
from http://conjars.org/repo/
Could not find artifact cascading:cascading-core:pom:2.0.6 in central (http://repo1.maven.org/maven2)
Could not find artifact cascading:cascading-core:pom:2.0.6 in clojars (https://clojars.org/repo/)
Retrieving cascading/cascading-core/2.0.6/cascading-core-2.0.6.pom (2k)
from http://conjars.org/repo/
Retrieving org/slf4j/slf4j-api/1.6.1/slf4j-api-1.6.1.pom (3k)
from http://repo1.maven.org/maven2/
Retrieving org/slf4j/slf4j-parent/1.6.1/slf4j-parent-1.6.1.pom (9k)
from http://repo1.maven.org/maven2/
Retrieving org/slf4j/slf4j-log4j12/1.6.1/slf4j-log4j12-1.6.1.pom (2k)
from http://repo1.maven.org/maven2/
Retrieving org/codehaus/janino/janino/2.5.16/janino-2.5.16.pom (8k)
from http://repo1.maven.org/maven2/
Retrieving commons-io/commons-io/1.4/commons-io-1.4.jar (106k)
from http://repo1.maven.org/maven2/
Retrieving org/yaml/snakeyaml/1.9/snakeyaml-1.9.jar (260k)
from http://repo1.maven.org/maven2/
Could not find artifact elephantdb:elephantdb-cascading:jar:0.3.5 in central (http://repo1.maven.org/maven2)
Could not find artifact jvyaml:jvyaml:jar:1.0.0 in central (http://repo1.maven.org/maven2)
Could not find artifact elephantdb:elephantdb:jar:0.2.0 in central (http://repo1.maven.org/maven2)
Retrieving commons-lang/commons-lang/2.5/commons-lang-2.5.jar (273k)
from http://repo1.maven.org/maven2/
Retrieving commons-logging/commons-logging/1.1.1/commons-logging-1.1.1.jar (59k)
from http://repo1.maven.org/maven2/
Retrieving org/apache/httpcomponents/httpclient/4.1.2/httpclient-4.1.2.jar (344k)
from http://repo1.maven.org/maven2/
Retrieving org/apache/httpcomponents/httpcore/4.1.3/httpcore-4.1.3.jar (177k)
from http://repo1.maven.org/maven2/
Could not find artifact com.sleepycat:je:jar:5.0.58 in central (http://repo1.maven.org/maven2)
Retrieving org/apache/lucene/lucene-core/3.0.3/lucene-core-3.0.3.jar (1010k)
from http://repo1.maven.org/maven2/
Retrieving org/apache/lucene/lucene-queries/3.0.3/lucene-queries-3.0.3.jar (34k)
from http://repo1.maven.org/maven2/
Retrieving org/fusesource/leveldbjni/leveldbjni-all/1.4/leveldbjni-all-1.4.jar (1018k)
from http://repo1.maven.org/maven2/
Retrieving org/apache/thrift/libthrift/0.8.0/libthrift-0.8.0.jar (329k)
from http://repo1.maven.org/maven2/
Retrieving elephantdb/elephantdb-cascading/0.3.5/elephantdb-cascading-0.3.5.jar (18k)
from https://clojars.org/repo/
Could not find artifact com.sleepycat:je:jar:5.0.58 in clojars (https://clojars.org/repo/)
Retrieving jvyaml/jvyaml/1.0.0/jvyaml-1.0.0.jar (170k)
from https://clojars.org/repo/
Retrieving elephantdb/elephantdb/0.2.0/elephantdb-0.2.0.jar (1658k)
from https://clojars.org/repo/
Could not find artifact com.sleepycat:je:jar:5.0.58 in conjars.org (http://conjars.org/repo)
Could not find artifact com.sleepycat:je:jar:5.0.58 in conjars (http://conjars.org/repo)
Could not find artifact com.sleepycat:je:jar:5.0.58 in fusesource.nexus.snapshot (http://repo.fusesource.com/nexus/content/groups/public-snapshots)
Retrieving com/sleepycat/je/5.0.58/je-5.0.58.jar (2414k)
from http://download.oracle.com/maven/
Created /Users/ceteri/opt/cascalog/cascalog-elephantdb/target/cascalog-elephantdb-1.10.1-SNAPSHOT.jar
Wrote /Users/ceteri/opt/cascalog/cascalog-elephantdb/pom.xml
Reading project from cascalog-lzo
Retrieving com/twitter/elephantbird/elephant-bird-cascading2/3.0.7/elephant-bird-cascading2-3.0.7.pom (1k)
from http://repo1.maven.org/maven2/
Retrieving com/twitter/elephantbird/elephant-bird/3.0.7/elephant-bird-3.0.7.pom (17k)
from http://repo1.maven.org/maven2/
Retrieving com/twitter/elephantbird/elephant-bird-core/3.0.7/elephant-bird-core-3.0.7.pom (3k)
from http://repo1.maven.org/maven2/
Retrieving com/google/guava/guava/11.0.1/guava-11.0.1.pom (5k)
from http://repo1.maven.org/maven2/
Retrieving com/google/guava/guava-parent/11.0.1/guava-parent-11.0.1.pom (2k)
from http://repo1.maven.org/maven2/
Retrieving com/google/code/findbugs/jsr305/1.3.9/jsr305-1.3.9.pom (1k)
from http://repo1.maven.org/maven2/
Retrieving com/google/protobuf/protobuf-java/2.3.0/protobuf-java-2.3.0.pom (7k)
from http://repo1.maven.org/maven2/
Retrieving com/google/google/3/google-3.pom (2k)
from http://repo1.maven.org/maven2/
Retrieving org/apache/thrift/libthrift/0.7.0/libthrift-0.7.0.pom (3k)
from http://repo1.maven.org/maven2/
Retrieving org/slf4j/slf4j-api/1.5.8/slf4j-api-1.5.8.pom (3k)
from http://repo1.maven.org/maven2/
Retrieving org/slf4j/slf4j-parent/1.5.8/slf4j-parent-1.5.8.pom (8k)
from http://repo1.maven.org/maven2/
Retrieving javax/servlet/servlet-api/2.5/servlet-api-2.5.pom (1k)
from http://repo1.maven.org/maven2/
Retrieving org/apache/httpcomponents/httpclient/4.0.1/httpclient-4.0.1.pom (7k)
from http://repo1.maven.org/maven2/
Retrieving org/apache/httpcomponents/httpcomponents-client/4.0.1/httpcomponents-client-4.0.1.pom (9k)
from http://repo1.maven.org/maven2/
Retrieving org/apache/httpcomponents/project/4.0/project-4.0.pom (13k)
from http://repo1.maven.org/maven2/
Retrieving org/apache/httpcomponents/httpcore/4.0.1/httpcore-4.0.1.pom (5k)
from http://repo1.maven.org/maven2/
Retrieving org/apache/httpcomponents/httpcomponents-core/4.0.1/httpcomponents-core-4.0.1.pom (9k)
from http://repo1.maven.org/maven2/
Retrieving com/googlecode/json-simple/json-simple/1.1/json-simple-1.1.pom (1k)
from http://repo1.maven.org/maven2/
Retrieving org/apache/hadoop/hadoop-core/0.20.2/hadoop-core-0.20.2.pom (4k)
from http://repo1.maven.org/maven2/
Retrieving org/mortbay/jetty/jetty/6.1.14/jetty-6.1.14.pom (4k)
from http://repo1.maven.org/maven2/
Retrieving org/mortbay/jetty/jetty-util/6.1.14/jetty-util-6.1.14.pom (3k)
from http://repo1.maven.org/maven2/
Retrieving junit/junit/4.5/junit-4.5.pom (1k)from http://repo1.maven.org/maven2/
Could not find artifact com.hadoop.gplcompression:hadoop-lzo:pom:0.4.16 in central (http://repo1.maven.org/maven2)
Could not find artifact com.hadoop.gplcompression:hadoop-lzo:pom:0.4.16 in clojars (https://clojars.org/repo/)
Could not find artifact com.hadoop.gplcompression:hadoop-lzo:pom:0.4.16 in conjars.org (http://conjars.org/repo)
Retrieving com/hadoop/gplcompression/hadoop-lzo/0.4.16/hadoop-lzo-0.4.16.pom (1k)
from http://maven.twttr.com/
Could not find artifact cascading:cascading-hadoop:pom:2.0.0-wip-288 in central (http://repo1.maven.org/maven2)
Could not find artifact cascading:cascading-hadoop:pom:2.0.0-wip-288 in clojars (https://clojars.org/repo/)
Retrieving cascading/cascading-hadoop/2.0.0-wip-288/cascading-hadoop-2.0.0-wip-288.pom (1k)
from http://conjars.org/repo/
Could not find artifact cascading:cascading-core:pom:2.0.0-wip-288 in central (http://repo1.maven.org/maven2)
Could not find artifact cascading:cascading-core:pom:2.0.0-wip-288 in clojars (https://clojars.org/repo/)
Retrieving cascading/cascading-core/2.0.0-wip-288/cascading-core-2.0.0-wip-288.pom (2k)
from http://conjars.org/repo/
Could not find artifact hadoop-lzo:hadoop-lzo:pom:0.4.15 in central (http://repo1.maven.org/maven2)
Retrieving hadoop-lzo/hadoop-lzo/0.4.15/hadoop-lzo-0.4.15.pom (1k)
from https://clojars.org/repo/
Retrieving com/google/code/findbugs/jsr305/1.3.9/jsr305-1.3.9.jar (32k)
from http://repo1.maven.org/maven2/
Retrieving com/google/guava/guava/11.0.1/guava-11.0.1.jar (1611k)
from http://repo1.maven.org/maven2/
Retrieving com/google/protobuf/protobuf-java/2.3.0/protobuf-java-2.3.0.jar (321k)
from http://repo1.maven.org/maven2/
Retrieving org/apache/thrift/libthrift/0.7.0/libthrift-0.7.0.jar (294k)
from http://repo1.maven.org/maven2/
Retrieving com/twitter/elephantbird/elephant-bird-cascading2/3.0.7/elephant-bird-cascading2-3.0.7.jar (20k)
from http://repo1.maven.org/maven2/
Retrieving com/twitter/elephantbird/elephant-bird-core/3.0.7/elephant-bird-core-3.0.7.jar (662k)
from http://repo1.maven.org/maven2/
Retrieving javax/servlet/servlet-api/2.5/servlet-api-2.5.jar (103k)
from http://repo1.maven.org/maven2/
Retrieving org/apache/httpcomponents/httpclient/4.0.1/httpclient-4.0.1.jar (284k)
from http://repo1.maven.org/maven2/
Retrieving org/apache/httpcomponents/httpcore/4.0.1/httpcore-4.0.1.jar (169k)
from http://repo1.maven.org/maven2/
Retrieving com/googlecode/json-simple/json-simple/1.1/json-simple-1.1.jar (16k)
from http://repo1.maven.org/maven2/
Retrieving org/apache/hadoop/hadoop-core/0.20.2/hadoop-core-0.20.2.jar (2625k)
from http://repo1.maven.org/maven2/
Retrieving commons-codec/commons-codec/1.3/commons-codec-1.3.jar (46k)
from http://repo1.maven.org/maven2/
Retrieving org/mortbay/jetty/jetty/6.1.14/jetty-6.1.14.jar (504k)
from http://repo1.maven.org/maven2/
Retrieving org/mortbay/jetty/jetty-util/6.1.14/jetty-util-6.1.14.jar (159k)
from http://repo1.maven.org/maven2/
Retrieving junit/junit/4.5/junit-4.5.jar (194k)from http://repo1.maven.org/maven2/
Could not find artifact com.hadoop.gplcompression:hadoop-lzo:jar:0.4.16 in central (http://repo1.maven.org/maven2)
Could not find artifact hadoop-lzo:hadoop-lzo:jar:0.4.15 in central (http://repo1.maven.org/maven2)
Retrieving hadoop-lzo/hadoop-lzo/0.4.15/hadoop-lzo-0.4.15.jar (61k)
from https://clojars.org/repo/
Could not find artifact com.hadoop.gplcompression:hadoop-lzo:jar:0.4.16 in clojars (https://clojars.org/repo/)
Could not find artifact com.hadoop.gplcompression:hadoop-lzo:jar:0.4.16 in conjars.org (http://conjars.org/repo)
Retrieving com/hadoop/gplcompression/hadoop-lzo/0.4.16/hadoop-lzo-0.4.16.jar (61k)
from http://maven.twttr.com/
Created /Users/ceteri/opt/cascalog/cascalog-lzo/target/cascalog-lzo-1.10.1-SNAPSHOT.jar
Wrote /Users/ceteri/opt/cascalog/cascalog-lzo/pom.xml
Reading project from cascalog-math
Created /Users/ceteri/opt/cascalog/cascalog-math/target/cascalog-math-1.10.1-SNAPSHOT.jar
Wrote /Users/ceteri/opt/cascalog/cascalog-math/pom.xml
Reading project from midje-cascalog
Could not find artifact midje:midje:pom:1.5-beta2 in central (http://repo1.maven.org/maven2)
Retrieving midje/midje/1.5-beta2/midje-1.5-beta2.pom (7k)
from https://clojars.org/repo/
Could not find artifact ordered:ordered:pom:1.2.0 in central (http://repo1.maven.org/maven2)
Retrieving ordered/ordered/1.2.0/ordered-1.2.0.pom (1k)
from https://clojars.org/repo/
Retrieving org/clojure/math.combinatorics/0.0.1/math.combinatorics-0.0.1.pom (1k)
from http://repo1.maven.org/maven2/
Retrieving org/clojure/pom.contrib/0.0.21/pom.contrib-0.0.21.pom (5k)
from http://repo1.maven.org/maven2/
Retrieving org/clojure/clojure/1.3.0-alpha6/clojure-1.3.0-alpha6.pom (5k)
from http://repo1.maven.org/maven2/
Retrieving org/clojure/algo.monads/0.1.0/algo.monads-0.1.0.pom (1k)
from http://repo1.maven.org/maven2/
Retrieving org/clojure/tools.macro/0.1.0/tools.macro-0.1.0.pom (1k)
from http://repo1.maven.org/maven2/
Retrieving org/clojure/core.unify/0.5.2/core.unify-0.5.2.pom (1k)
from http://repo1.maven.org/maven2/
Retrieving org/clojure/pom.contrib/0.0.25/pom.contrib-0.0.25.pom (5k)
from http://repo1.maven.org/maven2/
Could not find artifact utilize:utilize:pom:0.2.3 in central (http://repo1.maven.org/maven2)
Retrieving utilize/utilize/0.2.3/utilize-0.2.3.pom (2k)
from https://clojars.org/repo/
Retrieving joda-time/joda-time/2.0/joda-time-2.0.pom (15k)
from http://repo1.maven.org/maven2/
Could not find artifact ordered:ordered:pom:1.0.0 in central (http://repo1.maven.org/maven2)
Retrieving ordered/ordered/1.0.0/ordered-1.0.0.pom (1k)
from https://clojars.org/repo/
Could not find artifact colorize:colorize:pom:0.1.1 in central (http://repo1.maven.org/maven2)
Retrieving colorize/colorize/0.1.1/colorize-0.1.1.pom (1k)
from https://clojars.org/repo/
Retrieving org/clojure/core.incubator/0.1.0/core.incubator-0.1.0.pom (1k)
from http://repo1.maven.org/maven2/
Could not find artifact leiningen-core:leiningen-core:pom:2.0.0-preview10 in central (http://repo1.maven.org/maven2)
Retrieving leiningen-core/leiningen-core/2.0.0-preview10/leiningen-core-2.0.0-preview10.pom (3k)
from https://clojars.org/repo/
Could not find artifact classlojure:classlojure:pom:0.6.6 in central (http://repo1.maven.org/maven2)
Retrieving classlojure/classlojure/0.6.6/classlojure-0.6.6.pom (3k)
from https://clojars.org/repo/
Could not find artifact useful:useful:pom:0.8.3-alpha8 in central (http://repo1.maven.org/maven2)
Retrieving useful/useful/0.8.3-alpha8/useful-0.8.3-alpha8.pom (1k)
from https://clojars.org/repo/
Could not find artifact robert:hooke:pom:1.1.2 in central (http://repo1.maven.org/maven2)
Retrieving robert/hooke/1.1.2/hooke-1.1.2.pom (2k)from https://clojars.org/repo/
Retrieving com/cemerick/pomegranate/0.0.13/pomegranate-0.0.13.pom (3k)
from http://repo1.maven.org/maven2/
Retrieving org/sonatype/aether/aether-api/1.13.1/aether-api-1.13.1.pom (1k)
from http://repo1.maven.org/maven2/
Retrieving org/sonatype/aether/aether/1.13.1/aether-1.13.1.pom (10k)
from http://repo1.maven.org/maven2/
Retrieving org/sonatype/forge/forge-parent/10/forge-parent-10.pom (13k)
from http://repo1.maven.org/maven2/
Retrieving org/sonatype/aether/aether-util/1.13.1/aether-util-1.13.1.pom (2k)
from http://repo1.maven.org/maven2/
Retrieving org/sonatype/aether/aether-impl/1.13.1/aether-impl-1.13.1.pom (2k)
from http://repo1.maven.org/maven2/
Retrieving org/sonatype/aether/aether-spi/1.13.1/aether-spi-1.13.1.pom (1k)
from http://repo1.maven.org/maven2/
Retrieving org/sonatype/aether/aether-connector-file/1.13.1/aether-connector-file-1.13.1.pom (2k)
from http://repo1.maven.org/maven2/
Retrieving org/sonatype/aether/aether-connector-wagon/1.13.1/aether-connector-wagon-1.13.1.pom (3k)
from http://repo1.maven.org/maven2/
Retrieving org/apache/maven/wagon/wagon-provider-api/1.0-beta-6/wagon-provider-api-1.0-beta-6.pom (2k)
from http://repo1.maven.org/maven2/
Retrieving org/apache/maven/wagon/wagon/1.0-beta-6/wagon-1.0-beta-6.pom (12k)
from http://repo1.maven.org/maven2/
Retrieving org/apache/maven/maven-parent/11/maven-parent-11.pom (32k)
from http://repo1.maven.org/maven2/
Retrieving org/apache/apache/5/apache-5.pom (4k)
from http://repo1.maven.org/maven2/
Retrieving org/codehaus/plexus/plexus-utils/1.4.2/plexus-utils-1.4.2.pom (2k)
from http://repo1.maven.org/maven2/
Retrieving org/codehaus/plexus/plexus/1.0.11/plexus-1.0.11.pom (9k)
from http://repo1.maven.org/maven2/
Retrieving org/codehaus/plexus/plexus-classworlds/2.4/plexus-classworlds-2.4.pom (4k)
from http://repo1.maven.org/maven2/
Retrieving org/codehaus/plexus/plexus/2.0.7/plexus-2.0.7.pom (17k)
from http://repo1.maven.org/maven2/
Retrieving org/codehaus/plexus/plexus-utils/2.0.7/plexus-utils-2.0.7.pom (3k)
from http://repo1.maven.org/maven2/
Retrieving org/sonatype/sisu/sisu-inject-plexus/2.2.3/sisu-inject-plexus-2.2.3.pom (5k)
from http://repo1.maven.org/maven2/
Retrieving org/sonatype/sisu/inject/guice-plexus/2.2.3/guice-plexus-2.2.3.pom (4k)
from http://repo1.maven.org/maven2/
Retrieving org/sonatype/sisu/inject/guice-bean/2.2.3/guice-bean-2.2.3.pom (3k)
from http://repo1.maven.org/maven2/
Retrieving org/sonatype/sisu/inject/containers/2.2.3/containers-2.2.3.pom (1k)
from http://repo1.maven.org/maven2/
Retrieving org/sonatype/sisu/sisu-inject/2.2.3/sisu-inject-2.2.3.pom (3k)
from http://repo1.maven.org/maven2/
Retrieving org/sonatype/sisu/sisu-parent/2.2.3/sisu-parent-2.2.3.pom (9k)
from http://repo1.maven.org/maven2/
Retrieving org/sonatype/forge/forge-parent/9/forge-parent-9.pom (13k)
from http://repo1.maven.org/maven2/
Retrieving org/codehaus/plexus/plexus-component-annotations/1.5.5/plexus-component-annotations-1.5.5.pom (1k)
from http://repo1.maven.org/maven2/
Retrieving org/codehaus/plexus/plexus-containers/1.5.5/plexus-containers-1.5.5.pom (4k)
from http://repo1.maven.org/maven2/
Retrieving org/sonatype/sisu/sisu-inject-bean/2.2.3/sisu-inject-bean-2.2.3.pom (6k)
from http://repo1.maven.org/maven2/
Retrieving org/sonatype/sisu/sisu-guice/3.0.3/sisu-guice-3.0.3.pom (8k)
from http://repo1.maven.org/maven2/
Retrieving org/sonatype/sisu/inject/guice-parent/3.0.3/guice-parent-3.0.3.pom (14k)
from http://repo1.maven.org/maven2/
Retrieving org/apache/maven/maven-aether-provider/3.0.4/maven-aether-provider-3.0.4.pom (3k)
from http://repo1.maven.org/maven2/
Retrieving org/apache/maven/maven/3.0.4/maven-3.0.4.pom (21k)
from http://repo1.maven.org/maven2/
Retrieving org/apache/maven/maven-parent/21/maven-parent-21.pom (26k)
from http://repo1.maven.org/maven2/
Retrieving org/apache/apache/10/apache-10.pom (14k)
from http://repo1.maven.org/maven2/
Retrieving org/apache/maven/maven-model/3.0.4/maven-model-3.0.4.pom (4k)
from http://repo1.maven.org/maven2/
Retrieving org/codehaus/plexus/plexus-utils/2.0.6/plexus-utils-2.0.6.pom (3k)
from http://repo1.maven.org/maven2/
Retrieving org/apache/maven/maven-model-builder/3.0.4/maven-model-builder-3.0.4.pom (2k)
from http://repo1.maven.org/maven2/
Retrieving org/codehaus/plexus/plexus-interpolation/1.14/plexus-interpolation-1.14.pom (1k)
from http://repo1.maven.org/maven2/
Retrieving org/codehaus/plexus/plexus-components/1.1.18/plexus-components-1.1.18.pom (5k)
from http://repo1.maven.org/maven2/
Retrieving org/apache/maven/maven-repository-metadata/3.0.4/maven-repository-metadata-3.0.4.pom (2k)
from http://repo1.maven.org/maven2/
Retrieving org/apache/maven/wagon/wagon-provider-api/2.2/wagon-provider-api-2.2.pom (2k)
from http://repo1.maven.org/maven2/
Retrieving org/apache/maven/wagon/wagon/2.2/wagon-2.2.pom (16k)
from http://repo1.maven.org/maven2/
Retrieving org/codehaus/plexus/plexus-utils/3.0/plexus-utils-3.0.pom (4k)
from http://repo1.maven.org/maven2/
Retrieving org/sonatype/spice/spice-parent/16/spice-parent-16.pom (8k)
from http://repo1.maven.org/maven2/
Retrieving org/sonatype/forge/forge-parent/5/forge-parent-5.pom (8k)
from http://repo1.maven.org/maven2/
Retrieving org/apache/maven/wagon/wagon-http/2.2/wagon-http-2.2.pom (4k)
from http://repo1.maven.org/maven2/
Retrieving org/apache/maven/wagon/wagon-providers/2.2/wagon-providers-2.2.pom (3k)
from http://repo1.maven.org/maven2/
Retrieving org/apache/maven/wagon/wagon-http-shared4/2.2/wagon-http-shared4-2.2.pom (2k)
from http://repo1.maven.org/maven2/
Retrieving org/jsoup/jsoup/1.6.1/jsoup-1.6.1.pom (5k)
from http://repo1.maven.org/maven2/
Retrieving commons-io/commons-io/2.0.1/commons-io-2.0.1.pom (9k)
from http://repo1.maven.org/maven2/
Retrieving org/apache/commons/commons-parent/15/commons-parent-15.pom (31k)
from http://repo1.maven.org/maven2/
Could not find artifact swiss-arrows:swiss-arrows:pom:0.1.0 in central (http://repo1.maven.org/maven2)
Retrieving swiss-arrows/swiss-arrows/0.1.0/swiss-arrows-0.1.0.pom (1k)
from https://clojars.org/repo/
Retrieving org/clojure/tools.namespace/0.2.2/tools.namespace-0.2.2.pom (1k)
from http://repo1.maven.org/maven2/
Could not find artifact slingshot:slingshot:pom:0.10.3 in central (http://repo1.maven.org/maven2)
Retrieving slingshot/slingshot/0.10.3/slingshot-0.10.3.pom (2k)
from https://clojars.org/repo/
Retrieving commons-codec/commons-codec/1.6/commons-codec-1.6.pom (11k)
from http://repo1.maven.org/maven2/
Retrieving org/apache/commons/commons-parent/22/commons-parent-22.pom (41k)
from http://repo1.maven.org/maven2/
Retrieving org/apache/apache/9/apache-9.pom (15k)
from http://repo1.maven.org/maven2/
Could not find artifact gui-diff:gui-diff:pom:0.3.9 in central (http://repo1.maven.org/maven2)
Retrieving gui-diff/gui-diff/0.3.9/gui-diff-0.3.9.pom (2k)
from https://clojars.org/repo/
Retrieving org/clojure/clojure/1.2.0/clojure-1.2.0.pom (1k)
from http://repo1.maven.org/maven2/
Retrieving org/clojure/algo.monads/0.1.0/algo.monads-0.1.0.jar (8k)
from http://repo1.maven.org/maven2/
Retrieving org/clojure/math.combinatorics/0.0.1/math.combinatorics-0.0.1.jar (4k)
from http://repo1.maven.org/maven2/
Retrieving org/clojure/core.unify/0.5.2/core.unify-0.5.2.jar (4k)
from http://repo1.maven.org/maven2/
Could not find artifact ordered:ordered:jar:1.2.0 in central (http://repo1.maven.org/maven2)
Could not find artifact midje:midje:jar:1.5-beta2 in central (http://repo1.maven.org/maven2)
Retrieving joda-time/joda-time/2.0/joda-time-2.0.jar (556k)
from http://repo1.maven.org/maven2/
Retrieving org/clojure/core.incubator/0.1.0/core.incubator-0.1.0.jar (3k)
from http://repo1.maven.org/maven2/
Could not find artifact utilize:utilize:jar:0.2.3 in central (http://repo1.maven.org/maven2)
Could not find artifact leiningen-core:leiningen-core:jar:2.0.0-preview10 in central (http://repo1.maven.org/maven2)
Could not find artifact colorize:colorize:jar:0.1.1 in central (http://repo1.maven.org/maven2)
Could not find artifact classlojure:classlojure:jar:0.6.6 in central (http://repo1.maven.org/maven2)
Retrieving com/cemerick/pomegranate/0.0.13/pomegranate-0.0.13.jar (11k)
from http://repo1.maven.org/maven2/
Could not find artifact useful:useful:jar:0.8.3-alpha8 in central (http://repo1.maven.org/maven2)
Could not find artifact robert:hooke:jar:1.1.2 in central (http://repo1.maven.org/maven2)
Retrieving org/sonatype/aether/aether-api/1.13.1/aether-api-1.13.1.jar (88k)
from http://repo1.maven.org/maven2/
Retrieving org/sonatype/aether/aether-impl/1.13.1/aether-impl-1.13.1.jar (127k)
from http://repo1.maven.org/maven2/
Retrieving org/sonatype/aether/aether-util/1.13.1/aether-util-1.13.1.jar (127k)
from http://repo1.maven.org/maven2/
Retrieving org/sonatype/aether/aether-spi/1.13.1/aether-spi-1.13.1.jar (15k)
from http://repo1.maven.org/maven2/
Retrieving org/sonatype/aether/aether-connector-file/1.13.1/aether-connector-file-1.13.1.jar (24k)
from http://repo1.maven.org/maven2/
Retrieving org/sonatype/aether/aether-connector-wagon/1.13.1/aether-connector-wagon-1.13.1.jar (29k)
from http://repo1.maven.org/maven2/
Retrieving org/codehaus/plexus/plexus-classworlds/2.4/plexus-classworlds-2.4.jar (46k)
from http://repo1.maven.org/maven2/
Retrieving org/codehaus/plexus/plexus-utils/2.0.7/plexus-utils-2.0.7.jar (219k)
from http://repo1.maven.org/maven2/
Retrieving org/sonatype/sisu/sisu-inject-plexus/2.2.3/sisu-inject-plexus-2.2.3.jar (199k)
from http://repo1.maven.org/maven2/
Retrieving org/sonatype/sisu/sisu-inject-bean/2.2.3/sisu-inject-bean-2.2.3.jar (256k)
from http://repo1.maven.org/maven2/
Retrieving org/sonatype/sisu/sisu-guice/3.0.3/sisu-guice-3.0.3-no_aop.jar (478k)
from http://repo1.maven.org/maven2/
Retrieving org/apache/maven/maven-aether-provider/3.0.4/maven-aether-provider-3.0.4.jar (55k)
from http://repo1.maven.org/maven2/
Retrieving org/apache/maven/maven-model/3.0.4/maven-model-3.0.4.jar (160k)
from http://repo1.maven.org/maven2/
Retrieving org/apache/maven/maven-model-builder/3.0.4/maven-model-builder-3.0.4.jar (147k)
from http://repo1.maven.org/maven2/
Retrieving org/codehaus/plexus/plexus-interpolation/1.14/plexus-interpolation-1.14.jar (60k)
from http://repo1.maven.org/maven2/
Retrieving org/apache/maven/maven-repository-metadata/3.0.4/maven-repository-metadata-3.0.4.jar (29k)
from http://repo1.maven.org/maven2/
Retrieving org/codehaus/plexus/plexus-component-annotations/1.5.5/plexus-component-annotations-1.5.5.jar (4k)
from http://repo1.maven.org/maven2/
Retrieving org/apache/maven/wagon/wagon-http/2.2/wagon-http-2.2.jar (11k)
from http://repo1.maven.org/maven2/
Retrieving org/apache/maven/wagon/wagon-provider-api/2.2/wagon-provider-api-2.2.jar (51k)
from http://repo1.maven.org/maven2/
Retrieving org/apache/maven/wagon/wagon-http-shared4/2.2/wagon-http-shared4-2.2.jar (29k)
from http://repo1.maven.org/maven2/
Retrieving org/jsoup/jsoup/1.6.1/jsoup-1.6.1.jar (275k)
from http://repo1.maven.org/maven2/
Retrieving org/apache/httpcomponents/httpcore/4.1.2/httpcore-4.1.2.jar (177k)
from http://repo1.maven.org/maven2/
Retrieving commons-io/commons-io/2.0.1/commons-io-2.0.1.jar (156k)
from http://repo1.maven.org/maven2/
Could not find artifact swiss-arrows:swiss-arrows:jar:0.1.0 in central (http://repo1.maven.org/maven2)
Retrieving org/clojure/tools.namespace/0.2.2/tools.namespace-0.2.2.jar (16k)
from http://repo1.maven.org/maven2/
Could not find artifact slingshot:slingshot:jar:0.10.3 in central (http://repo1.maven.org/maven2)
Retrieving commons-codec/commons-codec/1.6/commons-codec-1.6.jar (227k)
from http://repo1.maven.org/maven2/
Could not find artifact gui-diff:gui-diff:jar:0.3.9 in central (http://repo1.maven.org/maven2)
Retrieving midje/midje/1.5-beta2/midje-1.5-beta2.jar (102k)
from https://clojars.org/repo/
Retrieving colorize/colorize/0.1.1/colorize-0.1.1.jar (2k)
from https://clojars.org/repo/
Retrieving ordered/ordered/1.2.0/ordered-1.2.0.jar (12k)
from https://clojars.org/repo/
Retrieving utilize/utilize/0.2.3/utilize-0.2.3.jar (25k)
from https://clojars.org/repo/
Retrieving leiningen-core/leiningen-core/2.0.0-preview10/leiningen-core-2.0.0-preview10.jar (21k)
from https://clojars.org/repo/
Retrieving classlojure/classlojure/0.6.6/classlojure-0.6.6.jar (5k)
from https://clojars.org/repo/
Retrieving useful/useful/0.8.3-alpha8/useful-0.8.3-alpha8.jar (37k)
from https://clojars.org/repo/
Retrieving robert/hooke/1.1.2/hooke-1.1.2.jar (3k)from https://clojars.org/repo/
Retrieving swiss-arrows/swiss-arrows/0.1.0/swiss-arrows-0.1.0.jar (2k)
from https://clojars.org/repo/
Retrieving slingshot/slingshot/0.10.3/slingshot-0.10.3.jar (8k)
from https://clojars.org/repo/
Retrieving gui-diff/gui-diff/0.3.9/gui-diff-0.3.9.jar (6k)
from https://clojars.org/repo/
Created /Users/ceteri/opt/cascalog/midje-cascalog/target/midje-cascalog-1.10.1-SNAPSHOT.jar
Wrote /Users/ceteri/opt/cascalog/midje-cascalog/pom.xml
bash-3.2$ cd cascalog-elephantdb/
bash-3.2$ lein test
Retrieving log4j/log4j/1.2.12/log4j-1.2.12.pom (1k)
from http://repo1.maven.org/maven2/
2013-03-14 23:10:28.285 java[40953:1903] Unable to load realm info from SCDynamicStore
13/03/14 23:10:28 WARN util.NativeCodeLoader: Unable to load native-hadoop library for your platform... using builtin-java classes where applicable
13/03/14 23:10:28 INFO util.HadoopUtil: resolving application jar from found main method on: clojure.main
13/03/14 23:10:28 INFO planner.HadoopPlanner: using application jar: /Users/ceteri/.m2/repository/org/clojure/clojure/1.4.0/clojure-1.4.0.jar
13/03/14 23:10:28 INFO property.AppProps: using app.id: B9345832DC057C22FF2538B7609F4D53
13/03/14 23:10:28 INFO hadoop.TupleSerialization: using default comparator: cascalog.hadoop.DefaultComparator
13/03/14 23:10:29 INFO util.Version: Concurrent, Inc - Cascading 2.2.0-wip-19
13/03/14 23:10:29 INFO flow.Flow: [] starting
13/03/14 23:10:29 INFO flow.Flow: [] source: MemorySourceTap["MemorySourceScheme[[UNKNOWN]->[ALL]]"]["/8584d465-4c40-4c12-bca7-cd2bf82267e4"]
13/03/14 23:10:29 INFO flow.Flow: [] sink: ElephantDBTap["ElephantScheme[['key', 'value']->['!shard', '!key', '!value']]"]["/tmp/unittests610d8842-3e66-441d-828a-71aa8d6319aa"]
13/03/14 23:10:29 INFO flow.Flow: [] parallel execution is enabled: false
13/03/14 23:10:29 INFO flow.Flow: [] starting jobs: 1
13/03/14 23:10:29 INFO flow.Flow: [] allocating threads: 1
13/03/14 23:10:29 INFO flow.FlowStep: [] starting step: (1/1) ...66-441d-828a-71aa8d6319aa
13/03/14 23:10:29 INFO hadoop.TupleSerialization: using default comparator: cascalog.hadoop.DefaultComparator
13/03/14 23:10:29 INFO flow.FlowStep: [] submitted hadoop job: job_local_0001
13/03/14 23:10:29 INFO mapred.Task: Using ResourceCalculatorPlugin : null
13/03/14 23:10:29 INFO hadoop.TupleSerialization: using default comparator: cascalog.hadoop.DefaultComparator
13/03/14 23:10:29 INFO hadoop.TupleSerialization: using default comparator: cascalog.hadoop.DefaultComparator
13/03/14 23:10:29 INFO mapred.MapTask: numReduceTasks: 1
13/03/14 23:10:29 INFO mapred.MapTask: io.sort.mb = 100
13/03/14 23:10:29 INFO mapred.MapTask: data buffer = 79691776/99614720
13/03/14 23:10:29 INFO mapred.MapTask: record buffer = 262144/327680
13/03/14 23:10:29 INFO hadoop.TupleSerialization: using default comparator: cascalog.hadoop.DefaultComparator
13/03/14 23:10:29 INFO hadoop.TupleSerialization: using default comparator: cascalog.hadoop.DefaultComparator
13/03/14 23:10:29 INFO hadoop.FlowMapper: cascading version: Concurrent, Inc - Cascading 2.2.0-wip-19
13/03/14 23:10:29 INFO hadoop.FlowMapper: child jvm opts: -Xmx200m
13/03/14 23:10:29 INFO hadoop.FlowMapper: sourcing from: MemorySourceTap["MemorySourceScheme[[UNKNOWN]->[ALL]]"]["/8584d465-4c40-4c12-bca7-cd2bf82267e4"]
13/03/14 23:10:29 INFO hadoop.FlowMapper: sinking to: GroupBy(7f55e996-ba4d-4681-b582-f25df732258a)[by:[{1}:'!shard']]
13/03/14 23:10:29 INFO hadoop.TupleSerialization: using default comparator: cascalog.hadoop.DefaultComparator
13/03/14 23:10:29 ERROR stream.TrapHandler: caught Throwable, no trap available, rethrowing
cascading.pipe.OperatorException: [7f55e996-ba4d-4681-b58...][sun.reflect.NativeConstructorAccessorImpl.newInstance0(Native Method)] operator Each failed executing operation
at cascading.flow.stream.FunctionEachStage.receive(FunctionEachStage.java:107)
at cascading.flow.stream.FunctionEachStage.receive(FunctionEachStage.java:39)
at cascading.flow.stream.FunctionEachStage$1.collect(FunctionEachStage.java:80)
at cascading.tuple.TupleEntryCollector.safeCollect(TupleEntryCollector.java:93)
at cascading.tuple.TupleEntryCollector.add(TupleEntryCollector.java:86)
at cascading.operation.Identity$2.operate(Identity.java:131)
at cascading.operation.Identity.operate(Identity.java:144)
at cascading.flow.stream.FunctionEachStage.receive(FunctionEachStage.java:99)
at cascading.flow.stream.FunctionEachStage.receive(FunctionEachStage.java:39)
at cascading.flow.stream.SourceStage.map(SourceStage.java:102)
at cascading.flow.stream.SourceStage.run(SourceStage.java:58)
at cascading.flow.hadoop.FlowMapper.run(FlowMapper.java:127)
at org.apache.hadoop.mapred.MapTask.runOldMapper(MapTask.java:436)
at org.apache.hadoop.mapred.MapTask.run(MapTask.java:372)
at org.apache.hadoop.mapred.LocalJobRunner$Job.run(LocalJobRunner.java:212)
Caused by: java.lang.AssertionError: Assert failed: (byte-array? shard-key)
at cascalog.elephantdb.keyval$shard__$fn__1542.invoke(keyval.clj:23)
at clojure.lang.AFn.applyToHelper(AFn.java:161)
at clojure.lang.AFn.applyTo(AFn.java:151)
at cascalog.ClojureCascadingBase.applyFunction(ClojureCascadingBase.java:68)
at cascalog.ClojureMap.operate(ClojureMap.java:34)
at cascading.flow.stream.FunctionEachStage.receive(FunctionEachStage.java:99)
... 14 more
13/03/14 23:10:29 ERROR stream.TrapHandler: caught Throwable, no trap available, rethrowing
cascading.pipe.OperatorException: [7f55e996-ba4d-4681-b58...][sun.reflect.NativeConstructorAccessorImpl.newInstance0(Native Method)] operator Each failed executing operation
at cascading.flow.stream.FunctionEachStage.receive(FunctionEachStage.java:107)
at cascading.flow.stream.FunctionEachStage.receive(FunctionEachStage.java:39)
at cascading.flow.stream.FunctionEachStage$1.collect(FunctionEachStage.java:80)
at cascading.tuple.TupleEntryCollector.safeCollect(TupleEntryCollector.java:93)
at cascading.tuple.TupleEntryCollector.add(TupleEntryCollector.java:86)
at cascading.operation.Identity$2.operate(Identity.java:131)
at cascading.operation.Identity.operate(Identity.java:144)
at cascading.flow.stream.FunctionEachStage.receive(FunctionEachStage.java:99)
at cascading.flow.stream.FunctionEachStage.receive(FunctionEachStage.java:39)
at cascading.flow.stream.SourceStage.map(SourceStage.java:102)
at cascading.flow.stream.SourceStage.run(SourceStage.java:58)
at cascading.flow.hadoop.FlowMapper.run(FlowMapper.java:127)
at org.apache.hadoop.mapred.MapTask.runOldMapper(MapTask.java:436)
at org.apache.hadoop.mapred.MapTask.run(MapTask.java:372)
at org.apache.hadoop.mapred.LocalJobRunner$Job.run(LocalJobRunner.java:212)
Caused by: java.lang.AssertionError: Assert failed: (byte-array? shard-key)
at cascalog.elephantdb.keyval$shard__$fn__1542.invoke(keyval.clj:23)
at clojure.lang.AFn.applyToHelper(AFn.java:161)
at clojure.lang.AFn.applyTo(AFn.java:151)
at cascalog.ClojureCascadingBase.applyFunction(ClojureCascadingBase.java:68)
at cascalog.ClojureMap.operate(ClojureMap.java:34)
at cascading.flow.stream.FunctionEachStage.receive(FunctionEachStage.java:99)
... 14 more
13/03/14 23:10:29 ERROR stream.SourceStage: caught throwable
cascading.pipe.OperatorException: [7f55e996-ba4d-4681-b58...][sun.reflect.NativeConstructorAccessorImpl.newInstance0(Native Method)] operator Each failed executing operation
at cascading.flow.stream.FunctionEachStage.receive(FunctionEachStage.java:107)
at cascading.flow.stream.FunctionEachStage.receive(FunctionEachStage.java:39)
at cascading.flow.stream.FunctionEachStage$1.collect(FunctionEachStage.java:80)
at cascading.tuple.TupleEntryCollector.safeCollect(TupleEntryCollector.java:93)
at cascading.tuple.TupleEntryCollector.add(TupleEntryCollector.java:86)
at cascading.operation.Identity$2.operate(Identity.java:131)
at cascading.operation.Identity.operate(Identity.java:144)
at cascading.flow.stream.FunctionEachStage.receive(FunctionEachStage.java:99)
at cascading.flow.stream.FunctionEachStage.receive(FunctionEachStage.java:39)
at cascading.flow.stream.SourceStage.map(SourceStage.java:102)
at cascading.flow.stream.SourceStage.run(SourceStage.java:58)
at cascading.flow.hadoop.FlowMapper.run(FlowMapper.java:127)
at org.apache.hadoop.mapred.MapTask.runOldMapper(MapTask.java:436)
at org.apache.hadoop.mapred.MapTask.run(MapTask.java:372)
at org.apache.hadoop.mapred.LocalJobRunner$Job.run(LocalJobRunner.java:212)
Caused by: java.lang.AssertionError: Assert failed: (byte-array? shard-key)
at cascalog.elephantdb.keyval$shard__$fn__1542.invoke(keyval.clj:23)
at clojure.lang.AFn.applyToHelper(AFn.java:161)
at clojure.lang.AFn.applyTo(AFn.java:151)
at cascalog.ClojureCascadingBase.applyFunction(ClojureCascadingBase.java:68)
at cascalog.ClojureMap.operate(ClojureMap.java:34)
at cascading.flow.stream.FunctionEachStage.receive(FunctionEachStage.java:99)
... 14 more
13/03/14 23:10:29 WARN mapred.LocalJobRunner: job_local_0001
cascading.pipe.OperatorException: [7f55e996-ba4d-4681-b58...][sun.reflect.NativeConstructorAccessorImpl.newInstance0(Native Method)] operator Each failed executing operation
at cascading.flow.stream.FunctionEachStage.receive(FunctionEachStage.java:107)
at cascading.flow.stream.FunctionEachStage.receive(FunctionEachStage.java:39)
at cascading.flow.stream.FunctionEachStage$1.collect(FunctionEachStage.java:80)
at cascading.tuple.TupleEntryCollector.safeCollect(TupleEntryCollector.java:93)
at cascading.tuple.TupleEntryCollector.add(TupleEntryCollector.java:86)
at cascading.operation.Identity$2.operate(Identity.java:131)
at cascading.operation.Identity.operate(Identity.java:144)
at cascading.flow.stream.FunctionEachStage.receive(FunctionEachStage.java:99)
at cascading.flow.stream.FunctionEachStage.receive(FunctionEachStage.java:39)
at cascading.flow.stream.SourceStage.map(SourceStage.java:102)
at cascading.flow.stream.SourceStage.run(SourceStage.java:58)
at cascading.flow.hadoop.FlowMapper.run(FlowMapper.java:127)
at org.apache.hadoop.mapred.MapTask.runOldMapper(MapTask.java:436)
at org.apache.hadoop.mapred.MapTask.run(MapTask.java:372)
at org.apache.hadoop.mapred.LocalJobRunner$Job.run(LocalJobRunner.java:212)
Caused by: java.lang.AssertionError: Assert failed: (byte-array? shard-key)
at cascalog.elephantdb.keyval$shard__$fn__1542.invoke(keyval.clj:23)
at clojure.lang.AFn.applyToHelper(AFn.java:161)
at clojure.lang.AFn.applyTo(AFn.java:151)
at cascalog.ClojureCascadingBase.applyFunction(ClojureCascadingBase.java:68)
at cascalog.ClojureMap.operate(ClojureMap.java:34)
at cascading.flow.stream.FunctionEachStage.receive(FunctionEachStage.java:99)
... 14 more
13/03/14 23:10:29 WARN flow.FlowStep: [] task completion events identify failed tasks
13/03/14 23:10:29 WARN flow.FlowStep: [] task completion events count: 0
13/03/14 23:10:29 INFO flow.Flow: [] stopping all jobs
13/03/14 23:10:29 INFO flow.FlowStep: [] stopping: (1/1) ...66-441d-828a-71aa8d6319aa
13/03/14 23:10:29 INFO flow.Flow: [] stopped all jobs
13/03/14 23:10:29 INFO util.Hadoop18TapUtil: deleting temp path /tmp/unittests610d8842-3e66-441d-828a-71aa8d6319aa/_temporary
Exception in thread "main" cascading.flow.FlowException: local step failed
at cascading.flow.planner.FlowStepJob.blockOnJob(FlowStepJob.java:208)
at cascading.flow.planner.FlowStepJob.start(FlowStepJob.java:145)
at cascading.flow.planner.FlowStepJob.call(FlowStepJob.java:120)
at cascading.flow.planner.FlowStepJob.call(FlowStepJob.java:42)
at java.util.concurrent.FutureTask$Sync.innerRun(FutureTask.java:303)
at java.util.concurrent.FutureTask.run(FutureTask.java:138)
at java.util.concurrent.ThreadPoolExecutor$Worker.runTask(ThreadPoolExecutor.java:895)
at java.util.concurrent.ThreadPoolExecutor$Worker.run(ThreadPoolExecutor.java:918)
at java.lang.Thread.run(Thread.java:680)
Tests failed.
bash-3.2$ cd ../cascalog-lzo/
bash-3.2$ lein test
Could not find artifact lein-midje:lein-midje:pom:3.0-beta1 in central (http://repo1.maven.org/maven2)
Retrieving lein-midje/lein-midje/3.0-beta1/lein-midje-3.0-beta1.pom (2k)
from https://clojars.org/repo/
Could not find artifact lein-midje:lein-midje:jar:3.0-beta1 in central (http://repo1.maven.org/maven2)
Retrieving lein-midje/lein-midje/3.0-beta1/lein-midje-3.0-beta1.jar (6k)
from https://clojars.org/repo/
Retrieving org/apache/httpcomponents/httpclient/4.2.3/httpclient-4.2.3.pom (6k)
from http://repo1.maven.org/maven2/
Retrieving org/apache/httpcomponents/httpcomponents-client/4.2.3/httpcomponents-client-4.2.3.pom (14k)
from http://repo1.maven.org/maven2/
Retrieving org/apache/httpcomponents/project/6/project-6.pom (23k)
from http://repo1.maven.org/maven2/
Retrieving org/apache/httpcomponents/httpcore/4.2.2/httpcore-4.2.2.pom (6k)
from http://repo1.maven.org/maven2/
Retrieving org/apache/httpcomponents/httpcomponents-core/4.2.2/httpcomponents-core-4.2.2.pom (11k)
from http://repo1.maven.org/maven2/
Retrieving org/apache/httpcomponents/httpclient/4.2.3/httpclient-4.2.3.jar (423k)
from http://repo1.maven.org/maven2/
Retrieving org/apache/httpcomponents/httpcore/4.2.2/httpcore-4.2.2.jar (218k)
from http://repo1.maven.org/maven2/
2013-03-14 23:31:41.838 java[41016:1903] Unable to load realm info from SCDynamicStore
13/03/14 23:31:41 INFO util.HadoopUtil: resolving application jar from found main method on: clojure.main
13/03/14 23:31:41 INFO planner.HadoopPlanner: using application jar: /Users/ceteri/.m2/repository/org/clojure/clojure/1.4.0/clojure-1.4.0.jar
13/03/14 23:31:41 INFO property.AppProps: using app.id: C805A289A9E83D82A717C70CDC6AFEBB
13/03/14 23:31:42 INFO hadoop.TupleSerialization: using default comparator: cascalog.hadoop.DefaultComparator
13/03/14 23:31:42 INFO util.Version: Concurrent, Inc - Cascading 2.2.0-wip-19
13/03/14 23:31:42 INFO flow.Flow: [] starting
13/03/14 23:31:42 INFO flow.Flow: [] source: MemorySourceTap["MemorySourceScheme[[UNKNOWN]->[ALL]]"]["/a733e89a-7656-4aae-a44e-8bf4c4b9bc45"]
13/03/14 23:31:42 INFO flow.Flow: [] sink: Hfs["LzoTextLine[['line']->[ALL]]"]["/tmp/cascalog_reserved/b5e61199-aeba-4022-ba2a-7711df293155"]
13/03/14 23:31:42 INFO flow.Flow: [] parallel execution is enabled: false
13/03/14 23:31:42 INFO flow.Flow: [] starting jobs: 1
13/03/14 23:31:42 INFO flow.Flow: [] allocating threads: 1
13/03/14 23:31:42 INFO flow.FlowStep: [] starting step: (1/1) ...ba-4022-ba2a-7711df293155
13/03/14 23:31:42 WARN util.NativeCodeLoader: Unable to load native-hadoop library for your platform... using builtin-java classes where applicable
13/03/14 23:31:42 INFO hadoop.TupleSerialization: using default comparator: cascalog.hadoop.DefaultComparator
13/03/14 23:31:42 INFO flow.FlowStep: [] submitted hadoop job: job_local_0001
13/03/14 23:31:42 INFO mapred.Task: Using ResourceCalculatorPlugin : null
13/03/14 23:31:42 INFO hadoop.TupleSerialization: using default comparator: cascalog.hadoop.DefaultComparator
13/03/14 23:31:42 INFO hadoop.TupleSerialization: using default comparator: cascalog.hadoop.DefaultComparator
13/03/14 23:31:42 INFO mapred.MapTask: numReduceTasks: 0
13/03/14 23:31:42 ERROR lzo.GPLNativeCodeLoader: Could not load native gpl library
java.lang.UnsatisfiedLinkError: no gplcompression in java.library.path
at java.lang.ClassLoader.loadLibrary(ClassLoader.java:1758)
at java.lang.Runtime.loadLibrary0(Runtime.java:823)
at java.lang.System.loadLibrary(System.java:1045)
at com.hadoop.compression.lzo.GPLNativeCodeLoader.<clinit>(GPLNativeCodeLoader.java:32)
at com.hadoop.compression.lzo.LzoCodec.<clinit>(LzoCodec.java:71)
at com.twitter.elephantbird.util.LzoUtils.getIndexedLzoOutputStream(LzoUtils.java:54)
at com.twitter.elephantbird.mapreduce.output.LzoTextOutputFormat.getRecordWriter(LzoTextOutputFormat.java:23)
at com.twitter.elephantbird.mapred.output.DeprecatedOutputFormatWrapper$RecordWriterWrapper.<init>(DeprecatedOutputFormatWrapper.java:114)
at com.twitter.elephantbird.mapred.output.DeprecatedOutputFormatWrapper.getRecordWriter(DeprecatedOutputFormatWrapper.java:85)
at org.apache.hadoop.mapred.MapTask$DirectMapOutputCollector.<init>(MapTask.java:820)
at org.apache.hadoop.mapred.MapTask.runOldMapper(MapTask.java:430)
at org.apache.hadoop.mapred.MapTask.run(MapTask.java:372)
at org.apache.hadoop.mapred.LocalJobRunner$Job.run(LocalJobRunner.java:212)
13/03/14 23:31:42 ERROR lzo.LzoCodec: Cannot load native-lzo without native-hadoop
13/03/14 23:31:42 WARN mapred.LocalJobRunner: job_local_0001
java.lang.RuntimeException: native-lzo library not available
at com.hadoop.compression.lzo.LzoCodec.getCompressorType(LzoCodec.java:155)
at org.apache.hadoop.io.compress.CodecPool.getCompressor(CodecPool.java:100)
at com.hadoop.compression.lzo.LzopCodec.getCompressor(LzopCodec.java:135)
at com.hadoop.compression.lzo.LzopCodec.createOutputStream(LzopCodec.java:70)
at com.twitter.elephantbird.util.LzoUtils.getIndexedLzoOutputStream(LzoUtils.java:75)
at com.twitter.elephantbird.mapreduce.output.LzoTextOutputFormat.getRecordWriter(LzoTextOutputFormat.java:23)
at com.twitter.elephantbird.mapred.output.DeprecatedOutputFormatWrapper$RecordWriterWrapper.<init>(DeprecatedOutputFormatWrapper.java:114)
at com.twitter.elephantbird.mapred.output.DeprecatedOutputFormatWrapper.getRecordWriter(DeprecatedOutputFormatWrapper.java:85)
at org.apache.hadoop.mapred.MapTask$DirectMapOutputCollector.<init>(MapTask.java:820)
at org.apache.hadoop.mapred.MapTask.runOldMapper(MapTask.java:430)
at org.apache.hadoop.mapred.MapTask.run(MapTask.java:372)
at org.apache.hadoop.mapred.LocalJobRunner$Job.run(LocalJobRunner.java:212)
13/03/14 23:31:42 WARN flow.FlowStep: [] task completion events identify failed tasks
13/03/14 23:31:42 WARN flow.FlowStep: [] task completion events count: 0
13/03/14 23:31:42 INFO flow.Flow: [] stopping all jobs
13/03/14 23:31:42 INFO flow.FlowStep: [] stopping: (1/1) ...ba-4022-ba2a-7711df293155
13/03/14 23:31:42 INFO flow.Flow: [] stopped all jobs
13/03/14 23:31:42 INFO util.Hadoop18TapUtil: deleting temp path /tmp/cascalog_reserved/b5e61199-aeba-4022-ba2a-7711df293155/_temporary
Exception in thread "main" cascading.flow.FlowException: local step failed
at cascading.flow.planner.FlowStepJob.blockOnJob(FlowStepJob.java:208)
at cascading.flow.planner.FlowStepJob.start(FlowStepJob.java:145)
at cascading.flow.planner.FlowStepJob.call(FlowStepJob.java:120)
at cascading.flow.planner.FlowStepJob.call(FlowStepJob.java:42)
at java.util.concurrent.FutureTask$Sync.innerRun(FutureTask.java:303)
at java.util.concurrent.FutureTask.run(FutureTask.java:138)
at java.util.concurrent.ThreadPoolExecutor$Worker.runTask(ThreadPoolExecutor.java:895)
at java.util.concurrent.ThreadPoolExecutor$Worker.run(ThreadPoolExecutor.java:918)
at java.lang.Thread.run(Thread.java:680)
Tests failed.
bash-3.2$ cd ../midje-cascalog/
bash-3.2$ lein test
2013-03-14 23:32:53.448 java[41024:1903] Unable to load realm info from SCDynamicStore
lein test midje.cascalog-test
FAIL "The produces checker allows for more midje-like syntax in cascalog\n tests." at (cascalog_test.clj:103)
Actual result did not agree with the checking function.
Actual result: java.lang.Error: Metaconstants (..query..) can't be compared for equality with #<core$_EQ_ clojure.core$_EQ_@2e6bc890>.
If you have a compelling case for equality, please create an issue:
https://github.com/marick/Midje/issues
cascalog.util$search_for_var$fn__5590.invoke(util.clj:169)
cascalog.util$search_for_var.invoke(util.clj:165)
cascalog.predicate$eval6048$fn__6049.invoke(predicate.clj:334)
cascalog.predicate$eval6190$fn__6191.invoke(predicate.clj:466)
cascalog.predicate$build_predicate.invoke(predicate.clj:553)
cascalog.rules$split_predicates.invoke(rules.clj:47)
cascalog.rules$build_query.invoke(rules.clj:552)
cascalog.rules$build_rule.invoke(rules.clj:653)
Checking function: (produces [[10 11]])
Ran 22 tests containing 30 assertions.
1 failures, 0 errors.
Tests failed.
Sign up for free to join this conversation on GitHub. Already have an account? Sign in to comment