Skip to content

Instantly share code, notes, and snippets.

@chadwhitacre chadwhitacre/all.bash.log Secret
Created Jan 3, 2019

Embed
What would you like to do?
Building Go cmd/dist using /usr/local/Cellar/go/1.10.1/libexec.
cmd/dist
Building Go toolchain1 using /usr/local/Cellar/go/1.10.1/libexec.
bootstrap/math/bits
bootstrap/sort
bootstrap/cmd/internal/sys
bootstrap/cmd/internal/objabi
bootstrap/cmd/internal/src
bootstrap/cmd/internal/bio
bootstrap/cmd/internal/edit
bootstrap/debug/dwarf
bootstrap/compress/flate
bootstrap/cmd/internal/dwarf
bootstrap/cmd/asm/internal/flags
bootstrap/cmd/asm/internal/lex
bootstrap/cmd/internal/obj
bootstrap/container/heap
bootstrap/math/big
bootstrap/compress/zlib
bootstrap/cmd/compile/internal/syntax
bootstrap/debug/elf
bootstrap/cmd/internal/obj/arm
bootstrap/cmd/internal/obj/arm64
bootstrap/cmd/internal/obj/mips
bootstrap/cmd/internal/obj/ppc64
bootstrap/cmd/internal/obj/wasm
bootstrap/cmd/internal/obj/s390x
bootstrap/cmd/internal/obj/x86
bootstrap/debug/macho
bootstrap/debug/pe
bootstrap/internal/xcoff
bootstrap/cmd/compile/internal/types
bootstrap/cmd/cgo
bootstrap/cmd/internal/gcprog
bootstrap/cmd/link/internal/sym
bootstrap/cmd/asm/internal/arch
bootstrap/cmd/link/internal/loadelf
bootstrap/cmd/compile/internal/ssa
bootstrap/cmd/asm/internal/asm
bootstrap/cmd/link/internal/loadmacho
bootstrap/cmd/link/internal/loadpe
bootstrap/cmd/asm
bootstrap/cmd/link/internal/loadxcoff
bootstrap/cmd/link/internal/objfile
bootstrap/cmd/link/internal/ld
bootstrap/cmd/link/internal/amd64
bootstrap/cmd/link/internal/arm64
bootstrap/cmd/link/internal/arm
bootstrap/cmd/link/internal/mips
bootstrap/cmd/link/internal/mips64
bootstrap/cmd/link/internal/ppc64
bootstrap/cmd/link/internal/s390x
bootstrap/cmd/link/internal/wasm
bootstrap/cmd/link/internal/x86
bootstrap/cmd/link
bootstrap/cmd/compile/internal/gc
bootstrap/cmd/compile/internal/arm64
bootstrap/cmd/compile/internal/arm
bootstrap/cmd/compile/internal/mips
bootstrap/cmd/compile/internal/amd64
bootstrap/cmd/compile/internal/mips64
bootstrap/cmd/compile/internal/ppc64
bootstrap/cmd/compile/internal/s390x
bootstrap/cmd/compile/internal/wasm
bootstrap/cmd/compile/internal/x86
bootstrap/cmd/compile
Building Go bootstrap cmd/go (go_bootstrap) using Go toolchain1.
runtime
internal/cpu
runtime/internal/atomic
runtime/internal/sys
runtime/internal/math
internal/bytealg
cmd/go
flag
cmd/go/internal/bug
cmd/go/internal/clean
cmd/go/internal/base
cmd/go/internal/lockedfile
cmd/go/internal/web
sort
cmd/go/internal/lockedfile/internal/filelock
cmd/go/internal/work
go/build
fmt
cmd/go/internal/cfg
cmd/go/internal/envcmd
os
errors
strings
cmd/go/internal/get
bytes
math
net/url
cmd/internal/objabi
cmd/go/internal/fix
reflect
cmd/go/internal/help
regexp
cmd/go/internal/fmtcmd
cmd/go/internal/generate
cmd/go/internal/doc
encoding/xml
cmd/go/internal/modcmd
cmd/go/internal/modfetch
cmd/go/internal/modget
go/scanner
cmd/go/internal/modload
path
cmd/go/internal/run
cmd/go/internal/tool
cmd/go/internal/vet
log
io/ioutil
strconv
time
cmd/go/internal/cache
cmd/go/internal/load
path/filepath
io
sync
bufio
cmd/go/internal/list
cmd/go/internal/version
cmd/go/internal/imports
cmd/go/internal/test
os/signal
encoding/json
cmd/go/internal/module
go/doc
cmd/go/internal/modfetch/codehost
cmd/go/internal/cmdflag
encoding/hex
internal/singleflight
runtime/debug
go/parser
go/ast
cmd/go/internal/par
sync/atomic
cmd/go/internal/str
cmd/go/internal/modinfo
go/token
os/exec
syscall
cmd/go/internal/modfile
math/rand
cmd/go/internal/semver
text/template
cmd/go/internal/modconv
unicode/utf8
crypto/sha256
cmd/internal/test2json
encoding
internal/goroot
cmd/go/internal/renameio
cmd/go/internal/mvs
internal/syscall/unix
internal/testlog
cmd/internal/sys
internal/poll
encoding/binary
cmd/go/internal/dirhash
encoding/base64
container/heap
debug/elf
cmd/internal/buildid
unicode/utf16
hash
debug/macho
debug/dwarf
text/template/parse
unicode
regexp/syntax
cmd/go/internal/search
crypto/sha1
internal/fmtsort
internal/xcoff
compress/zlib
context
hash/adler32
crypto
compress/flate
internal/race
math/bits
archive/zip
hash/crc32
Building Go toolchain2 using go_bootstrap and Go toolchain1.
errors
internal/race
runtime/internal/atomic
internal/cpu
runtime/internal/sys
sync/atomic
runtime/internal/math
unicode
unicode/utf8
internal/bytealg
math/bits
internal/testlog
encoding
unicode/utf16
math
runtime
strconv
sync
io
math/rand
reflect
syscall
bytes
strings
bufio
hash
crypto
hash/adler32
path
text/tabwriter
crypto/sha1
hash/crc32
html
crypto/sha256
internal/syscall/unix
time
internal/poll
encoding/binary
sort
internal/fmtsort
regexp/syntax
os
container/heap
cmd/internal/sys
crypto/md5
encoding/base64
path/filepath
runtime/debug
fmt
io/ioutil
regexp
text/scanner
cmd/internal/src
log
flag
cmd/internal/edit
cmd/internal/bio
debug/dwarf
compress/flate
go/token
cmd/internal/objabi
go/scanner
cmd/internal/dwarf
cmd/asm/internal/flags
cmd/asm/internal/lex
cmd/internal/obj
compress/zlib
go/ast
context
os/exec
debug/elf
debug/macho
debug/pe
cmd/internal/obj/arm
cmd/internal/obj/arm64
cmd/internal/obj/mips
cmd/internal/obj/ppc64
cmd/internal/obj/s390x
cmd/internal/obj/wasm
cmd/internal/obj/x86
internal/xcoff
go/parser
go/printer
cmd/compile/internal/types
encoding/hex
math/big
cmd/compile/internal/syntax
cmd/cgo
cmd/asm/internal/arch
cmd/asm/internal/asm
cmd/asm
cmd/internal/gcprog
encoding/json
cmd/compile/internal/ssa
net/url
text/template/parse
text/template
internal/goroot
compress/gzip
runtime/pprof
runtime/trace
cmd/link/internal/sym
go/doc
cmd/link/internal/loadelf
cmd/link/internal/loadmacho
cmd/link/internal/loadpe
cmd/link/internal/loadxcoff
go/build
cmd/link/internal/objfile
cmd/link/internal/ld
cmd/link/internal/amd64
cmd/link/internal/arm
cmd/link/internal/arm64
cmd/link/internal/mips
cmd/link/internal/mips64
cmd/link/internal/ppc64
cmd/link/internal/s390x
cmd/link/internal/wasm
cmd/link/internal/x86
cmd/link
cmd/compile/internal/gc
cmd/compile/internal/amd64
cmd/compile/internal/arm
cmd/compile/internal/mips
cmd/compile/internal/arm64
cmd/compile/internal/mips64
cmd/compile/internal/ppc64
cmd/compile/internal/s390x
cmd/compile/internal/wasm
cmd/compile/internal/x86
cmd/compile
Building Go toolchain3 using go_bootstrap and Go toolchain2.
errors
internal/race
runtime/internal/atomic
internal/cpu
runtime/internal/sys
runtime/internal/math
sync/atomic
internal/bytealg
unicode/utf8
unicode
internal/testlog
math/bits
encoding
unicode/utf16
math
runtime
strconv
sync
io
math/rand
reflect
syscall
bytes
strings
bufio
hash
crypto
path
hash/adler32
text/tabwriter
crypto/sha1
hash/crc32
crypto/sha256
html
internal/syscall/unix
time
internal/poll
encoding/binary
sort
os
internal/fmtsort
regexp/syntax
cmd/internal/sys
crypto/md5
container/heap
encoding/base64
path/filepath
runtime/debug
fmt
io/ioutil
regexp
cmd/internal/src
log
flag
text/scanner
cmd/internal/bio
cmd/internal/edit
debug/dwarf
compress/flate
cmd/internal/objabi
cmd/internal/dwarf
cmd/internal/obj
cmd/asm/internal/flags
compress/zlib
cmd/asm/internal/lex
go/token
go/scanner
context
debug/macho
debug/elf
debug/pe
internal/xcoff
go/ast
cmd/internal/obj/arm
cmd/internal/obj/arm64
cmd/internal/obj/mips
cmd/internal/obj/ppc64
cmd/internal/obj/s390x
cmd/internal/obj/wasm
cmd/internal/obj/x86
go/parser
go/printer
os/exec
cmd/compile/internal/types
encoding/hex
math/big
cmd/compile/internal/syntax
cmd/cgo
cmd/asm/internal/arch
cmd/asm/internal/asm
cmd/asm
cmd/compile/internal/ssa
cmd/internal/gcprog
encoding/json
net/url
text/template/parse
text/template
internal/goroot
compress/gzip
runtime/pprof
runtime/trace
cmd/link/internal/sym
go/doc
cmd/link/internal/loadmacho
cmd/link/internal/loadelf
cmd/link/internal/loadpe
cmd/link/internal/loadxcoff
go/build
cmd/link/internal/objfile
cmd/link/internal/ld
cmd/link/internal/arm64
cmd/link/internal/amd64
cmd/link/internal/arm
cmd/link/internal/mips
cmd/link/internal/mips64
cmd/link/internal/ppc64
cmd/link/internal/s390x
cmd/link/internal/wasm
cmd/link/internal/x86
cmd/link
cmd/compile/internal/gc
cmd/compile/internal/amd64
cmd/compile/internal/mips
cmd/compile/internal/arm
cmd/compile/internal/arm64
cmd/compile/internal/mips64
cmd/compile/internal/ppc64
cmd/compile/internal/s390x
cmd/compile/internal/wasm
cmd/compile/internal/x86
cmd/compile
Building packages and commands for darwin/amd64.
container/list
runtime/cgo
container/ring
debug/gosym
cmd/internal/goobj
debug/plan9obj
cmd/vendor/golang.org/x/arch/arm/armasm
cmd/vendor/golang.org/x/arch/arm64/arm64asm
cmd/vendor/golang.org/x/arch/ppc64/ppc64asm
archive/zip
cmd/vendor/golang.org/x/arch/x86/x86asm
compress/bzip2
compress/lzw
crypto/internal/subtle
crypto/subtle
crypto/cipher
crypto/aes
crypto/des
crypto/internal/randutil
crypto/dsa
crypto/elliptic
crypto/sha512
cmd/internal/objfile
encoding/asn1
crypto/hmac
crypto/rand
crypto/rc4
cmd/addr2line
crypto/rsa
crypto/ecdsa
crypto/x509/pkix
encoding/pem
internal/x/crypto/cryptobyte/asn1
internal/x/crypto/cryptobyte
internal/nettrace
internal/singleflight
internal/x/net/dns/dnsmessage
internal/x/net/route
internal/x/crypto/internal/chacha20
internal/x/crypto/poly1305
internal/x/crypto/curve25519
internal/x/crypto/chacha20poly1305
internal/x/crypto/hkdf
database/sql/driver
encoding/ascii85
encoding/base32
database/sql
encoding/csv
encoding/gob
os/user
net
encoding/xml
internal/x/text/transform
internal/x/text/unicode/bidi
internal/x/text/secure/bidirule
internal/x/net/http2/hpack
internal/x/text/unicode/norm
mime
internal/x/net/idna
mime/quotedprintable
net/http/internal
go/constant
go/format
hash/crc64
hash/fnv
html/template
go/types
image/color
image
image/color/palette
image/internal/imageutil
image/draw
image/gif
archive/tar
image/jpeg
image/png
index/suffixarray
internal/syscall/windows
internal/syscall/windows/registry
internal/syscall/windows/sysdll
testing
internal/trace
internal/testenv
internal/x/text/secure
internal/x/text/unicode
math/cmplx
net/internal/socktest
os/signal
os/signal/internal/pty
plugin
go/internal/gccgoimporter
go/internal/gcimporter
crypto/x509
net/textproto
internal/x/net/http/httpproxy
go/internal/srcimporter
internal/x/net/internal/nettest
internal/x/net/http/httpguts
mime/multipart
go/importer
internal/x/net/nettest
log/syslog
net/mail
runtime/pprof/internal/profile
runtime/race
testing/internal/testdeps
testing/iotest
testing/quick
cmd/api
cmd/internal/buildid
cmd/buildid
cmd/compile/internal/test
cmd/internal/browser
cmd/cover
cmd/dist
cmd/doc
cmd/fix
cmd/go/internal/cfg
cmd/go/internal/str
cmd/go/internal/base
cmd/go/internal/renameio
cmd/go/internal/modinfo
cmd/go/internal/cache
cmd/go/internal/search
cmd/go/internal/load
cmd/go/internal/imports
cmd/go/internal/dirhash
cmd/go/internal/lockedfile/internal/filelock
cmd/go/internal/lockedfile
cmd/go/internal/par
cmd/go/internal/modfetch/codehost
cmd/go/internal/semver
cmd/go/internal/module
cmd/go/internal/modfile
cmd/go/internal/work
cmd/go/internal/mvs
cmd/go/internal/doc
cmd/go/internal/cmdflag
cmd/go/internal/help
cmd/internal/test2json
cmd/go/internal/tool
cmd/go/internal/version
cmd/go/internal/txtar
cmd/gofmt
cmd/nm
crypto/tls
cmd/objdump
cmd/pack
cmd/go/internal/run
cmd/vendor/github.com/google/pprof/internal/elfexec
cmd/vendor/github.com/google/pprof/profile
cmd/vendor/github.com/ianlancetaylor/demangle
cmd/vendor/github.com/google/pprof/internal/measurement
cmd/vendor/github.com/google/pprof/internal/graph
cmd/vendor/github.com/google/pprof/third_party/d3
cmd/vendor/github.com/google/pprof/third_party/d3flamegraph
cmd/vendor/github.com/google/pprof/third_party/svgpan
cmd/test2json
cmd/vendor/golang.org/x/sys/unix
net/http/httptrace
net/smtp
net/http
cmd/vendor/golang.org/x/crypto/ssh/terminal
cmd/vendor/github.com/google/pprof/internal/proftest
cmd/vendor/golang.org/x/sys/windows
cmd/vendor/golang.org/x/sys/windows/registry
cmd/vendor/golang.org/x/tools/go/analysis
cmd/vendor/golang.org/x/tools/go/types/objectpath
cmd/vendor/golang.org/x/tools/go/analysis/passes/internal/analysisutil
cmd/vendor/golang.org/x/tools/go/ast/inspector
cmd/vendor/golang.org/x/tools/go/analysis/internal/analysisflags
cmd/vendor/golang.org/x/tools/go/analysis/passes/asmdecl
cmd/vendor/golang.org/x/tools/go/analysis/internal/facts
cmd/vendor/golang.org/x/tools/go/analysis/passes/inspect
cmd/vendor/golang.org/x/tools/go/analysis/passes/assign
cmd/vendor/golang.org/x/tools/go/analysis/passes/atomic
cmd/vendor/golang.org/x/tools/go/analysis/passes/bools
cmd/vendor/golang.org/x/tools/go/analysis/passes/buildtag
cmd/vendor/golang.org/x/tools/go/analysis/passes/cgocall
cmd/vendor/golang.org/x/tools/go/analysis/passes/composite
cmd/vendor/golang.org/x/tools/go/analysis/passes/copylock
cmd/vendor/golang.org/x/tools/go/cfg
cmd/vendor/golang.org/x/tools/go/ast/astutil
cmd/vendor/golang.org/x/tools/go/analysis/passes/httpresponse
cmd/vendor/golang.org/x/tools/go/analysis/passes/loopclosure
cmd/vendor/golang.org/x/tools/go/analysis/passes/nilfunc
cmd/vendor/golang.org/x/tools/go/analysis/passes/pkgfact
cmd/vendor/golang.org/x/tools/go/analysis/passes/shift
cmd/vendor/golang.org/x/tools/go/analysis/passes/stdmethods
cmd/vendor/golang.org/x/tools/go/analysis/passes/structtag
cmd/vendor/golang.org/x/tools/go/analysis/passes/tests
cmd/vendor/golang.org/x/tools/go/analysis/passes/unreachable
cmd/vendor/golang.org/x/tools/go/types/typeutil
cmd/vendor/golang.org/x/tools/go/analysis/passes/unsafeptr
cmd/vendor/golang.org/x/tools/go/analysis/passes/unusedresult
cmd/vendor/golang.org/x/tools/go/analysis/passes/ctrlflow
cmd/vendor/golang.org/x/tools/go/analysis/passes/printf
cmd/vendor/golang.org/x/tools/go/analysis/passes/unmarshal
cmd/vendor/golang.org/x/tools/go/analysis/passes/lostcancel
cmd/vendor/golang.org/x/tools/go/analysis/unitchecker
cmd/vet
expvar
net/http/cookiejar
net/http/cgi
net/http/httptest
net/http/httputil
net/http/pprof
net/rpc
net/http/fcgi
cmd/go/internal/web
cmd/go/internal/get
cmd/go/internal/web2
net/rpc/jsonrpc
cmd/vendor/github.com/google/pprof/internal/plugin
cmd/vendor/github.com/google/pprof/internal/binutils
cmd/vendor/github.com/google/pprof/internal/report
cmd/go/internal/webtest
cmd/vendor/github.com/google/pprof/internal/symbolz
cmd/vendor/github.com/google/pprof/internal/transport
cmd/vendor/github.com/google/pprof/internal/symbolizer
cmd/go/internal/modfetch
cmd/trace
cmd/vendor/github.com/google/pprof/internal/driver
cmd/go/internal/modconv
cmd/go/internal/modload
cmd/vendor/github.com/google/pprof/driver
cmd/go/internal/clean
cmd/go/internal/envcmd
cmd/go/internal/fix
cmd/go/internal/fmtcmd
cmd/go/internal/bug
cmd/go/internal/generate
cmd/go/internal/list
cmd/go/internal/modcmd
cmd/go/internal/modget
cmd/go/internal/test
cmd/go/internal/vet
cmd/pprof
cmd/go
##### Testing packages.
ok archive/tar 0.100s
--- FAIL: TestReader (0.05s)
--- FAIL: TestReader/readme.notzip (0.00s)
reader_test.go:507: error=zip: not a valid zip file, want <nil>
--- FAIL: TestReader/Bad-CRC32-in-data-descriptor (0.00s)
reader_test.go:600: copying contents: zip: checksum error (want <nil>)
--- FAIL: TestReader/crc32-not-streamed.zip#01 (0.00s)
reader_test.go:600: copying contents: zip: checksum error (want <nil>)
FAIL
FAIL archive/zip 4.955s
ok bufio 0.100s
ok bytes 0.482s
ok compress/bzip2 0.169s
ok compress/flate 1.646s
--- FAIL: TestDecompressor (0.00s)
gunzip_test.go:386: hello.txt + garbage: io.Copy: gzip: invalid header want <nil>
gunzip_test.go:406: hello.txt + garbage: io.Copy: gzip: invalid header want <nil>
gunzip_test.go:386: hello.txt + corrupt checksum: io.Copy: gzip: invalid checksum want <nil>
gunzip_test.go:406: hello.txt + corrupt checksum: io.Copy: gzip: invalid checksum want <nil>
gunzip_test.go:386: hello.txt + corrupt size: io.Copy: gzip: invalid checksum want <nil>
gunzip_test.go:406: hello.txt + corrupt size: io.Copy: gzip: invalid checksum want <nil>
FAIL
FAIL compress/gzip 0.038s
ok compress/lzw 0.026s
--- FAIL: TestDecompressor (0.00s)
reader_test.go:151: bad header: NewReader: zlib: invalid header
reader_test.go:162: bad checksum: io.Copy: zlib: invalid checksum want <nil>
reader_test.go:151: wrong dictionary: NewReader: zlib: invalid dictionary
FAIL
FAIL compress/zlib 0.046s
ok container/heap 0.035s
ok container/list 0.032s
ok container/ring 0.055s
ok context 1.072s
ok crypto 0.025s
ok crypto/aes 0.051s
ok crypto/cipher 2.109s
ok crypto/des 0.028s
ok crypto/dsa 0.021s
ok crypto/ecdsa 0.319s
ok crypto/elliptic 0.598s
ok crypto/hmac 0.019s
ok crypto/internal/subtle 0.022s
ok crypto/md5 0.020s
ok crypto/rand 0.096s
ok crypto/rc4 0.076s
ok crypto/rsa 0.156s
ok crypto/sha1 0.083s
ok crypto/sha256 0.019s
ok crypto/sha512 0.021s
ok crypto/subtle 0.021s
ok crypto/tls 2.544s
ok crypto/x509 4.274s
ok database/sql 0.666s
--- FAIL: TestValueConverters (0.00s)
types_test.go:77: test 19: driver.defaultConverter(*time.Time(2019-01-03 18:36:23.964483 -0500 EST m=+0.000939615)) = 2019-01-03 18:36:23.964483 -0500 EST m=+0.000939615 (time.Time); want 0001-01-01 00:00:00 +0000 UTC (time.Time)
FAIL
FAIL database/sql/driver 0.016s
ok debug/dwarf 0.048s
ok debug/elf 0.061s
ok debug/gosym 24.092s
ok debug/macho 0.023s
ok debug/pe 0.030s
ok debug/plan9obj 0.018s
ok encoding/ascii85 0.028s
panic: time: missing Location in call to Time.In
goroutine 1 [running]:
time.Time.In(0x0, 0xec2927e10, 0x129a720, 0x0, 0x129a720, 0x0, 0x0)
/Users/whit537/workbench/go/src/github.com/golang/go/src/time/time.go:1120 +0xb3
FAIL encoding/asn1 0.022s
ok encoding/base32 0.042s
panic: runtime error: invalid memory address or nil pointer dereference
[signal SIGSEGV: segmentation violation code=0x1 addr=0x0 pc=0x10fc99d]
goroutine 1 [running]:
encoding/base64.init()
/Users/whit537/workbench/go/src/github.com/golang/go/src/encoding/base64/base64_test.go:89 +0x11d
FAIL encoding/base64 0.020s
ok encoding/binary 0.020s
--- FAIL: TestWrite (0.00s)
writer_test.go:61: Unexpected error:
got csv: invalid field or comment delimiter
want <nil>
FAIL
FAIL encoding/csv 0.032s
--- FAIL: TestBasic (0.00s)
type_test.go:42: checkType: expected "bool" got <nil>
type_test.go:45: id for "bool" is zero
type_test.go:42: checkType: expected "int" got <nil>
type_test.go:45: id for "int" is zero
type_test.go:42: checkType: expected "uint" got <nil>
type_test.go:45: id for "uint" is zero
type_test.go:42: checkType: expected "float" got <nil>
type_test.go:45: id for "float" is zero
type_test.go:42: checkType: expected "bytes" got <nil>
type_test.go:45: id for "bytes" is zero
type_test.go:42: checkType: expected "string" got <nil>
type_test.go:45: id for "string" is zero
FAIL
FAIL encoding/gob 0.081s
--- FAIL: TestDecodeErr (0.00s)
hex_test.go:102: Decode("0") = "", encoding/hex: odd length hex string, want "", <nil>
hex_test.go:102: Decode("30313") = "01", encoding/hex: odd length hex string, want "01", <nil>
hex_test.go:102: Decode("ffeed") = "\xff\xee", encoding/hex: odd length hex string, want "\xff\xee", <nil>
--- FAIL: TestDecodeStringErr (0.00s)
hex_test.go:111: DecodeString("0") = "", encoding/hex: odd length hex string, want "", <nil>
hex_test.go:111: DecodeString("30313") = "01", encoding/hex: odd length hex string, want "01", <nil>
hex_test.go:111: DecodeString("ffeed") = "\xff\xee", encoding/hex: odd length hex string, want "\xff\xee", <nil>
--- FAIL: TestDecoderErr (0.00s)
hex_test.go:160: NewDecoder("0") = "", unexpected EOF, want "", <nil>
hex_test.go:160: NewDecoder("30313") = "01", unexpected EOF, want "01", <nil>
hex_test.go:160: NewDecoder("ffeed") = "\xff\xee", unexpected EOF, want "\xff\xee", <nil>
FAIL
FAIL encoding/hex 0.020s
{"k1":1,"k2":"s","k3":[1,2,0.003],"k4":{"kk1":"s","kk2":2}}
null
{"k1":1,"k2":"s","k3":[1,2.0,3e-3],"k4":{"kk1":"s","kk2":2}}
null
{"x:y":true}
null
{"x:y":true}
null
--- FAIL: TestUnmarshal (0.01s)
decode_test.go:1054: #21: mismatch
have: map[string]interface {}{"k1":1, "k2":"s", "k3":[]interface {}{1, 2, 0.003}, "k4":map[string]interface {}{"kk1":"s", "kk2":2}}
want: map[string]interface {}(nil)
decode_test.go:1054: #22: mismatch
have: map[string]interface {}{"k1":"1", "k2":"s", "k3":[]interface {}{"1", "2.0", "3e-3"}, "k4":map[string]interface {}{"kk1":"s", "kk2":"2"}}
want: map[string]interface {}(nil)
decode_test.go:1030: #56: checkValid: &json.SyntaxError{msg:"unexpected end of JSON input", Offset:0}
decode_test.go:1030: #58: checkValid: &json.SyntaxError{msg:"unexpected end of JSON input", Offset:0}
decode_test.go:1030: #60: checkValid: &json.SyntaxError{msg:"unexpected end of JSON input", Offset:0}
decode_test.go:1030: #62: checkValid: &json.SyntaxError{msg:"unexpected end of JSON input", Offset:0}
decode_test.go:1048: #79: missing 'u' prefix, want <nil>
decode_test.go:1054: #86: mismatch
have: map[json.unmarshalerText]bool{json.unmarshalerText{A:"x", B:"y"}:true}
want: map[json.unmarshalerText]bool(nil)
decode_test.go:1054: #87: mismatch
have: map[json.unmarshalerText]bool{json.unmarshalerText{A:"x", B:"y"}:true}
want: map[json.unmarshalerText]bool(nil)
FAIL
FAIL encoding/json 0.883s
ok encoding/pem 0.074s
ok encoding/xml 0.052s
ok errors 0.016s
ok expvar 0.047s
ok flag 0.023s
--- FAIL: TestSprintf (0.00s)
fmt_test.go:1094: Sprintf("%f", 0) = "0.000000" want "+Inf"
fmt_test.go:1094: Sprintf("%.1f", 0) = "0.0" want "-Inf"
fmt_test.go:1094: Sprintf("% f", 0) = " 0.000000" want " NaN"
fmt_test.go:1094: Sprintf("%20f", 0) = " 0.000000" want " +Inf"
fmt_test.go:1094: Sprintf("% 20F", 0) = " 0.000000" want " Inf"
fmt_test.go:1094: Sprintf("% 20e", 0) = " 0.000000e+00" want " -Inf"
fmt_test.go:1094: Sprintf("%+20E", 0) = " +0.000000E+00" want " -Inf"
fmt_test.go:1094: Sprintf("% +20g", 0) = " +0" want " -Inf"
fmt_test.go:1094: Sprintf("%+-20G", 0) = "+0 " want "+Inf "
fmt_test.go:1094: Sprintf("%20e", 0) = " 0.000000e+00" want " NaN"
fmt_test.go:1094: Sprintf("% +20E", 0) = " +0.000000E+00" want " +NaN"
fmt_test.go:1094: Sprintf("% -20g", 0) = " 0 " want " NaN "
fmt_test.go:1094: Sprintf("%+-20G", 0) = "+0 " want "+NaN "
fmt_test.go:1094: Sprintf("%+020e", 0) = "+00000000.000000e+00" want " +Inf"
fmt_test.go:1094: Sprintf("%-020f", 0) = "0.000000 " want "-Inf "
fmt_test.go:1094: Sprintf("%-020E", 0) = "0.000000E+00 " want "NaN "
fmt_test.go:1094: Sprintf("%f", (0+0i)) = "(0.000000+0.000000i)" want "(+Inf+Infi)"
fmt_test.go:1094: Sprintf("%f", (0+0i)) = "(0.000000+0.000000i)" want "(-Inf-Infi)"
fmt_test.go:1094: Sprintf("%f", (0+0i)) = "(0.000000+0.000000i)" want "(NaN+NaNi)"
fmt_test.go:1094: Sprintf("%.1f", (0+0i)) = "(0.0+0.0i)" want "(+Inf+Infi)"
fmt_test.go:1094: Sprintf("% f", (0+0i)) = "( 0.000000+0.000000i)" want "( Inf+Infi)"
fmt_test.go:1094: Sprintf("% f", (0+0i)) = "( 0.000000+0.000000i)" want "(-Inf-Infi)"
fmt_test.go:1094: Sprintf("% f", (0+0i)) = "( 0.000000+0.000000i)" want "( NaN+NaNi)"
fmt_test.go:1094: Sprintf("%8e", (0+0i)) = "(0.000000e+00+0.000000e+00i)" want "( +Inf +Infi)"
fmt_test.go:1094: Sprintf("% 8E", (0+0i)) = "( 0.000000E+00+0.000000E+00i)" want "( Inf +Infi)"
fmt_test.go:1094: Sprintf("%+8f", (0+0i)) = "(+0.000000+0.000000i)" want "( -Inf -Infi)"
fmt_test.go:1094: Sprintf("% +8g", (0+0i)) = "( +0 +0i)" want "( -Inf -Infi)"
fmt_test.go:1094: Sprintf("% -8G", (0+0i)) = "( 0 +0 i)" want "( NaN +NaN i)"
fmt_test.go:1094: Sprintf("%+-8b", (0+0i)) = "(+0p-1074+0p-1074i)" want "(+NaN +NaN i)"
fmt_test.go:1094: Sprintf("%08f", (0+0i)) = "(0.000000+0.000000i)" want "( +Inf +Infi)"
fmt_test.go:1094: Sprintf("%-08g", (0+0i)) = "(0 +0 i)" want "(-Inf -Inf i)"
fmt_test.go:1094: Sprintf("%-08G", (0+0i)) = "(0 +0 i)" want "(NaN +NaN i)"
fmt_test.go:1094: Sprintf("%v", []) = "[]" want "[1 2 3 4 5]"
fmt_test.go:1094: Sprintf("%v", []) = "[]" want "[1 hello 2.5 <nil>]"
fmt_test.go:1094: Sprintf("%v", []) = "[]" want "[1 2 3 4 5]"
fmt_test.go:1094: Sprintf("%#v", []) = "[]fmt_test.renamedUint8(nil)" want "[]fmt_test.renamedUint8{0x1, 0x2, 0x3, 0x4, 0x5}"
fmt_test.go:1094: Sprintf("%v", map[0:1]) = "map[0:1]" want "map[NaN:1 NaN:1]"
fmt_test.go:1094: Sprintf("%☠", map[0:1]) = "map[%!☠(float64=0):%!☠(int=1)]" want "map[%!☠(float64=NaN):%!☠(int=1)]"
FAIL
FAIL fmt 0.293s
ok go/ast 0.022s
--- FAIL: TestGoodOSArch (0.00s)
syslist_test.go:59: goodOSArchFile("file_.go") != false
FAIL
FAIL go/build 0.898s
--- FAIL: TestString (0.00s)
value_test.go:263: "xxx": got "\"xxx\""; want "\"..." as short string
value_test.go:263: "xxx": got "\"xxx\""; want "\"..." as short string
FAIL
FAIL go/constant 0.021s
ok go/doc 0.279s
ok go/format 0.029s
ok go/importer 0.448s
ok go/internal/gccgoimporter 0.070s
ok go/internal/gcimporter 1.078s
ok go/internal/srcimporter 3.320s
ok go/parser 0.077s
ok go/printer 0.746s
ok go/scanner 0.021s
ok go/token 0.054s
--- FAIL: TestValuesInfo (0.00s)
panic: runtime error: invalid memory address or nil pointer dereference [recovered]
panic: runtime error: invalid memory address or nil pointer dereference [recovered]
panic: runtime error: invalid memory address or nil pointer dereference
[signal SIGSEGV: segmentation violation code=0x1 addr=0x28 pc=0x11bafd1]
goroutine 22 [running]:
testing.tRunner.func1(0xc0000ea500)
/Users/whit537/workbench/go/src/github.com/golang/go/src/testing/testing.go:827 +0x388
panic(0x12c52c0, 0x156dd30)
/Users/whit537/workbench/go/src/github.com/golang/go/src/runtime/panic.go:522 +0x1b5
go/types.(*Checker).handleBailout(0xc0000ec780, 0xc000104d58)
/Users/whit537/workbench/go/src/github.com/golang/go/src/go/types/check.go:240 +0x98
panic(0x12c52c0, 0x156dd30)
/Users/whit537/workbench/go/src/github.com/golang/go/src/runtime/panic.go:522 +0x1b5
go/types.(*Config).sizeof(0xc0000818c0, 0x1383fc0, 0x156ebe0, 0x1598501)
/Users/whit537/workbench/go/src/github.com/golang/go/src/go/types/sizes.go:250 +0x71
go/types.representableConst(0x1388b00, 0x1598560, 0xc0000ec780, 0x156ebe0, 0xc000081968, 0x11)
/Users/whit537/workbench/go/src/github.com/golang/go/src/go/types/expr.go:216 +0x1f5
go/types.(*Checker).representable(0xc0000ec780, 0xc000081940, 0x156ebe0)
/Users/whit537/workbench/go/src/github.com/golang/go/src/go/types/expr.go:335 +0x69
go/types.(*Checker).convertUntyped(0xc0000ec780, 0xc000081940, 0x1383fc0, 0x156ebe0)
/Users/whit537/workbench/go/src/github.com/golang/go/src/go/types/expr.go:517 +0x977
go/types.(*Checker).assignment(0xc0000ec780, 0xc000081940, 0x1383fc0, 0x156ebe0, 0x131d942, 0x14)
/Users/whit537/workbench/go/src/github.com/golang/go/src/go/types/assignments.go:46 +0x140
go/types.(*Checker).initVar(0xc0000ec780, 0xc000108820, 0xc000081940, 0x131d942, 0x14, 0xc0000dcb30, 0xc000104af8)
/Users/whit537/workbench/go/src/github.com/golang/go/src/go/types/assignments.go:124 +0x150
go/types.(*Checker).varDecl(0xc0000ec780, 0xc000108820, 0xc00008e1d0, 0x1, 0x1, 0x0, 0x0, 0x1387400, 0xc00008a9c0)
/Users/whit537/workbench/go/src/github.com/golang/go/src/go/types/decl.go:394 +0x1f3
go/types.(*Checker).objDecl(0xc0000ec780, 0x138e0c0, 0xc000108820, 0x0)
/Users/whit537/workbench/go/src/github.com/golang/go/src/go/types/decl.go:204 +0x68d
go/types.(*Checker).packageObjects(0xc0000ec780)
/Users/whit537/workbench/go/src/github.com/golang/go/src/go/types/resolver.go:588 +0x25d
go/types.(*Checker).checkFiles(0xc0000ec780, 0xc000104e18, 0x1, 0x1, 0x0, 0x0)
/Users/whit537/workbench/go/src/github.com/golang/go/src/go/types/check.go:254 +0xa5
go/types.(*Checker).Files(...)
/Users/whit537/workbench/go/src/github.com/golang/go/src/go/types/check.go:245
go/types.(*Config).Check(0xc0000818c0, 0xc00007e5f8, 0x2, 0xc000081840, 0xc000104e18, 0x1, 0x1, 0xc000108640, 0x0, 0x12ffd60, ...)
/Users/whit537/workbench/go/src/github.com/golang/go/src/go/types/api.go:351 +0x11c
go/types_test.pkgFor(0x1319272, 0xa, 0x131de53, 0x15, 0xc000108640, 0xc000104e90, 0x100bf68, 0x30)
/Users/whit537/workbench/go/src/github.com/golang/go/src/go/types/api_test.go:30 +0x1e7
go/types_test.mustTypecheck(0xc0000ea500, 0x1319272, 0xa, 0x131de53, 0x15, 0xc000108640, 0xc00007e5c0, 0x2)
/Users/whit537/workbench/go/src/github.com/golang/go/src/go/types/api_test.go:34 +0x69
go/types_test.TestValuesInfo(0xc0000ea500)
/Users/whit537/workbench/go/src/github.com/golang/go/src/go/types/api_test.go:142 +0x3fa
testing.tRunner(0xc0000ea500, 0x132fe80)
/Users/whit537/workbench/go/src/github.com/golang/go/src/testing/testing.go:862 +0xc0
created by testing.(*T).Run
/Users/whit537/workbench/go/src/github.com/golang/go/src/testing/testing.go:913 +0x357
FAIL go/types 0.026s
ok hash 0.020s
ok hash/adler32 0.024s
ok hash/crc32 0.023s
ok hash/crc64 0.018s
ok hash/fnv 0.017s
ok html 0.020s
ok html/template 0.101s
ok image 0.280s
ok image/color 0.051s
ok image/draw 0.132s
ok image/gif 0.747s
ok image/jpeg 0.724s
ok image/png 0.107s
ok index/suffixarray 0.030s
ok internal/cpu 0.058s
ok internal/fmtsort 0.017s
ok internal/poll 0.041s
ok internal/singleflight 0.029s
ok internal/trace 4.006s
ok internal/x/crypto/chacha20poly1305 0.480s
ok internal/x/crypto/cryptobyte 0.021s
ok internal/x/crypto/curve25519 0.053s
ok internal/x/crypto/hkdf 0.019s
ok internal/x/crypto/internal/chacha20 0.133s
ok internal/x/crypto/poly1305 0.024s
ok internal/x/net/dns/dnsmessage 0.205s
ok internal/x/net/http/httpguts 0.020s
ok internal/x/net/http/httpproxy 0.019s
ok internal/x/net/http2/hpack 0.020s
ok internal/x/net/idna 0.016s
ok internal/x/net/nettest 0.930s
ok internal/x/net/route 0.029s
ok internal/x/text/transform 0.018s
ok internal/x/text/unicode/norm 0.016s
ok internal/xcoff 0.056s
ok io 0.059s
ok io/ioutil 0.024s
ok log 0.025s
ok log/syslog 1.285s
--- FAIL: TestDim (0.00s)
all_test.go:2382: Dim(-Inf, 0) = 0, want NaN
all_test.go:2382: Dim(+Inf, 0) = +Inf, want NaN
all_test.go:2382: Dim(0, -Inf) = +Inf, want NaN
all_test.go:2382: Dim(0, -0) = 0, want NaN
all_test.go:2382: Dim(0, 0) = 0, want NaN
all_test.go:2382: Dim(0, +Inf) = 0, want NaN
all_test.go:2382: Dim(0, 0) = 0, want NaN
--- FAIL: TestMax (0.00s)
all_test.go:2413: Max(-Inf, 0) = 0, want NaN
all_test.go:2413: Max(0, -Inf) = 0, want NaN
all_test.go:2413: Max(0, -0) = 0, want NaN
all_test.go:2413: Max(0, 0) = 0, want NaN
all_test.go:2413: Max(0, 0) = 0, want NaN
--- FAIL: TestMin (0.00s)
all_test.go:2431: Min(+Inf, 0) = 0, want NaN
all_test.go:2431: Min(0, -0) = -0, want NaN
all_test.go:2431: Min(0, 0) = 0, want NaN
all_test.go:2431: Min(0, +Inf) = 0, want NaN
all_test.go:2431: Min(0, 0) = 0, want NaN
FAIL
FAIL math 0.025s
ok math/big 3.573s
ok math/bits 0.023s
ok math/cmplx 0.018s
ok math/rand 0.479s
ok mime 0.027s
ok mime/multipart 0.885s
ok mime/quotedprintable 0.212s
panic: runtime error: invalid memory address or nil pointer dereference
[signal SIGSEGV: segmentation violation code=0x1 addr=0x18 pc=0x11ffa90]
goroutine 1 [running]:
net.init()
/Users/whit537/workbench/go/src/github.com/golang/go/src/net/iprawsock_test.go:49 +0x31e0
FAIL net 0.022s
--- FAIL: TestLocationResponse (0.00s)
response_test.go:791: 2. err="http: no Location header in response"
--- FAIL: TestCancelRequestMidBody_h1 (0.00s)
clientserver_test.go:564: ReadAll error = net/http: request canceled; want <nil>
--- FAIL: TestCancelRequestMidBody_h2 (0.01s)
clientserver_test.go:564: ReadAll error = net/http: request canceled; want <nil>
--- FAIL: TestTransportCancelBeforeResponseHeaders (0.00s)
transport_test.go:2155: RoundTrip error = net/http: request canceled; want ExportErrRequestCanceled
--- FAIL: TestRetryRequestsOnError (0.01s)
--- FAIL: TestRetryRequestsOnError/IdempotentNoBodySomeWritten (0.00s)
transport_test.go:3112: i=1: Do = Get http://fake.golang: net/http: HTTP/1.x transport connection broken: short write; log:
Dial
Write("GET / HTTP/1.1\r\nHost: fake.golang\r\nUser-Agent: Go-http-client/1.1\r\nAccept-Encoding: gzip\r\n\r\n")
Handler
intentional write failure
--- FAIL: TestRetryRequestsOnError/IdempotentGetBodySomeWritten (0.00s)
transport_test.go:3112: i=1: Do = Get http://fake.golang: net/http: HTTP/1.x transport connection broken: short write; log:
Dial
Write("GET / HTTP/1.1\r\nHost: fake.golang\r\nUser-Agent: Go-http-client/1.1\r\nContent-Length: 4\r\nAccept-Encoding: gzip\r\n\r\nfoo\n")
Handler
intentional write failure
--- FAIL: TestTransportDialCancelRace (0.00s)
transport_test.go:3407: expected canceled request error; got net/http: request canceled
--- FAIL: TestNoCrashReturningTransportAltConn (0.01s)
transport_test.go:3749: Do error = Get https://fake.tld/: net/http: request canceled while waiting for connection; want url.Error with errRequestCanceledConn
--- FAIL: TestClientTimeoutCancel (0.00s)
client_test.go:1349: error = net/http: request canceled; want errRequestCanceled
FAIL
FAIL net/http 5.249s
ok net/http/cgi 1.372s
--- FAIL: TestDomainAndType (0.00s)
jar_test.go:330: "127.0.0.1"/"127.0.0.1": got "cookiejar: no host name available (IP only)" error, want %!q(<nil>)
jar_test.go:330: "2001:4860:0:2001::68"/"2001:4860:0:2001::68": got "cookiejar: no host name available (IP only)" error, want %!q(<nil>)
jar_test.go:330: "www.example.com"/".": got "cookiejar: malformed cookie domain attribute" error, want %!q(<nil>)
jar_test.go:330: "www.example.com"/"..": got "cookiejar: malformed cookie domain attribute" error, want %!q(<nil>)
jar_test.go:330: "www.example.com"/"other.com": got "cookiejar: illegal cookie domain attribute" error, want %!q(<nil>)
jar_test.go:330: "www.example.com"/"com": got "cookiejar: illegal cookie domain attribute" error, want %!q(<nil>)
jar_test.go:330: "www.example.com"/".com": got "cookiejar: illegal cookie domain attribute" error, want %!q(<nil>)
jar_test.go:330: "foo.bar.co.uk"/".co.uk": got "cookiejar: illegal cookie domain attribute" error, want %!q(<nil>)
jar_test.go:330: "127.www.0.0.1"/"127.0.0.1": got "cookiejar: illegal cookie domain attribute" error, want %!q(<nil>)
FAIL
FAIL net/http/cookiejar 0.046s
# cmd/compile/internal/ssa [cmd/compile/internal/ssa.test]
cmd/compile/internal/ssa/export_test.go:24:24: undefined: x86.Linkamd64
cmd/compile/internal/ssa/export_test.go:25:24: undefined: s390x.Links390x
panic: test timed out after 9m0s
goroutine 25 [running]:
testing.(*M).startAlarm.func1()
/Users/whit537/workbench/go/src/github.com/golang/go/src/testing/testing.go:1331 +0xdf
created by time.goFunc
/Users/whit537/workbench/go/src/github.com/golang/go/src/time/sleep.go:169 +0x44
goroutine 1 [chan receive]:
testing.(*T).Run(0xc000160400, 0x1324c35, 0x16, 0x1334c88, 0x1077701)
/Users/whit537/workbench/go/src/github.com/golang/go/src/testing/testing.go:914 +0x37e
testing.runTests.func1(0xc000160000)
/Users/whit537/workbench/go/src/github.com/golang/go/src/testing/testing.go:1154 +0x78
testing.tRunner(0xc000160000, 0xc0000d1e30)
/Users/whit537/workbench/go/src/github.com/golang/go/src/testing/testing.go:862 +0xc0
testing.runTests(0xc0000b43e0, 0x157bc00, 0x6, 0x6, 0x0)
/Users/whit537/workbench/go/src/github.com/golang/go/src/testing/testing.go:1152 +0x2a9
testing.(*M).Run(0xc000140100, 0x0)
/Users/whit537/workbench/go/src/github.com/golang/go/src/testing/testing.go:1069 +0x162
main.main()
_testmain.go:52 +0x13e
goroutine 23 [chan receive]:
net/http/fcgi.TestChildServeCleansUp(0xc000160400)
/Users/whit537/workbench/go/src/github.com/golang/go/src/net/http/fcgi/fcgi_test.go:254 +0x300
testing.tRunner(0xc000160400, 0x1334c88)
/Users/whit537/workbench/go/src/github.com/golang/go/src/testing/testing.go:862 +0xc0
created by testing.(*T).Run
/Users/whit537/workbench/go/src/github.com/golang/go/src/testing/testing.go:913 +0x357
FAIL net/http/fcgi 540.063s
ok net/http/httptest 0.071s
ok net/http/httptrace 0.045s
ok net/http/httputil 0.115s
ok net/http/internal 0.015s
ok net/http/pprof 2.106s
ok net/internal/socktest 0.014s
ok net/mail 0.028s
ok net/rpc 0.079s
ok net/rpc/jsonrpc 0.048s
ok net/smtp 0.057s
ok net/textproto 0.018s
ok net/url 0.025s
--- FAIL: TestOpenError (0.00s)
os_test.go:1439: Open("", 1) = _, "no such file or directory"; want "is a directory"
os_test.go:1439: Open("//no-such-file", 1) = _, "no such file or directory"; want "not a directory"
FAIL
FAIL os 1.191s
ok os/exec 2.399s
ok os/signal 4.951s
ok os/user 0.025s
--- FAIL: TestMatch (0.00s)
match_test.go:76: Match(`[]a]`, `]`) = false, syntax error in pattern want false, <nil>
match_test.go:76: Match(`[-]`, `-`) = false, syntax error in pattern want false, <nil>
match_test.go:76: Match(`[x-]`, `x`) = false, syntax error in pattern want false, <nil>
match_test.go:76: Match(`[x-]`, `-`) = false, syntax error in pattern want false, <nil>
match_test.go:76: Match(`[x-]`, `z`) = false, syntax error in pattern want false, <nil>
match_test.go:76: Match(`[-x]`, `x`) = false, syntax error in pattern want false, <nil>
match_test.go:76: Match(`[-x]`, `-`) = false, syntax error in pattern want false, <nil>
match_test.go:76: Match(`[-x]`, `a`) = false, syntax error in pattern want false, <nil>
match_test.go:76: Match(`\`, `a`) = false, syntax error in pattern want false, <nil>
match_test.go:76: Match(`[a-b-c]`, `a`) = false, syntax error in pattern want false, <nil>
match_test.go:76: Match(`[`, `a`) = false, syntax error in pattern want false, <nil>
match_test.go:76: Match(`[^`, `a`) = false, syntax error in pattern want false, <nil>
match_test.go:76: Match(`[^bc`, `a`) = false, syntax error in pattern want false, <nil>
match_test.go:76: Match(`a[`, `ab`) = false, syntax error in pattern want false, <nil>
FAIL
FAIL path 0.020s
ok path/filepath 0.219s
ok plugin 0.016s
ok reflect 0.263s
ok regexp 0.138s
ok regexp/syntax 0.807s
ok runtime 41.147s
ok runtime/debug 0.122s
ok runtime/internal/atomic 0.108s
ok runtime/internal/math 0.015s
ok runtime/internal/sys 0.013s
ok runtime/pprof 11.364s
ok runtime/pprof/internal/profile 0.013s
ok runtime/trace 1.991s
ok sort 0.132s
ok strconv 1.213s
--- FAIL: TestPickAlgorithm (0.00s)
panic: runtime error: invalid memory address or nil pointer dereference [recovered]
panic: runtime error: invalid memory address or nil pointer dereference
[signal SIGSEGV: segmentation violation code=0x1 addr=0x0 pc=0x10b10eb]
goroutine 84 [running]:
testing.tRunner.func1(0xc0000c6a00)
/Users/whit537/workbench/go/src/github.com/golang/go/src/testing/testing.go:827 +0x388
panic(0x114bf20, 0x12a25b0)
/Users/whit537/workbench/go/src/github.com/golang/go/src/runtime/panic.go:522 +0x1b5
strings.(*Replacer).Replacer(0x0, 0x10467ac, 0x10588b0)
/Users/whit537/workbench/go/src/github.com/golang/go/src/strings/export_test.go:8 +0x3b
strings_test.TestPickAlgorithm(0xc0000c6a00)
/Users/whit537/workbench/go/src/github.com/golang/go/src/strings/replace_test.go:326 +0x86
testing.tRunner(0xc0000c6a00, 0x1182508)
/Users/whit537/workbench/go/src/github.com/golang/go/src/testing/testing.go:862 +0xc0
created by testing.(*T).Run
/Users/whit537/workbench/go/src/github.com/golang/go/src/testing/testing.go:913 +0x357
FAIL strings 0.259s
ok sync 0.363s
ok sync/atomic 0.041s
ok syscall 0.103s
ok testing 1.088s
ok testing/quick 0.204s
ok text/scanner 0.020s
ok text/tabwriter 0.017s
--- FAIL: TestExecute (0.02s)
exec_test.go:724: ideal int: unexpected execute error: template: ideal int:1:2: executing "ideal int" at <typeOf>: wrong number of args for typeOf: want 1 got 0
FAIL
FAIL text/template 1.183s
--- FAIL: TestLex (0.00s)
lex_test.go:418: empty: got
[EOF]
expected
[]
lex_test.go:418: spaces: got
[" \t\n" EOF]
expected
[" \t\n" ]
lex_test.go:418: text: got
["now is the"... EOF]
expected
["now is the"... ]
lex_test.go:418: text with comment: got
["hello-" "-world" EOF]
expected
["hello-" "-world" ]
lex_test.go:418: punctuation: got
["{{" "," "@" "%" " " "}}" EOF]
expected
[ "," "@" "%" ]
lex_test.go:418: parens: got
["{{" "(" "(" "3" ")" ")" "}}" EOF]
expected
[ "3" ]
lex_test.go:418: empty action: got
["{{" "}}" EOF]
expected
[ ]
lex_test.go:418: for: got
["{{" "for" "}}" EOF]
expected
[ ]
lex_test.go:418: block: got
["{{" <block> " " "\"foo\"" " " <.> "}}" EOF]
expected
[ "\"foo\"" ]
lex_test.go:418: quote: got
["{{" "\"abc \\n\\t\\"... "}}" EOF]
expected
[ ]
lex_test.go:418: raw quote: got
["{{" "`abc\\n\\t\\\""... "}}" EOF]
expected
[ ]
lex_test.go:418: raw quote with newline: got
["{{" "`now is{{\n"... "}}" EOF]
expected
[ ]
lex_test.go:418: numbers: got
["{{" "1" " " "02" " " "0x14" " " "-7.2i" " " "1e3" " " "+1.2e-4" " " "4.2i" " " "1+2i" "}}" EOF]
expected
[ "1" "02" "0x14" "-7.2i" "1e3" "+1.2e-4" "4.2i" "1+2i" ]
lex_test.go:418: characters: got
["{{" "'a'" " " "'\\n'" " " "'\\''" " " "'\\\\'" " " "'\\u00FF'" " " "'\\xFF'" " " "'本'" "}}" EOF]
expected
[ "'a'" "'\\n'" "'\\''" "'\\\\'" "'\\u00FF'" "'\\xFF'" "'本'" ]
lex_test.go:418: bools: got
["{{" "true" " " "false" "}}" EOF]
expected
[ "true" "false" ]
lex_test.go:418: dot: got
["{{" <.> "}}" EOF]
expected
[ ]
lex_test.go:418: nil: got
["{{" <nil> "}}" EOF]
expected
[ <nil> ]
lex_test.go:418: dots: got
["{{" ".x" " " <.> " " ".2" " " ".x" ".y" ".z" "}}" EOF]
expected
[ ".x" ".2" ".x" ".y" ".z" ]
lex_test.go:418: keywords: got
["{{" <range> " " <if> " " <else> " " <end> " " <with> "}}" EOF]
expected
[ <range> <if> <else> <end> <with> ]
lex_test.go:418: variables: got
["{{" "$c" " " ":=" " " "printf" " " "$" " " "$hello" " " "$23" " " "$" " " "$var" ".Field" " " ".Method" "}}" EOF]
expected
[ "$c" ":=" "printf" "$" "$hello" "$23" "$" "$var" ".Field" ".Method" ]
lex_test.go:418: variable invocation: got
["{{" "$x" " " "23" "}}" EOF]
expected
[ "$x" "23" ]
lex_test.go:418: pipeline: got
["intro " "{{" "echo" " " "hi" " " "1.2" " " "|" "noargs" "|" "args" " " "1" " " "\"hi\"" "}}" " outro" EOF]
expected
["intro " "echo" "hi" "1.2" "noargs" "args" "1" "\"hi\"" " outro" ]
lex_test.go:418: declaration: got
["{{" "$v" " " ":=" " " "3" "}}" EOF]
expected
[ "$v" ":=" "3" ]
lex_test.go:418: 2 declarations: got
["{{" "$v" " " "," " " "$w" " " ":=" " " "3" "}}" EOF]
expected
[ "$v" "," "$w" ":=" "3" ]
lex_test.go:418: field of parenthesized expression: got
["{{" "(" ".X" ")" ".Y" "}}" EOF]
expected
[ ".X" ".Y" ]
lex_test.go:418: trimming spaces before and after: got
["hello-" "{{" "3" "}}" "-world" EOF]
expected
["hello-" "3" "-world" ]
lex_test.go:418: trimming spaces before and after comment: got
["hello-" "-world" EOF]
expected
["hello-" "-world" ]
lex_test.go:418: badchar: got
["#" "{{" unrecognized character in action: U+0001]
expected
["#" unrecognized character in action: U+0001]
lex_test.go:418: unclosed action: got
["{{" unclosed action]
expected
[ unclosed action]
lex_test.go:418: EOF in action: got
["{{" <range> unclosed action]
expected
[ unclosed action]
lex_test.go:418: unclosed quote: got
["{{" unterminated quoted string]
expected
[ unterminated quoted string]
lex_test.go:418: unclosed raw quote: got
["{{" unterminated raw quoted string]
expected
[ unterminated raw quoted string]
lex_test.go:418: unclosed char constant: got
["{{" unterminated character constant]
expected
[ unterminated character constant]
lex_test.go:418: bad number: got
["{{" bad number syntax: "3k"]
expected
[ bad number syntax: "3k"]
lex_test.go:418: unclosed paren: got
["{{" "(" "3" unclosed left paren]
expected
[ "3" unclosed left paren]
lex_test.go:418: extra right paren: got
["{{" "3" ")" unexpected right paren U+0029 ')']
expected
[ "3" unexpected right paren U+0029 ')']
lex_test.go:418: long pipeline deadlock: got
["{{" "|" "|" "|" "|" "|" "}}" EOF]
expected
[ ]
lex_test.go:418: unmatched right delimiter: got
["hello-{.}}"... EOF]
expected
["hello-{.}}"... ]
--- FAIL: TestDelims (0.00s)
lex_test.go:452: punctuation: got
["$$" "," "@" "%" "{" "{" "}" "}" "@@" EOF]
expected
[ "," "@" "%" "{" "{" "}" "}" ]
lex_test.go:452: empty action: got
["$$" "@@" EOF]
expected
[ ]
lex_test.go:452: for: got
["$$" "for" "@@" EOF]
expected
[ ]
lex_test.go:452: quote: got
["$$" "\"abc \\n\\t\\"... "@@" EOF]
expected
[ ]
lex_test.go:452: raw quote: got
["$$" "`abc\\n\\t\\\""... "@@" EOF]
expected
[ ]
FAIL
FAIL text/template/parse 0.034s
--- FAIL: TestLoadLocationValidatesNames (0.00s)
zoneinfo_test.go:65: LoadLocation("/usr/foo/Foo") error = time: invalid location name; want ErrLocation
zoneinfo_test.go:65: LoadLocation("\\UNC\foo") error = time: invalid location name; want ErrLocation
zoneinfo_test.go:65: LoadLocation("..") error = time: invalid location name; want ErrLocation
zoneinfo_test.go:65: LoadLocation("a..") error = time: invalid location name; want ErrLocation
FAIL
FAIL time 2.805s
ok unicode 0.019s
ok unicode/utf16 0.016s
ok unicode/utf8 0.022s
ok cmd/addr2line 4.502s
--- FAIL: TestGolden (0.01s)
panic: runtime error: invalid memory address or nil pointer dereference [recovered]
panic: runtime error: invalid memory address or nil pointer dereference [recovered]
panic: runtime error: invalid memory address or nil pointer dereference
[signal SIGSEGV: segmentation violation code=0x1 addr=0x28 pc=0x11d0bc1]
goroutine 5 [running]:
testing.tRunner.func1(0xc000106100)
/Users/whit537/workbench/go/src/github.com/golang/go/src/testing/testing.go:827 +0x388
panic(0x122de00, 0x144b9a0)
/Users/whit537/workbench/go/src/github.com/golang/go/src/runtime/panic.go:522 +0x1b5
go/types.(*Checker).handleBailout(0xc000166000, 0xc000189ba0)
/Users/whit537/workbench/go/src/github.com/golang/go/src/go/types/check.go:240 +0x98
panic(0x122de00, 0x144b9a0)
/Users/whit537/workbench/go/src/github.com/golang/go/src/runtime/panic.go:522 +0x1b5
go/types.(*Config).sizeof(0xc00015ea80, 0x12be140, 0x144c5e0, 0xc000018c01)
/Users/whit537/workbench/go/src/github.com/golang/go/src/go/types/sizes.go:250 +0x71
go/types.representableConst(0x12c1780, 0xc000018ca0, 0xc000166000, 0x144c5e0, 0xc00015ef28, 0x11baccd)
/Users/whit537/workbench/go/src/github.com/golang/go/src/go/types/expr.go:216 +0x1f5
go/types.(*Checker).conversion(0xc000166000, 0xc00015ef00, 0x12be240, 0xc000160bd0)
/Users/whit537/workbench/go/src/github.com/golang/go/src/go/types/conversions.go:21 +0x5b2
go/types.(*Checker).call(0xc000166000, 0xc00015ef00, 0xc000010340, 0x1)
/Users/whit537/workbench/go/src/github.com/golang/go/src/go/types/call.go:34 +0x1f4
go/types.(*Checker).exprInternal(0xc000166000, 0xc00015ef00, 0x12c0500, 0xc000010340, 0x0, 0x0, 0x1)
/Users/whit537/workbench/go/src/github.com/golang/go/src/go/types/expr.go:1469 +0x1eb4
go/types.(*Checker).rawExpr(0xc000166000, 0xc00015ef00, 0x12c0500, 0xc000010340, 0x0, 0x0, 0x0)
/Users/whit537/workbench/go/src/github.com/golang/go/src/go/types/expr.go:982 +0x81
go/types.(*Checker).multiExpr(0xc000166000, 0xc00015ef00, 0x12c0500, 0xc000010340)
/Users/whit537/workbench/go/src/github.com/golang/go/src/go/types/expr.go:1599 +0x58
go/types.(*Checker).expr(0xc000166000, 0xc00015ef00, 0x12c0500, 0xc000010340)
/Users/whit537/workbench/go/src/github.com/golang/go/src/go/types/expr.go:1593 +0x49
go/types.(*Checker).constDecl(0xc000166000, 0xc000052900, 0x0, 0x0, 0x12c0500, 0xc000010340)
/Users/whit537/workbench/go/src/github.com/golang/go/src/go/types/decl.go:360 +0x129
go/types.(*Checker).objDecl(0xc000166000, 0x12c4060, 0xc000052900, 0x0)
/Users/whit537/workbench/go/src/github.com/golang/go/src/go/types/decl.go:201 +0x719
go/types.(*Checker).packageObjects(0xc000166000)
/Users/whit537/workbench/go/src/github.com/golang/go/src/go/types/resolver.go:588 +0x25d
go/types.(*Checker).checkFiles(0xc000166000, 0xc00000e508, 0x1, 0x1, 0x0, 0x0)
/Users/whit537/workbench/go/src/github.com/golang/go/src/go/types/check.go:254 +0xa5
go/types.(*Checker).Files(...)
/Users/whit537/workbench/go/src/github.com/golang/go/src/go/types/check.go:245
go/types.(*Config).Check(0xc00015ea80, 0xc000112091, 0x2, 0xc000092ac0, 0xc00000e508, 0x1, 0x1, 0x0, 0x0, 0x1e, ...)
/Users/whit537/workbench/go/src/github.com/golang/go/src/go/types/api.go:351 +0x11c
cmd/api.(*Walker).Import(0xc000117450, 0xc000112091, 0x2, 0x6, 0xc000139678, 0x1)
/Users/whit537/workbench/go/src/github.com/golang/go/src/cmd/api/goapi.go:504 +0x8bc
cmd/api.TestGolden(0xc000106100)
/Users/whit537/workbench/go/src/github.com/golang/go/src/cmd/api/goapi_test.go:43 +0x3d6
testing.tRunner(0xc000106100, 0x127d670)
/Users/whit537/workbench/go/src/github.com/golang/go/src/testing/testing.go:862 +0xc0
created by testing.(*T).Run
/Users/whit537/workbench/go/src/github.com/golang/go/src/testing/testing.go:913 +0x357
FAIL cmd/api 0.028s
--- FAIL: TestARMEndToEnd (0.13s)
endtoend_test.go:367: GOARM=5
endtoend_test.go:186: illegal combination 00108 (testdata/arm.s:106) SWI $2; RCON NONE NONE; from 4 0; to 0 0
endtoend_test.go:186: illegal combination 00112 (testdata/arm.s:107) SWI $3; RCON NONE NONE; from 4 0; to 0 0
endtoend_test.go:186: illegal combination 00156 (testdata/arm.s:166) WORD $1234; RCON2A NONE NONE; from 4 0; to 0 0
endtoend_test.go:186: illegal combination 03040 (testdata/arm.s:1023) WORD $0; RCON NONE NONE; from 4 0; to 0 0
endtoend_test.go:186: illegal combination 03044 (testdata/arm.s:1024) WORD $4294967295; NCON NONE NONE; from 4 0; to 0 0
endtoend_test.go:186: illegal combination 03048 (testdata/arm.s:1025) WORD $2863311530; LCON NONE NONE; from 4 0; to 0 0
endtoend_test.go:186: illegal combination 03052 (testdata/arm.s:1026) WORD $1431655765; LCON NONE NONE; from 4 0; to 0 0
endtoend_test.go:186: illegal combination 03076 (testdata/arm.s:1032) SWI $0; RCON NONE NONE; from 4 0; to 0 0
endtoend_test.go:186: illegal combination 03080 (testdata/arm.s:1033) SWI $65535; RCON2A NONE NONE; from 4 0; to 0 0
endtoend_test.go:186: illegal combination 00108 (testdata/arm.s:106) SWI $2; RCON NONE NONE; from 4 0; to 0 0
endtoend_test.go:186: illegal combination 00112 (testdata/arm.s:107) SWI $3; RCON NONE NONE; from 4 0; to 0 0
endtoend_test.go:186: illegal combination 00156 (testdata/arm.s:166) WORD $1234; RCON2A NONE NONE; from 4 0; to 0 0
endtoend_test.go:186: illegal combination 03040 (testdata/arm.s:1023) WORD $0; RCON NONE NONE; from 4 0; to 0 0
endtoend_test.go:186: illegal combination 03044 (testdata/arm.s:1024) WORD $4294967295; NCON NONE NONE; from 4 0; to 0 0
endtoend_test.go:186: illegal combination 03048 (testdata/arm.s:1025) WORD $2863311530; LCON NONE NONE; from 4 0; to 0 0
endtoend_test.go:186: illegal combination 03052 (testdata/arm.s:1026) WORD $1431655765; LCON NONE NONE; from 4 0; to 0 0
endtoend_test.go:186: illegal combination 03076 (testdata/arm.s:1032) SWI $0; RCON NONE NONE; from 4 0; to 0 0
endtoend_test.go:186: illegal combination 03080 (testdata/arm.s:1033) SWI $65535; RCON2A NONE NONE; from 4 0; to 0 0
endtoend_test.go:186: illegal combination 00108 (testdata/arm.s:106) SWI $2; RCON NONE NONE; from 4 0; to 0 0
endtoend_test.go:186: illegal combination 00112 (testdata/arm.s:107) SWI $3; RCON NONE NONE; from 4 0; to 0 0
endtoend_test.go:186: illegal combination 00156 (testdata/arm.s:166) WORD $1234; RCON2A NONE NONE; from 4 0; to 0 0
endtoend_test.go:186: illegal combination 03040 (testdata/arm.s:1023) WORD $0; RCON NONE NONE; from 4 0; to 0 0
endtoend_test.go:186: illegal combination 03044 (testdata/arm.s:1024) WORD $4294967295; NCON NONE NONE; from 4 0; to 0 0
endtoend_test.go:186: illegal combination 03048 (testdata/arm.s:1025) WORD $2863311530; LCON NONE NONE; from 4 0; to 0 0
endtoend_test.go:186: illegal combination 03052 (testdata/arm.s:1026) WORD $1431655765; LCON NONE NONE; from 4 0; to 0 0
endtoend_test.go:186: illegal combination 03076 (testdata/arm.s:1032) SWI $0; RCON NONE NONE; from 4 0; to 0 0
endtoend_test.go:186: illegal combination 03080 (testdata/arm.s:1033) SWI $65535; RCON2A NONE NONE; from 4 0; to 0 0
endtoend_test.go:228: 03040 (testdata/arm.s:1023) WORD $0: have encoding 1f000000, want 00000000
endtoend_test.go:228: 03044 (testdata/arm.s:1024) WORD $4294967295: have encoding 1f000000, want ffffffff
endtoend_test.go:228: 03048 (testdata/arm.s:1025) WORD $2863311530: have encoding 1f000000, want aaaaaaaa
endtoend_test.go:228: 03052 (testdata/arm.s:1026) WORD $1431655765: have encoding 1f000000, want 55555555
endtoend_test.go:228: 03080 (testdata/arm.s:1033) SWI $65535: have encoding 000000ef, want ffff00ef
endtoend_test.go:367: GOARM=6
endtoend_test.go:186: illegal combination 00108 (testdata/arm.s:106) SWI $2; RCON NONE NONE; from 4 0; to 0 0
endtoend_test.go:186: illegal combination 00112 (testdata/arm.s:107) SWI $3; RCON NONE NONE; from 4 0; to 0 0
endtoend_test.go:186: illegal combination 00156 (testdata/arm.s:166) WORD $1234; RCON2A NONE NONE; from 4 0; to 0 0
endtoend_test.go:186: illegal combination 03040 (testdata/arm.s:1023) WORD $0; RCON NONE NONE; from 4 0; to 0 0
endtoend_test.go:186: illegal combination 03044 (testdata/arm.s:1024) WORD $4294967295; NCON NONE NONE; from 4 0; to 0 0
endtoend_test.go:186: illegal combination 03048 (testdata/arm.s:1025) WORD $2863311530; LCON NONE NONE; from 4 0; to 0 0
endtoend_test.go:186: illegal combination 03052 (testdata/arm.s:1026) WORD $1431655765; LCON NONE NONE; from 4 0; to 0 0
endtoend_test.go:186: illegal combination 03076 (testdata/arm.s:1032) SWI $0; RCON NONE NONE; from 4 0; to 0 0
endtoend_test.go:186: illegal combination 03080 (testdata/arm.s:1033) SWI $65535; RCON2A NONE NONE; from 4 0; to 0 0
endtoend_test.go:186: illegal combination 00108 (testdata/arm.s:106) SWI $2; RCON NONE NONE; from 4 0; to 0 0
endtoend_test.go:186: illegal combination 00112 (testdata/arm.s:107) SWI $3; RCON NONE NONE; from 4 0; to 0 0
endtoend_test.go:186: illegal combination 00156 (testdata/arm.s:166) WORD $1234; RCON2A NONE NONE; from 4 0; to 0 0
endtoend_test.go:186: illegal combination 03040 (testdata/arm.s:1023) WORD $0; RCON NONE NONE; from 4 0; to 0 0
endtoend_test.go:186: illegal combination 03044 (testdata/arm.s:1024) WORD $4294967295; NCON NONE NONE; from 4 0; to 0 0
endtoend_test.go:186: illegal combination 03048 (testdata/arm.s:1025) WORD $2863311530; LCON NONE NONE; from 4 0; to 0 0
endtoend_test.go:186: illegal combination 03052 (testdata/arm.s:1026) WORD $1431655765; LCON NONE NONE; from 4 0; to 0 0
endtoend_test.go:186: illegal combination 03076 (testdata/arm.s:1032) SWI $0; RCON NONE NONE; from 4 0; to 0 0
endtoend_test.go:186: illegal combination 03080 (testdata/arm.s:1033) SWI $65535; RCON2A NONE NONE; from 4 0; to 0 0
endtoend_test.go:186: illegal combination 00108 (testdata/arm.s:106) SWI $2; RCON NONE NONE; from 4 0; to 0 0
endtoend_test.go:186: illegal combination 00112 (testdata/arm.s:107) SWI $3; RCON NONE NONE; from 4 0; to 0 0
endtoend_test.go:186: illegal combination 00156 (testdata/arm.s:166) WORD $1234; RCON2A NONE NONE; from 4 0; to 0 0
endtoend_test.go:186: illegal combination 03040 (testdata/arm.s:1023) WORD $0; RCON NONE NONE; from 4 0; to 0 0
endtoend_test.go:186: illegal combination 03044 (testdata/arm.s:1024) WORD $4294967295; NCON NONE NONE; from 4 0; to 0 0
endtoend_test.go:186: illegal combination 03048 (testdata/arm.s:1025) WORD $2863311530; LCON NONE NONE; from 4 0; to 0 0
endtoend_test.go:186: illegal combination 03052 (testdata/arm.s:1026) WORD $1431655765; LCON NONE NONE; from 4 0; to 0 0
endtoend_test.go:186: illegal combination 03076 (testdata/arm.s:1032) SWI $0; RCON NONE NONE; from 4 0; to 0 0
endtoend_test.go:186: illegal combination 03080 (testdata/arm.s:1033) SWI $65535; RCON2A NONE NONE; from 4 0; to 0 0
endtoend_test.go:228: 03040 (testdata/arm.s:1023) WORD $0: have encoding 1f000000, want 00000000
endtoend_test.go:228: 03044 (testdata/arm.s:1024) WORD $4294967295: have encoding 1f000000, want ffffffff
endtoend_test.go:228: 03048 (testdata/arm.s:1025) WORD $2863311530: have encoding 1f000000, want aaaaaaaa
endtoend_test.go:228: 03052 (testdata/arm.s:1026) WORD $1431655765: have encoding 1f000000, want 55555555
endtoend_test.go:228: 03080 (testdata/arm.s:1033) SWI $65535: have encoding 000000ef, want ffff00ef
endtoend_test.go:367: GOARM=7
endtoend_test.go:186: illegal combination 00108 (testdata/arm.s:106) SWI $2; RCON NONE NONE; from 4 0; to 0 0
endtoend_test.go:186: illegal combination 00112 (testdata/arm.s:107) SWI $3; RCON NONE NONE; from 4 0; to 0 0
endtoend_test.go:186: illegal combination 00156 (testdata/arm.s:166) WORD $1234; SCON NONE NONE; from 4 0; to 0 0
endtoend_test.go:186: illegal combination 03036 (testdata/arm.s:1023) WORD $0; RCON NONE NONE; from 4 0; to 0 0
endtoend_test.go:186: illegal combination 03040 (testdata/arm.s:1024) WORD $4294967295; NCON NONE NONE; from 4 0; to 0 0
endtoend_test.go:186: illegal combination 03044 (testdata/arm.s:1025) WORD $2863311530; LCON NONE NONE; from 4 0; to 0 0
endtoend_test.go:186: illegal combination 03048 (testdata/arm.s:1026) WORD $1431655765; LCON NONE NONE; from 4 0; to 0 0
endtoend_test.go:186: illegal combination 03072 (testdata/arm.s:1032) SWI $0; RCON NONE NONE; from 4 0; to 0 0
endtoend_test.go:186: illegal combination 03076 (testdata/arm.s:1033) SWI $65535; SCON NONE NONE; from 4 0; to 0 0
endtoend_test.go:186: illegal combination 00108 (testdata/arm.s:106) SWI $2; RCON NONE NONE; from 4 0; to 0 0
endtoend_test.go:186: illegal combination 00112 (testdata/arm.s:107) SWI $3; RCON NONE NONE; from 4 0; to 0 0
endtoend_test.go:186: illegal combination 00156 (testdata/arm.s:166) WORD $1234; SCON NONE NONE; from 4 0; to 0 0
endtoend_test.go:186: illegal combination 03036 (testdata/arm.s:1023) WORD $0; RCON NONE NONE; from 4 0; to 0 0
endtoend_test.go:186: illegal combination 03040 (testdata/arm.s:1024) WORD $4294967295; NCON NONE NONE; from 4 0; to 0 0
endtoend_test.go:186: illegal combination 03044 (testdata/arm.s:1025) WORD $2863311530; LCON NONE NONE; from 4 0; to 0 0
endtoend_test.go:186: illegal combination 03048 (testdata/arm.s:1026) WORD $1431655765; LCON NONE NONE; from 4 0; to 0 0
endtoend_test.go:186: illegal combination 03072 (testdata/arm.s:1032) SWI $0; RCON NONE NONE; from 4 0; to 0 0
endtoend_test.go:186: illegal combination 03076 (testdata/arm.s:1033) SWI $65535; SCON NONE NONE; from 4 0; to 0 0
endtoend_test.go:186: illegal combination 00108 (testdata/arm.s:106) SWI $2; RCON NONE NONE; from 4 0; to 0 0
endtoend_test.go:186: illegal combination 00112 (testdata/arm.s:107) SWI $3; RCON NONE NONE; from 4 0; to 0 0
endtoend_test.go:186: illegal combination 00156 (testdata/arm.s:166) WORD $1234; SCON NONE NONE; from 4 0; to 0 0
endtoend_test.go:186: illegal combination 03036 (testdata/arm.s:1023) WORD $0; RCON NONE NONE; from 4 0; to 0 0
endtoend_test.go:186: illegal combination 03040 (testdata/arm.s:1024) WORD $4294967295; NCON NONE NONE; from 4 0; to 0 0
endtoend_test.go:186: illegal combination 03044 (testdata/arm.s:1025) WORD $2863311530; LCON NONE NONE; from 4 0; to 0 0
endtoend_test.go:186: illegal combination 03048 (testdata/arm.s:1026) WORD $1431655765; LCON NONE NONE; from 4 0; to 0 0
endtoend_test.go:186: illegal combination 03072 (testdata/arm.s:1032) SWI $0; RCON NONE NONE; from 4 0; to 0 0
endtoend_test.go:186: illegal combination 03076 (testdata/arm.s:1033) SWI $65535; SCON NONE NONE; from 4 0; to 0 0
endtoend_test.go:228: 03036 (testdata/arm.s:1023) WORD $0: have encoding 1f000000, want 00000000
endtoend_test.go:228: 03040 (testdata/arm.s:1024) WORD $4294967295: have encoding 1f000000, want ffffffff
endtoend_test.go:228: 03044 (testdata/arm.s:1025) WORD $2863311530: have encoding 1f000000, want aaaaaaaa
endtoend_test.go:228: 03048 (testdata/arm.s:1026) WORD $1431655765: have encoding 1f000000, want 55555555
endtoend_test.go:228: 03076 (testdata/arm.s:1033) SWI $65535: have encoding 000000ef, want ffff00ef
--- FAIL: TestARMErrors (0.01s)
endtoend_test.go:336: testdata/armerror.s:181: wrong error for "invalid .P suffix":
illegal combination 00796 (testdata/armerror.s:181) SWI.P $0; RCON NONE NONE; from 4 0; to 0 0
--- FAIL: TestARM64Encoder (0.02s)
endtoend_test.go:186: illegal combination: 00308 (testdata/arm64enc.s:91) CLREX $4 ABCON0 NONE NONE NONE, 4 0
endtoend_test.go:186: illegal combination: 00312 (testdata/arm64enc.s:92) CLREX ZR ZCON NONE NONE NONE, 7 0
endtoend_test.go:186: illegal combination: 00308 (testdata/arm64enc.s:91) CLREX $4 ABCON0 NONE NONE NONE, 4 0
endtoend_test.go:186: illegal combination: 00312 (testdata/arm64enc.s:92) CLREX ZR ZCON NONE NONE NONE, 7 0
endtoend_test.go:186: illegal combination: 00308 (testdata/arm64enc.s:91) CLREX $4 ABCON0 NONE NONE NONE, 4 0
endtoend_test.go:186: illegal combination: 00312 (testdata/arm64enc.s:92) CLREX ZR ZCON NONE NONE NONE, 7 0
endtoend_test.go:228: 00308 (testdata/arm64enc.s:91) CLREX $4: have encoding 0017a7be, want 5f3403d5
endtoend_test.go:228: 00312 (testdata/arm64enc.s:92) CLREX ZR: have encoding 0017a7be, want 5f3003d5
FAIL
FAIL cmd/asm/internal/asm 1.235s
ok cmd/asm/internal/lex 0.021s
ok cmd/compile 0.101s
ok cmd/compile/internal/gc 23.849s
FAIL cmd/compile/internal/ssa [build failed]
ok cmd/compile/internal/syntax 0.033s
ok cmd/compile/internal/test 0.014s [no tests to run]
ok cmd/compile/internal/types 0.019s
ok cmd/cover 4.795s
ok cmd/doc 0.113s
ok cmd/fix 17.221s
ok cmd/go 364.891s
ok cmd/go/internal/cache 3.376s
ok cmd/go/internal/dirhash 0.023s
ok cmd/go/internal/generate 0.055s
ok cmd/go/internal/get 0.067s
ok cmd/go/internal/imports 0.028s
ok cmd/go/internal/load 0.026s
ok cmd/go/internal/lockedfile 0.030s
ok cmd/go/internal/lockedfile/internal/filelock 0.050s
ok cmd/go/internal/modconv 0.075s
ok cmd/go/internal/modfetch 0.544s
ok cmd/go/internal/modfetch/codehost 0.020s
ok cmd/go/internal/modfile 0.025s
ok cmd/go/internal/modload 0.064s
ok cmd/go/internal/module 0.015s
ok cmd/go/internal/mvs 0.026s
ok cmd/go/internal/par 0.043s
ok cmd/go/internal/search 0.018s
ok cmd/go/internal/semver 0.015s
ok cmd/go/internal/txtar 0.014s
ok cmd/go/internal/web2 0.045s
ok cmd/go/internal/work 0.042s
ok cmd/gofmt 0.122s
ok cmd/internal/buildid 0.573s
ok cmd/internal/dwarf 0.014s
ok cmd/internal/edit 0.015s
ok cmd/internal/goobj 1.997s
ok cmd/internal/obj 0.015s
ok cmd/internal/obj/arm64 0.098s
ok cmd/internal/obj/x86 0.952s
ok cmd/internal/objabi 0.016s
ok cmd/internal/src 0.014s
ok cmd/internal/test2json 0.211s
ok cmd/link 17.887s
ok cmd/link/internal/ld 3.931s
ok cmd/link/internal/sym 0.017s
ok cmd/nm 5.231s
ok cmd/objdump 5.546s
ok cmd/pack 4.646s
ok cmd/trace 0.075s
ok cmd/vendor/github.com/google/pprof/internal/binutils 0.083s
ok cmd/vendor/github.com/google/pprof/internal/driver 1.001s
ok cmd/vendor/github.com/google/pprof/internal/elfexec 0.015s
ok cmd/vendor/github.com/google/pprof/internal/graph 0.022s
ok cmd/vendor/github.com/google/pprof/internal/measurement 0.016s
ok cmd/vendor/github.com/google/pprof/internal/report 0.051s
ok cmd/vendor/github.com/google/pprof/internal/symbolizer 0.043s
ok cmd/vendor/github.com/google/pprof/internal/symbolz 0.041s
ok cmd/vendor/github.com/google/pprof/profile 0.165s
ok cmd/vendor/github.com/ianlancetaylor/demangle 0.051s
ok cmd/vendor/golang.org/x/arch/arm/armasm 0.039s
ok cmd/vendor/golang.org/x/arch/arm64/arm64asm 0.334s
ok cmd/vendor/golang.org/x/arch/ppc64/ppc64asm 0.027s
ok cmd/vendor/golang.org/x/arch/x86/x86asm 0.179s
ok cmd/vendor/golang.org/x/crypto/ssh/terminal 0.020s
ok cmd/vendor/golang.org/x/sys/unix 3.573s
ok cmd/vet 20.944s
2019/01/03 18:47:00 Failed: exit status 2
Sign up for free to join this conversation on GitHub. Already have an account? Sign in to comment
You can’t perform that action at this time.