Skip to content

Instantly share code, notes, and snippets.

Embed
What would you like to do?
/var/folders/4y/t1_w3pf12k31z9tmf4hh79tr0000gn/T/ruby-build.20210207195441.82284.NDwPbY ~/.dotfiles
/var/folders/4y/t1_w3pf12k31z9tmf4hh79tr0000gn/T/ruby-build.20210207195441.82284.NDwPbY/ruby-3.0.0 /var/folders/4y/t1_w3pf12k31z9tmf4hh79tr0000gn/T/ruby-build.20210207195441.82284.NDwPbY ~/.dotfiles
checking for ruby... /Users/cbjohnson/.asdf/shims/ruby
tool/config.guess already exists
tool/config.sub already exists
checking build system type... x86_64-apple-darwin20.3.0
checking host system type... x86_64-apple-darwin20.3.0
checking target system type... x86_64-apple-darwin20.3.0
checking for llvm-ar... no
checking for clang++... clang++
checking for llvm-nm... no
checking for llvm-objcopy... no
checking for llvm-objdump... no
checking for llvm-ranlib... no
checking for llvm-strip... no
checking for gcc... clang
checking whether the C compiler works... yes
checking for C compiler default output file name... a.out
checking for suffix of executables...
checking whether we are cross compiling... no
checking for suffix of object files... o
checking whether we are using the GNU C compiler... yes
checking whether clang accepts -g... yes
checking for clang option to accept ISO C89... none needed
checking for clang option to accept ISO C99... none needed
checking whether we are using the GNU C++ compiler... yes
checking whether clang++ accepts -g... yes
checking how to run the C preprocessor... clang -E
checking for ranlib... ranlib
checking for gar... gar
checking for gas... no
checking for as... as
checking for gnm... gnm
checking for gobjcopy... gobjcopy
checking for gobjdump... gobjdump
checking for gstrip... gstrip
checking if minimum required OS X version is supported... yes
checking whether the linker is GNU ld... no
checking whether clang -E accepts -o... yes
checking for clang... /usr/bin/clang
checking for real target cpu... x86_64
checking for gar flags... rcD
checking whether ln -s works... yes
checking whether make sets $(MAKE)... yes
checking for a BSD-compatible install... /usr/local/bin/ginstall -c
checking for a thread-safe mkdir -p... /usr/local/bin/gmkdir -p
checking for dtrace... dtrace
checking for dot... no
checking for doxygen... no
checking for pkg-config... pkg-config
checking for grep that handles long lines and -e... /usr/local/bin/ggrep
checking for egrep... /usr/local/bin/ggrep -E
checking for ANSI C header files... yes
checking for sys/types.h... yes
checking for sys/stat.h... yes
checking for stdlib.h... yes
checking for string.h... yes
checking for memory.h... yes
checking for strings.h... yes
checking for inttypes.h... yes
checking for stdint.h... yes
checking for unistd.h... yes
checking minix/config.h usability... no
checking minix/config.h presence... no
checking for minix/config.h... no
checking whether it is safe to define __EXTENSIONS__... yes
checking whether it is Android... no
checking for cd using physical directory... cd -P
checking whether CFLAGS is valid... yes
checking whether LDFLAGS is valid... yes
checking whether -Wl,-R. is accepted as LDFLAGS... no
checking whether -Wl,-rpath,. is accepted as LDFLAGS... yes
checking whether -fdeclspec is accepted as CFLAGS... yes
checking whether -fdeclspec is accepted as CXXFLAGS... yes
checking whether -Wdeprecated-declarations is accepted as CFLAGS... yes
checking whether -Wdivision-by-zero is accepted as CFLAGS... yes
checking whether -Wduplicated-cond is accepted as CFLAGS... no
checking whether -Wimplicit-function-declaration is accepted as CFLAGS... yes
checking whether -Wimplicit-int is accepted as CFLAGS... yes
checking whether -Wmisleading-indentation is accepted as CFLAGS... yes
checking whether -Wpointer-arith is accepted as CFLAGS... yes
checking whether -Wshorten-64-to-32 is accepted as CFLAGS... yes
checking whether -Wwrite-strings is accepted as CFLAGS... yes
checking whether -Wimplicit-fallthrough=0 is accepted as CFLAGS... no
checking whether -Wmissing-noreturn is accepted as CFLAGS... yes
checking whether -Wno-cast-function-type is accepted as CFLAGS... no
checking whether -Wno-constant-logical-operand is accepted as CFLAGS... yes
checking whether -Wno-long-long is accepted as CFLAGS... yes
checking whether -Wno-missing-field-initializers is accepted as CFLAGS... yes
checking whether -Wno-overlength-strings is accepted as CFLAGS... yes
checking whether -Wno-packed-bitfield-compat is accepted as CFLAGS... no
checking whether -Wno-parentheses-equality is accepted as CFLAGS... yes
checking whether -Wno-self-assign is accepted as CFLAGS... yes
checking whether -Wno-tautological-compare is accepted as CFLAGS... yes
checking whether -Wno-unused-parameter is accepted as CFLAGS... yes
checking whether -Wno-unused-value is accepted as CFLAGS... yes
checking whether -Wsuggest-attribute=format is accepted as CFLAGS... no
checking whether -Wsuggest-attribute=noreturn is accepted as CFLAGS... no
checking whether -Wunused-variable is accepted as CFLAGS... yes
checking whether -diag-disable=175,188,1684,2259,2312 is accepted as CFLAGS... no
checking whether -Wextra-tokens is accepted as CFLAGS... yes
checking whether -Wall -Wextra is accepted as CFLAGS... yes
checking whether -Qunused-arguments is accepted as CFLAGS... yes
checking whether -O3 -D_FORTIFY_SOURCE=2 is accepted as CFLAGS... yes
checking whether -fstack-protector-strong is accepted as CFLAGS... yes
checking whether -fstack-protector-strong is accepted as LDFLAGS... yes
checking whether -Wl,--compress-debug-sections=zlib is accepted as LDFLAGS... no
checking whether -std=gnu99 is accepted as CFLAGS... yes
checking whether -fno-strict-overflow is accepted as CFLAGS... yes
checking whether -ggdb3 is accepted as CFLAGS... yes
checking whether -fvisibility=hidden is accepted as CFLAGS... yes
checking whether -fno-fast-math is accepted as CFLAGS... yes
checking whether -fexcess-precision=standard is accepted as CFLAGS... no
checking whether -fp-model precise is accepted as CFLAGS... no
checking whether compiler has statement and declarations in expressions... yes
checking whether syscall(2) is deprecated... yes
checking for broken crypt with 8bit chars... yes
checking for codesign... codesign
checking for dsymutil... dsymutil
checking for crt_externs.h... yes
checking whether CXXFLAGS is valid... yes
checking for crypt in -lcrypt... (cached) no
checking for dlopen in -ldl... yes
checking for shl_load in -ldld... no
checking for shutdown in -lsocket... no
checking for dirent.h that defines DIR... yes
checking for library containing opendir... none required
checking for stdbool.h that conforms to C99... yes
checking for _Bool... yes
checking for sys/wait.h that is POSIX.1 compatible... yes
checking a.out.h usability... no
checking a.out.h presence... no
checking for a.out.h... no
checking atomic.h usability... no
checking atomic.h presence... no
checking for atomic.h... no
checking copyfile.h usability... yes
checking copyfile.h presence... yes
checking for copyfile.h... yes
checking direct.h usability... no
checking direct.h presence... no
checking for direct.h... no
checking grp.h usability... yes
checking grp.h presence... yes
checking for grp.h... yes
checking fcntl.h usability... yes
checking fcntl.h presence... yes
checking for fcntl.h... yes
checking float.h usability... yes
checking float.h presence... yes
checking for float.h... yes
checking ieeefp.h usability... no
checking ieeefp.h presence... no
checking for ieeefp.h... no
checking intrinsics.h usability... no
checking intrinsics.h presence... no
checking for intrinsics.h... no
checking langinfo.h usability... yes
checking langinfo.h presence... yes
checking for langinfo.h... yes
checking limits.h usability... yes
checking limits.h presence... yes
checking for limits.h... yes
checking locale.h usability... yes
checking locale.h presence... yes
checking for locale.h... yes
checking malloc.h usability... no
checking malloc.h presence... no
checking for malloc.h... no
checking malloc/malloc.h usability... yes
checking malloc/malloc.h presence... yes
checking for malloc/malloc.h... yes
checking malloc_np.h usability... no
checking malloc_np.h presence... no
checking for malloc_np.h... no
checking net/socket.h usability... no
checking net/socket.h presence... no
checking for net/socket.h... no
checking process.h usability... no
checking process.h presence... no
checking for process.h... no
checking pwd.h usability... yes
checking pwd.h presence... yes
checking for pwd.h... yes
checking sanitizer/asan_interface.h usability... yes
checking sanitizer/asan_interface.h presence... yes
checking for sanitizer/asan_interface.h... yes
checking sanitizer/msan_interface.h usability... yes
checking sanitizer/msan_interface.h presence... yes
checking for sanitizer/msan_interface.h... yes
checking setjmpex.h usability... no
checking setjmpex.h presence... no
checking for setjmpex.h... no
checking stdalign.h usability... yes
checking stdalign.h presence... yes
checking for stdalign.h... yes
checking sys/attr.h usability... yes
checking sys/attr.h presence... yes
checking for sys/attr.h... yes
checking sys/eventfd.h usability... no
checking sys/eventfd.h presence... no
checking for sys/eventfd.h... no
checking sys/fcntl.h usability... yes
checking sys/fcntl.h presence... yes
checking for sys/fcntl.h... yes
checking sys/file.h usability... yes
checking sys/file.h presence... yes
checking for sys/file.h... yes
checking sys/id.h usability... no
checking sys/id.h presence... no
checking for sys/id.h... no
checking sys/ioctl.h usability... yes
checking sys/ioctl.h presence... yes
checking for sys/ioctl.h... yes
checking sys/mkdev.h usability... no
checking sys/mkdev.h presence... no
checking for sys/mkdev.h... no
checking sys/param.h usability... yes
checking sys/param.h presence... yes
checking for sys/param.h... yes
checking sys/prctl.h usability... no
checking sys/prctl.h presence... no
checking for sys/prctl.h... no
checking sys/resource.h usability... yes
checking sys/resource.h presence... yes
checking for sys/resource.h... yes
checking sys/select.h usability... yes
checking sys/select.h presence... yes
checking for sys/select.h... yes
checking sys/sendfile.h usability... no
checking sys/sendfile.h presence... no
checking for sys/sendfile.h... no
checking sys/socket.h usability... yes
checking sys/socket.h presence... yes
checking for sys/socket.h... yes
checking for sys/syscall.h... (cached) no
checking sys/sysmacros.h usability... no
checking sys/sysmacros.h presence... no
checking for sys/sysmacros.h... no
checking sys/time.h usability... yes
checking sys/time.h presence... yes
checking for sys/time.h... yes
checking sys/times.h usability... yes
checking sys/times.h presence... yes
checking for sys/times.h... yes
checking sys/uio.h usability... yes
checking sys/uio.h presence... yes
checking for sys/uio.h... yes
checking sys/utime.h usability... no
checking sys/utime.h presence... no
checking for sys/utime.h... no
checking for syscall.h... (cached) no
checking time.h usability... yes
checking time.h presence... yes
checking for time.h... yes
checking ucontext.h usability... yes
checking ucontext.h presence... yes
checking for ucontext.h... yes
checking utime.h usability... yes
checking utime.h presence... yes
checking for utime.h... yes
checking x86intrin.h usability... yes
checking x86intrin.h presence... yes
checking for x86intrin.h... yes
checking gmp.h usability... yes
checking gmp.h presence... yes
checking for gmp.h... yes
checking for library containing __gmpz_init... -lgmp
checking for special C compiler options needed for large files... no
checking for _FILE_OFFSET_BITS value needed for large files... no
checking whether byte ordering is bigendian... no
checking for an ANSI C-conforming const... yes
checking whether char is unsigned... no
checking for inline... inline
checking for working volatile... yes
checking for typeof syntax and keyword spelling... typeof
checking for C/C++ restrict keyword... __restrict
checking for long long... yes
checking for off_t... yes
checking char bit... 8
checking size of int... 4
checking size of short... 2
checking size of long... 8
checking size of long long... 8
checking size of __int64... 0
checking size of __int128... 16
checking size of off_t... 8
checking size of void*... 8
checking size of float... 4
checking size of double... 8
checking size of time_t... 8
checking size of clock_t... 8
checking packed struct attribute... x __attribute__((packed))
checking whether -Wno-address-of-packed-member is accepted as CFLAGS... yes
checking for printf prefix for long long... ll
checking for pid_t... yes
checking for convertible type of pid_t... INT
checking for uid_t... yes
checking for convertible type of uid_t... UINT
checking for gid_t... yes
checking for convertible type of gid_t... UINT
checking for time_t... yes
checking for convertible type of time_t... LONG
checking for dev_t... yes
checking for convertible type of dev_t... INT
checking for mode_t... yes
checking for convertible type of mode_t... USHORT
checking for rlim_t... yes
checking for convertible type of rlim_t... ULL
checking for off_t... (cached) yes
checking for convertible type of off_t... LL
checking for clockid_t... yes
checking for convertible type of clockid_t... UINT
checking for variable length macro... yes
checking if _Alignof() works... yes
checking for CONSTFUNC function attribute... __attribute__ ((__const__)) x
checking for PUREFUNC function attribute... __attribute__ ((__pure__)) x
checking for NORETURN function attribute... __attribute__ ((__noreturn__)) x
checking for DEPRECATED function attribute... __attribute__ ((__deprecated__)) x
checking for DEPRECATED_BY function attribute... __attribute__ ((__deprecated__("by "#n))) x
checking for NOINLINE function attribute... __attribute__ ((__noinline__)) x
checking for ALWAYS_INLINE function attribute... __attribute__ ((__always_inline__)) x
checking for NO_SANITIZE function attribute... __attribute__ ((__no_sanitize__(san))) x
checking for NO_SANITIZE_ADDRESS function attribute... __attribute__ ((__no_sanitize_address__)) x
checking for NO_ADDRESS_SAFETY_ANALYSIS function attribute... __attribute__ ((__no_address_safety_analysis__)) x
checking for WARN_UNUSED_RESULT function attribute... __attribute__ ((__warn_unused_result__)) x
checking for MAYBE_UNUSED function attribute... __attribute__ ((__unused__)) x
checking for ERRORFUNC function attribute... x
checking for WARNINGFUNC function attribute... x
checking for WEAK function attribute... __attribute__ ((__weak__)) x
checking for __attribute__((__depreacted__(msg))) in C++... yes
checking for std::nullptr_t... yes
checking for FUNC_STDCALL function attribute... x
checking for FUNC_CDECL function attribute... __attribute__ ((__cdecl__)) x
checking for FUNC_FASTCALL function attribute... x
checking for FUNC_UNOPTIMIZED function attribute... x
checking for FUNC_MINIMIZED function attribute... x
checking for function alias... no
checking for __atomic builtins... yes
checking for __sync builtins... yes
checking for __builtin_unreachable... yes
checking for exported function attribute... __attribute__ ((__visibility__("default")))
checking for RUBY_FUNC_NONNULL function attribute... __attribute__ ((__nonnull__(n))) x
checking for function name string predefined identifier... __func__
checking if enum over int is allowed... yes
checking whether sys_nerr is declared... yes
checking whether getenv is declared... yes
checking for size_t... yes
checking size of size_t... 8
checking size of ptrdiff_t... 8
checking for printf prefix for size_t... z
checking for printf prefix for ptrdiff_t... t
checking for struct stat.st_blksize... yes
checking for struct stat.st_blocks... yes
checking for struct stat.st_rdev... yes
checking size of struct stat.st_size... SIZEOF_OFF_T
checking size of struct stat.st_blocks... SIZEOF_OFF_T
checking size of struct stat.st_ino... SIZEOF_LONG
checking for struct stat.st_atim... no
checking for struct stat.st_atimespec... yes
checking for struct stat.st_atimensec... no
checking for struct stat.st_mtim... no
checking for struct stat.st_mtimespec... yes
checking for struct stat.st_mtimensec... no
checking for struct stat.st_ctim... no
checking for struct stat.st_ctimespec... yes
checking for struct stat.st_ctimensec... no
checking for struct stat.st_birthtimespec... yes
checking for struct timeval... yes
checking size of struct timeval.tv_sec... SIZEOF_TIME_T
checking for struct timespec... yes
checking for struct timezone... yes
checking for fd_mask... yes
checking for int8_t... yes
checking size of int8_t... 1
checking for uint8_t... yes
checking size of uint8_t... 1
checking for int16_t... yes
checking size of int16_t... 2
checking for uint16_t... yes
checking size of uint16_t... 2
checking for int32_t... yes
checking size of int32_t... 4
checking for uint32_t... yes
checking size of uint32_t... 4
checking for int64_t... yes
checking size of int64_t... 8
checking for uint64_t... yes
checking size of uint64_t... 8
checking for int128_t... __int128
checking for uint128_t... unsigned __int128
checking for intptr_t... yes
checking size of intptr_t... 8
checking for uintptr_t... yes
checking size of uintptr_t... 8
checking for printf prefix for intptr_t... l
checking for ssize_t... yes
checking size of ssize_t... 8
checking for printf prefix for int64_t... ll
checking for stack end address... no
checking for uid_t in sys/types.h... (cached) yes
checking type of array argument to getgroups... (cached) gid_t
checking for working alloca.h... yes
checking for alloca... yes
checking for dynamic size alloca... ok
checking for working memcmp... yes
checking for acosh... yes
checking for cbrt... yes
checking for crypt... yes
checking for dup2... yes
checking for erf... yes
checking for explicit_bzero... no
checking for ffs... yes
checking for flock... yes
checking for hypot... yes
checking for lgamma_r... yes
checking for memmove... yes
checking for nan... yes
checking for nextafter... yes
checking for setproctitle... no
checking for strchr... yes
checking for strerror... yes
checking for strlcat... yes
checking for strlcpy... yes
checking for strstr... yes
checking for tgamma... yes
checking whether finite is declared... yes
checking whether isinf is declared... yes
checking whether isnan is declared... yes
checking sys/pstat.h usability... no
checking sys/pstat.h presence... no
checking for sys/pstat.h... no
checking for signbit... yes
checking for pid_t... (cached) yes
checking vfork.h usability... no
checking vfork.h presence... no
checking for vfork.h... no
checking for fork... yes
checking for vfork... (cached) no
checking for working fork... yes
checking for __syscall... (cached) no
checking for _longjmp... yes
checking for arc4random_buf... yes
checking for atan2l... yes
checking for atan2f... yes
checking for chroot... yes
checking for chsize... no
checking for clock_gettime... yes
checking for copy_file_range... no
checking for cosh... yes
checking for crypt_r... no
checking for daemon... (cached) no
checking for dirfd... yes
checking for dl_iterate_phdr... no
checking for dlopen... yes
checking for dladdr... yes
checking for dup... yes
checking for dup3... no
checking for eaccess... no
checking for endgrent... yes
checking for eventfd... no
checking for explicit_memset... no
checking for fcopyfile... yes
checking for fchmod... yes
checking for fchown... yes
checking for fcntl... yes
checking for fdatasync... (cached) no
checking for fdopendir... yes
checking for fgetattrlist... yes
checking for fmod... yes
checking for fstatat... yes
checking for fsync... yes
checking for ftruncate... yes
checking for ftruncate64... no
checking for getattrlist... yes
checking for getcwd... yes
checking for getgidx... no
checking for getgrnam... yes
checking for getgrnam_r... yes
checking for getgroups... yes
checking for getlogin... yes
checking for getlogin_r... yes
checking for getpgid... yes
checking for getpgrp... yes
checking for getpriority... yes
checking for getpwnam... yes
checking for getpwnam_r... yes
checking for getpwuid... yes
checking for getpwuid_r... yes
checking for getrandom... no
checking for getresgid... no
checking for getresuid... no
checking for getrlimit... yes
checking for getsid... yes
checking for gettimeofday... yes
checking for getuidx... no
checking for gmtime_r... yes
checking for grantpt... yes
checking for initgroups... yes
checking for ioctl... yes
checking for isfinite... no
checking for issetugid... yes
checking for killpg... yes
checking for lchmod... yes
checking for lchown... yes
checking for link... yes
checking for llabs... yes
checking for lockf... yes
checking for log2... yes
checking for lstat... yes
checking for lutimes... yes
checking for malloc_usable_size... no
checking for malloc_size... yes
checking for mblen... yes
checking for memalign... no
checking for memset_s... yes
checking for writev... yes
checking for memrchr... no
checking for memmem... yes
checking for mkfifo... yes
checking for mknod... yes
checking for mktime... yes
checking for openat... yes
checking for pipe2... no
checking for poll... yes
checking for posix_fadvise... no
checking for posix_memalign... yes
checking for ppoll... no
checking for pread... yes
checking for pwrite... yes
checking for qsort_r... yes
checking for qsort_s... no
checking for readlink... yes
checking for realpath... yes
checking for round... yes
checking for sched_getaffinity... no
checking for seekdir... yes
checking for select_large_fdset... no
checking for sendfile... yes
checking for setegid... yes
checking for setenv... yes
checking for seteuid... yes
checking for setgid... yes
checking for setgroups... yes
checking for setpgid... yes
checking for setpgrp... yes
checking for setregid... yes
checking for setresgid... no
checking for setresuid... no
checking for setreuid... yes
checking for setrgid... yes
checking for setrlimit... yes
checking for setruid... yes
checking for setsid... yes
checking for setuid... yes
checking for shutdown... yes
checking for sigaction... yes
checking for sigaltstack... yes
checking for sigprocmask... yes
checking for sinh... yes
checking for spawnv... no
checking for symlink... yes
checking for syscall... (cached) no
checking for sysconf... yes
checking for tanh... yes
checking for telldir... yes
checking for timegm... yes
checking for times... yes
checking for truncate... yes
checking for truncate64... no
checking for unsetenv... yes
checking for utimensat... yes
checking for utimes... yes
checking for wait4... yes
checking for waitpid... yes
checking for __cospi... yes
checking for __sinpi... yes
checking if getcwd allocates buffer if NULL is given... yes
checking for __builtin_alloca_with_align... yes
checking for __builtin_assume_aligned... yes
checking for __builtin_bswap16... yes
checking for __builtin_bswap32... yes
checking for __builtin_bswap64... yes
checking for __builtin_popcount... yes
checking for __builtin_popcountll... yes
checking for __builtin_clz... yes
checking for __builtin_clzl... yes
checking for __builtin_clzll... yes
checking for __builtin_ctz... yes
checking for __builtin_ctzll... yes
checking for __builtin_add_overflow... yes
checking for __builtin_sub_overflow... yes
checking for __builtin_mul_overflow... yes
checking for __builtin_mul_overflow_p... no
checking for __builtin_constant_p... yes
checking for __builtin_choose_expr... yes
checking for __builtin_choose_expr_constant_p... yes
checking for __builtin_types_compatible_p... yes
checking for __builtin_trap... yes
checking whether qsort_r is GNU version... no
checking whether qsort_r is BSD version... yes
checking whether atan2 handles Inf as C99... yes
checking for clock_getres... yes
checking for timer_create in -lrt... no
checking for timer_settime in -lrt... no
checking for unsetenv returns a value... yes
checking whether struct tm is in sys/time.h or time.h... time.h
checking for struct tm.tm_zone... yes
checking for struct tm.tm_gmtoff... yes
checking for external int daylight... yes
checking for negative time_t for gmtime(3)... yes
checking for localtime(3) overflow correctly... yes
checking for sig_t... yes
checking whether right shift preserve sign bit... yes
checking for copy_file_range... no
checking whether _SC_CLK_TCK is supported... yes
checking stack growing direction on x86_64... -1
checking native coroutine implementation for x86_64-darwin20... amd64
checking for pthread_create in -lthr... no
checking for pthread_create in -lpthread... yes
checking for pthread_np.h... no
checking whether pthread_t is scalar type... yes
checking for sched_yield... yes
checking for pthread_attr_setinheritsched... yes
checking for pthread_attr_get_np... no
checking for pthread_attr_getstack... yes
checking for pthread_attr_getguardsize... yes
checking for pthread_get_stackaddr_np... yes
checking for pthread_get_stacksize_np... yes
checking for thr_stksegment... no
checking for pthread_stackseg_np... no
checking for pthread_getthrds_np... no
checking for pthread_condattr_setclock... no
checking for pthread_sigmask... yes
checking for pthread_setname_np... yes
checking for pthread_set_name_np... no
checking for pthread_getattr_np... no
checking arguments of pthread_setname_np... (name)
checking if mcontext_t is a pointer... yes
checking for getcontext... (cached) no
checking for setcontext... (cached) no
checking if fork works with pthread... yes
checking whether ELF binaries are produced... no
checking mach-o/loader.h usability... yes
checking mach-o/loader.h presence... yes
checking for mach-o/loader.h... yes
checking whether OS depend dynamic link works... yes
checking whether -Wl,-undefined,dynamic_lookup is accepted as LDFLAGS... yes
checking whether -Wl,-multiply_defined,suppress is accepted as LDFLAGS... yes
checking libproc.h usability... yes
checking libproc.h presence... yes
checking for libproc.h... yes
checking execinfo.h usability... yes
checking execinfo.h presence... yes
checking for execinfo.h... yes
checking for backtrace in -lexecinfo... no
checking libunwind.h usability... yes
checking libunwind.h presence... yes
checking for libunwind.h... yes
checking for backtrace... yes
checking for broken backtrace... yes
checking valgrind/memcheck.h usability... no
checking valgrind/memcheck.h presence... no
checking for valgrind/memcheck.h... no
checking for gstrip flags... -S -x
checking whether -Wl,--no-undefined is accepted as LDFLAGS... no
checking whether wrapper for DYLD_FALLBACK_LIBRARY_PATH is needed... yes
checking whether dtrace USDT is available... yes(-xnolibs)
checking whether dtrace needs post processing... no
checking for __builtin_setjmp... (cached) no
checking for _setjmpex as a macro or function... no
checking for _setjmp as a macro or function... yes
checking for sigsetjmp as a macro or function... yes
checking for setjmp type... sigsetjmp,0
checking for prefix of external symbols... _
checking pthread.h usability... yes
checking pthread.h presence... yes
checking for pthread.h... yes
checking if make is GNU make... yes
.ext/include/x86_64-darwin20/ruby/config.h updated
configure: ruby library version = 3.0.0
configure: creating ./config.status
config.status: creating GNUmakefile
config.status: creating Makefile
config.status: creating ruby-3.0.pc
---
Configuration summary for ruby version 3.0.0
* Installation prefix: /Users/cbjohnson/.asdf/installs/ruby/3.0.0
* exec prefix: ${prefix}
* arch: x86_64-darwin20
* site arch: ${arch}
* RUBY_BASE_NAME: ruby
* enable shared: yes
* ruby lib prefix: ${libdir}/${RUBY_BASE_NAME}
* site libraries path: ${rubylibprefix}/${sitearch}
* vendor path: ${rubylibprefix}/vendor_ruby
* target OS: darwin20
* compiler: clang -fdeclspec
* with pthread: yes
* with coroutine: amd64
* enable shared libs: yes
* dynamic library ext: bundle
* CFLAGS: ${optflags} ${debugflags} ${warnflags}
* LDFLAGS: -L. \
-L/Users/cbjohnson/.asdf/installs/ruby/3.0.0/lib \
-fstack-protector-strong -L/usr/local/lib
* DLDFLAGS: -L/Users/cbjohnson/.asdf/installs/ruby/3.0.0/lib \
-Wl,-undefined,dynamic_lookup \
-Wl,-multiply_defined,suppress
* optflags: -O3
* debugflags: -ggdb3
* warnflags: -Wall -Wextra -Wdeprecated-declarations \
-Wdivision-by-zero \
-Wimplicit-function-declaration -Wimplicit-int \
-Wmisleading-indentation -Wpointer-arith \
-Wshorten-64-to-32 -Wwrite-strings \
-Wmissing-noreturn -Wno-constant-logical-operand \
-Wno-long-long -Wno-missing-field-initializers \
-Wno-overlength-strings -Wno-parentheses-equality \
-Wno-self-assign -Wno-tautological-compare \
-Wno-unused-parameter -Wno-unused-value \
-Wunused-variable -Wextra-tokens
* strip command: gstrip -S -x
* install doc: rdoc
* JIT support: yes
* man page type: doc
* BASERUBY -v: ruby 2.6.3p62 (2019-04-16 revision 67580) \
[universal.x86_64-darwin20]
---
BASERUBY = /Users/cbjohnson/.asdf/shims/ruby --disable=gems
CC = clang -fdeclspec
LD = clang
LDSHARED = clang -fdeclspec -dynamiclib
CFLAGS = -O3 -ggdb3 -Wall -Wextra -Wdeprecated-declarations -Wdivision-by-zero -Wimplicit-function-declaration -Wimplicit-int -Wmisleading-indentation -Wpointer-arith -Wshorten-64-to-32 -Wwrite-strings -Wmissing-noreturn -Wno-constant-logical-operand -Wno-long-long -Wno-missing-field-initializers -Wno-overlength-strings -Wno-parentheses-equality -Wno-self-assign -Wno-tautological-compare -Wno-unused-parameter -Wno-unused-value -Wunused-variable -Wextra-tokens -std=gnu99 -fno-common -pipe
XCFLAGS = -D_FORTIFY_SOURCE=2 -fstack-protector-strong -fno-strict-overflow -fvisibility=hidden -DRUBY_EXPORT -I. -I.ext/include/x86_64-darwin20 -I./include -I. -I./enc/unicode/12.1.0
CPPFLAGS = -I/Users/cbjohnson/.asdf/installs/ruby/3.0.0/include -D_XOPEN_SOURCE -D_DARWIN_C_SOURCE -D_DARWIN_UNLIMITED_SELECT -D_REENTRANT
DLDFLAGS = -L/Users/cbjohnson/.asdf/installs/ruby/3.0.0/lib -Wl,-undefined,dynamic_lookup -Wl,-multiply_defined,suppress -install_name /Users/cbjohnson/.asdf/installs/ruby/3.0.0/lib/libruby.3.0.dylib -compatibility_version 3.0 -current_version 3.0.0 -fstack-protector-strong -framework Security -framework Foundation -fstack-protector-strong -framework Security -framework Foundation
SOLIBS = -lpthread -lgmp -ldl -lobjc
LANG = en_US.UTF-8
LC_ALL =
LC_CTYPE =
MFLAGS = - --jobserver-fds=6,7 -j
Apple clang version 12.0.0 (clang-1200.0.32.29)
Target: x86_64-apple-darwin20.3.0
Thread model: posix
InstalledDir: /Applications/Xcode.app/Contents/Developer/Toolchains/XcodeDefault.xctoolchain/usr/bin
compiling ./main.c
compiling dmydln.c
compiling miniinit.c
compiling dmyext.c
translating probes probes.d
compiling ast.c
compiling bignum.c
compiling class.c
compiling compar.c
. ./vm_opts.h
compiling compile.c
compiling complex.c
compiling cont.c
compiling debug.c
compiling debug_counter.c
compiling dir.c
compiling dln_find.c
compiling encoding.c
compiling enum.c
compiling enumerator.c
compiling error.c
compiling eval.c
compiling file.c
compiling gc.c
compiling hash.c
compiling inits.c
compiling io.c
compiling iseq.c
compiling load.c
compiling marshal.c
compiling math.c
compiling memory_view.c
making mjit_config.h
compiling mjit_compile.c
compiling node.c
compiling numeric.c
compiling object.c
compiling pack.c
compiling parse.c
compiling proc.c
compiling process.c
compiling ractor.c
compiling random.c
compiling range.c
compiling rational.c
compiling re.c
compiling regcomp.c
compiling regenc.c
compiling regerror.c
compiling regexec.c
compiling regparse.c
compiling regsyntax.c
compiling ruby.c
compiling scheduler.c
compiling signal.c
compiling sprintf.c
compiling st.c
compiling strftime.c
compiling string.c
compiling struct.c
compiling symbol.c
compiling thread.c
compiling time.c
compiling transcode.c
compiling transient_heap.c
compiling util.c
compiling variable.c
compiling vm.c
compiling vm_backtrace.c
compiling vm_dump.c
compiling vm_sync.c
compiling vm_trace.c
compiling ./missing/explicit_bzero.c
compiling ./missing/setproctitle.c
compiling addr2line.c
compiling dmyenc.c
compiling dln.c
config.status: creating ruby-runner.h
compiling localeinit.c
compiling array.c
compiling mjit.c
assembling coroutine/amd64/Context.S
compiling enc/ascii.c
compiling enc/us_ascii.c
compiling enc/unicode.c
compiling enc/utf_8.c
compiling enc/trans/newline.c
./revision.h unchanged
compiling version.c
linking miniruby
generating x86_64-darwin20-fake.rb
generating encdb.h
x86_64-darwin20-fake.rb updated
builtin_binary.inc updated
compiling builtin.c
encdb.h updated
./tool/ifchange "--timestamp=.rbconfig.time" rbconfig.rb rbconfig.tmp
rbconfig.rb updated
generating enc.mk
creating verconf.h
building rb_mjit_header.h
./miniruby -I./lib -I. -I.ext/common ./tool/mjit_tabs.rb "" \
clang -E -DMJIT_HEADER -P -dD -O3 -ggdb3 -Wall -Wextra -Wdeprecated-declarations -Wdivision-by-zero -Wimplicit-function-declaration -Wimplicit-int -Wmisleading-indentation -Wpointer-arith -Wshorten-64-to-32 -Wwrite-strings -Wmissing-noreturn -Wno-constant-logical-operand -Wno-long-long -Wno-missing-field-initializers -Wno-overlength-strings -Wno-parentheses-equality -Wno-self-assign -Wno-tautological-compare -Wno-unused-parameter -Wno-unused-value -Wunused-variable -Wextra-tokens -std=gnu99 -fno-common -pipe -D_FORTIFY_SOURCE=2 -fstack-protector-strong -fno-strict-overflow -fvisibility=hidden -DRUBY_EXPORT -I. -I.ext/include/x86_64-darwin20 -I./include -I. -I./enc/unicode/12.1.0 -I/Users/cbjohnson/.asdf/installs/ruby/3.0.0/include -D_XOPEN_SOURCE -D_DARWIN_C_SOURCE -D_DARWIN_UNLIMITED_SELECT -D_REENTRANT ./vm.c -o rb_mjit_header.h.new
rb_mjit_header.h updated
building .ext/include/x86_64-darwin20/rb_mjit_min_header-3.0.0.h
./miniruby -I./lib -I. -I.ext/common ./tool/transform_mjit_header.rb "clang -fdeclspec -O3 -ggdb3 -Wall -Wextra -Wdeprecated-declarations -Wdivision-by-zero -Wimplicit-function-declaration -Wimplicit-int -Wmisleading-indentation -Wpointer-arith -Wshorten-64-to-32 -Wwrite-strings -Wmissing-noreturn -Wno-constant-logical-operand -Wno-long-long -Wno-missing-field-initializers -Wno-overlength-strings -Wno-parentheses-equality -Wno-self-assign -Wno-tautological-compare -Wno-unused-parameter -Wno-unused-value -Wunused-variable -Wextra-tokens -std=gnu99 -fno-common -pipe " rb_mjit_header.h .ext/include/x86_64-darwin20/rb_mjit_min_header-3.0.0.h
making srcs under enc
make[1]: Nothing to be done for `srcs'.
generating transdb.h
verconf.h updated
compiling loadpath.c
linking static-library libruby.3.0-static.a
transdb.h updated
linking shared-library libruby.3.0.dylib
transform_mjit_header: making external definition static inline: rb_vm_lvar_exposed, Init_vm_stack_canary, rb_vm_opt_cfunc_p, rb_find_defined_class_by_owner, rb_vm_rewrite_cref, rb_vm_block_ep_update, rb_vm_cref_new_toplevel, rb_vm_frame_block_handler, rb_vm_cframe_keyword_p, rb_vm_ep_local_ep
transform_mjit_header: making declaration static inline: rb_vm_lvar_exposed, Init_vm_stack_canary, rb_vm_rewrite_cref, rb_vm_frame_block_handler, rb_vm_block_ep_update, rb_vm_ep_local_ep
transform_mjit_header: SKIPPED to transform: __sigbits, isspecial, isrune, isphonogram, isnumber, isideogram, ishexnumber, digittoint, toupper, tolower, toascii, isxdigit, isupper, isspace, ispunct, isprint, islower, isgraph, isdigit, iscntrl, isblank, isalpha, isalnum, __wcwidth, __isctype, __istype, isascii, __sincospi, __sincospif, __sincos, __sincosf, __inline_isnormall, __inline_isnormald, __inline_isnormalf, __inline_signbitl, __inline_signbitd, __inline_signbitf, __inline_isnanl, __inline_isnand, __inline_isnanf, __inline_isinfl, __inline_isinfd, __inline_isinff, __inline_isfinitel, __inline_isfinited, __inline_isfinitef, __darwin_fd_clr, __darwin_fd_set, __darwin_fd_isset, __darwin_check_fd_set, __sputc
ln -sf ../../../.ext/include/x86_64-darwin20/rb_mjit_min_header-3.0.0.h include/ruby-3.0.0/x86_64-darwin20/rb_mjit_min_header-3.0.0.h
making mjit_build_dir.dylib
generating makefiles ext/configure-ext.mk
making enc
making trans
linking ruby
compiling ./enc/trans/transdb.c
compiling ./enc/encdb.c
compiling ./enc/big5.c
compiling ./enc/cesu_8.c
ext/configure-ext.mk updated
compiling ./enc/trans/big5.c
compiling ./enc/cp949.c
compiling ./enc/trans/cesu_8.c
compiling ./enc/emacs_mule.c
configuring -test-/RUBY_ALIGNOF
compiling ./enc/trans/chinese.c
configuring bigdecimal
compiling ./enc/euc_jp.c
compiling ./enc/trans/ebcdic.c
configuring cgi/escape
compiling ./enc/trans/emoji.c
configuring continuation
compiling ./enc/euc_kr.c
configuring -test-/arith_seq/extract
configuring -test-/array/resize
configuring -test-/bignum
compiling ./enc/trans/emoji_iso2022_kddi.c
configuring -test-/bug-14834
configuring -test-/bug-3571
compiling ./enc/euc_tw.c
configuring -test-/bug-5832
configuring -test-/bug_reporter
configuring -test-/class
configuring -test-/cxxanyargs
configuring coverage
compiling ./enc/trans/emoji_sjis_docomo.c
compiling ./enc/gb2312.c
configuring -test-/debug
configuring -test-/dln/empty
configuring -test-/enumerator_kw
configuring -test-/exception
configuring -test-/fatal
configuring -test-/file
compiling ./enc/gb18030.c
configuring date
compiling ./enc/gbk.c
compiling ./enc/iso_8859_1.c
compiling ./enc/iso_8859_2.c
compiling ./enc/iso_8859_3.c
compiling ./enc/trans/emoji_sjis_kddi.c
compiling ./enc/iso_8859_4.c
compiling ./enc/iso_8859_5.c
compiling ./enc/iso_8859_6.c
configuring dbm
compiling ./enc/iso_8859_7.c
configuring digest
configuring digest/bubblebabble
configuring digest/md5
configuring etc
compiling ./enc/iso_8859_8.c
compiling ./enc/iso_8859_9.c
compiling ./enc/iso_8859_10.c
configuring digest/rmd160
compiling ./enc/iso_8859_11.c
configuring digest/sha1
compiling ./enc/iso_8859_13.c
configuring digest/sha2
compiling ./enc/iso_8859_14.c
configuring fcntl
compiling ./enc/trans/emoji_sjis_softbank.c
compiling ./enc/iso_8859_15.c
configuring -test-/float
configuring -test-/funcall
configuring -test-/gvl/call_without_gvl
configuring -test-/hash
configuring -test-/integer
configuring -test-/iseq_load
configuring -test-/iter
configuring -test-/load/dot.dot
compiling ./enc/trans/escape.c
configuring -test-/load/protect
configuring -test-/marshal/compat
configuring -test-/marshal/internal_ivar
configuring -test-/marshal/usr
configuring -test-/memory_status
configuring -test-/memory_view
configuring -test-/method
compiling ./enc/iso_8859_16.c
configuring -test-/notimplement
configuring -test-/num2int
configuring -test-/path_to_class
configuring -test-/popen_deadlock
configuring -test-/postponed_job
configuring -test-/printf
configuring -test-/proc
configuring -test-/random
configuring -test-/rational
configuring -test-/rb_call_super_kw
configuring -test-/recursion
configuring -test-/regexp
configuring -test-/scan_args
configuring -test-/st/foreach
compiling ./enc/trans/gb18030.c
configuring -test-/st/numhash
configuring -test-/st/update
configuring -test-/string
compiling ./enc/koi8_r.c
configuring -test-/struct
configuring -test-/symbol
compiling ./enc/koi8_u.c
compiling ./enc/shift_jis.c
compiling ./enc/utf_16be.c
configuring -test-/thread_fd_close
configuring -test-/time
configuring -test-/tracepoint
configuring -test-/typeddata
configuring -test-/vm
configuring -test-/wait_for_single_fd
compiling ./enc/utf_16le.c
compiling ./enc/utf_32be.c
compiling ./enc/trans/gbk.c
compiling ./enc/utf_32le.c
compiling ./enc/windows_31j.c
compiling ./enc/windows_1250.c
header: ndbm.h
library: libc
configuring fiber
compiling ./enc/trans/iso2022.c
compiling ./enc/windows_1251.c
configuring fiddle
compiling ./enc/windows_1252.c
configuring gdbm
compiling ./enc/windows_1253.c
compiling ./enc/windows_1254.c
compiling ./enc/windows_1257.c
linking encoding encdb.bundle
linking encoding big5.bundle
linking encoding cesu_8.bundle
linking encoding cp949.bundle
linking encoding emacs_mule.bundle
compiling ./enc/trans/japanese.c
libffi_version: 3.3.0
configuring io/console
linking encoding euc_jp.bundle
compiling ./enc/trans/japanese_euc.c
linking encoding euc_kr.bundle
linking encoding euc_tw.bundle
compiling ./enc/trans/japanese_sjis.c
compiling ./enc/trans/korean.c
linking encoding gb2312.bundle
linking encoding gb18030.bundle
linking encoding gbk.bundle
linking encoding iso_8859_1.bundle
linking encoding iso_8859_2.bundle
linking encoding iso_8859_3.bundle
linking encoding iso_8859_4.bundle
linking encoding iso_8859_5.bundle
linking encoding iso_8859_6.bundle
linking encoding iso_8859_7.bundle
linking encoding iso_8859_8.bundle
compiling ./enc/trans/single_byte.c
configuring json
configuring json/generator
linking encoding iso_8859_9.bundle
configuring json/parser
linking encoding iso_8859_10.bundle
configuring io/nonblock
linking encoding iso_8859_11.bundle
linking encoding iso_8859_13.bundle
linking encoding iso_8859_14.bundle
linking encoding iso_8859_15.bundle
configuring monitor
compiling ./enc/trans/utf8_mac.c
configuring io/wait
linking encoding iso_8859_16.bundle
linking encoding koi8_r.bundle
configuring nkf
compiling ./enc/trans/utf_16_32.c
linking encoding koi8_u.bundle
linking encoding shift_jis.bundle
configuring objspace
linking encoding utf_16be.bundle
linking encoding utf_16le.bundle
linking encoding utf_32be.bundle
linking encoding utf_32le.bundle
linking encoding windows_31j.bundle
configuring openssl
linking transcoder transdb.bundle
configuring pathname
linking encoding windows_1250.bundle
linking encoding windows_1251.bundle
linking transcoder big5.bundle
linking encoding windows_1252.bundle
linking encoding windows_1253.bundle
configuring psych
linking encoding windows_1254.bundle
linking encoding windows_1257.bundle
linking transcoder cesu_8.bundle
linking transcoder chinese.bundle
configuring pty
linking transcoder ebcdic.bundle
configuring racc/cparse
configuring rbconfig/sizeof
configuring readline
linking transcoder emoji.bundle
configuring ripper
configuring rubyvm
linking transcoder emoji_iso2022_kddi.bundle
configuring socket
linking transcoder emoji_sjis_docomo.bundle
configuring stringio
linking transcoder emoji_sjis_kddi.bundle
linking transcoder emoji_sjis_softbank.bundle
configuring strscan
linking transcoder escape.bundle
linking transcoder gb18030.bundle
linking transcoder gbk.bundle
linking transcoder iso2022.bundle
linking transcoder japanese.bundle
linking transcoder japanese_euc.bundle
linking transcoder japanese_sjis.bundle
linking transcoder korean.bundle
linking transcoder single_byte.bundle
linking transcoder utf8_mac.bundle
configuring syslog
linking transcoder utf_16_32.bundle
making encs
configuring zlib
make[1]: Nothing to be done for `encs'.
generating makefile exts.mk
exts.mk updated
compiling resize.c
compiling extract.c
compiling c.c
compiling bug.c
compiling bug.c
compiling bug-14384.c
compiling bug_reporter.c
compiling big2str.c
compiling cpp.cpp
linking shared-object -test-/bug_3571.bundle
linking shared-object -test-/array/resize.bundle
linking shared-object -test-/bug_reporter.bundle
linking shared-object -test-/arith_seq/extract.bundle
linking shared-object -test-/bug_14834.bundle
linking shared-object -test-/bug_5832.bundle
compiling bigzero.c
compiling cxxanyargs.cpp
compiling class2name.c
compiling init.c
compiling empty.c
linking shared-object -test-/dln/empty.bundle
compiling div.c
compiling inspector.c
compiling init.c
compiling profile_frames.c
linking shared-object -test-/RUBY_ALIGNOF.bundle
compiling init.c
linking shared-object -test-/class.bundle
compiling enumerator_kw.c
compiling dataerror.c
compiling rb_fatal.c
compiling intpack.c
linking shared-object -test-/debug.bundle
compiling fs.c
compiling mul.c
compiling enc_raise.c
linking shared-object -test-/cxxanyargs.bundle
compiling str2big.c
linking shared-object -test-/fatal/rb_fatal.bundle
linking shared-object -test-/enumerator_kw.bundle
compiling ensured.c
compiling init.c
compiling nextafter.c
compiling init.c
compiling funcall.c
compiling stat.c
compiling init.c
linking shared-object -test-/bignum.bundle
compiling call_without_gvl.c
compiling delete.c
compiling core_ext.c
compiling iseq_load.c
linking shared-object -test-/float.bundle
linking shared-object -test-/file.bundle
linking shared-object -test-/exception.bundle
linking shared-object -test-/funcall.bundle
compiling break.c
compiling init.c
compiling init.c
compiling dot.dot.c
linking shared-object -test-/gvl/call_without_gvl.bundle
linking shared-object -test-/iseq_load.bundle
linking shared-object -test-/load/dot.dot.bundle
compiling protect.c
compiling my_integer.c
compiling init.c
linking shared-object -test-/hash.bundle
compiling usrcompat.c
compiling internal_ivar.c
compiling usrmarshal.c
compiling yield.c
linking shared-object -test-/load/protect.bundle
compiling memory_status.c
compiling memory_view.c
linking shared-object -test-/marshal/compat.bundle
linking shared-object -test-/marshal/internal_ivar.bundle
linking shared-object -test-/marshal/usr.bundle
compiling arity.c
linking shared-object -test-/iter.bundle
linking shared-object -test-/integer.bundle
compiling init.c
compiling bug.c
compiling num2int.c
compiling path_to_class.c
linking shared-object -test-/memory_status.bundle
compiling postponed_job.c
compiling printf.c
linking shared-object -test-/method.bundle
compiling init.c
linking shared-object -test-/notimplement.bundle
linking shared-object -test-/path_to_class.bundle
compiling init.c
compiling receiver.c
compiling rat.c
compiling super.c
linking shared-object -test-/postponed_job.bundle
linking shared-object -test-/num2int.bundle
compiling loop.c
linking shared-object -test-/memory_view.bundle
compiling rb_call_super_kw.c
compiling recursion.c
linking shared-object -test-/proc.bundle
compiling init.c
linking shared-object -test-/printf.bundle
compiling scan_args.c
compiling foreach.c
compiling numhash.c
linking shared-object -test-/random.bundle
linking shared-object -test-/rb_call_super_kw.bundle
linking shared-object -test-/recursion.bundle
compiling parse_depth_limit.c
compiling update.c
compiling duplicate.c
compiling capacity.c
linking shared-object -test-/st/foreach.bundle
linking shared-object -test-/regexp.bundle
linking shared-object -test-/st/numhash.bundle
linking shared-object -test-/st/update.bundle
compiling init.c
compiling len.c
linking shared-object -test-/rational.bundle
compiling member.c
compiling coderange.c
compiling init.c
compiling thread_fd_close.c
compiling init.c
compiling cstr.c
compiling gc_hook.c
linking shared-object -test-/struct.bundle
compiling type.c
compiling typeddata.c
compiling ellipsize.c
linking shared-object compiling -test-/thread_fd_close.bundle
leap_second.c
linking shared-object -test-/scan_args.bundle
compiling tracepoint.c
compiling enc_associate.c
linking shared-object -test-/typeddata.bundle
linking shared-object -test-/symbol.bundle
compiling new.c
compiling at_exit.c
compiling enc_str_buf_cat.c
compiling fstring.c
compiling wait_for_single_fd.c
linking shared-object -test-/tracepoint.bundle
compiling init.c
linking shared-object -test-/vm/at_exit.bundle
compiling modify.c
compiling bigdecimal.c
compiling new.c
compiling escape.c
compiling nofree.c
linking shared-object -test-/wait_for_single_fd.bundle
compiling continuation.c
In file included from bigdecimal.c:13:
./bigdecimal.h:122:1: error: redefinition of 'rb_array_const_ptr'
rb_array_const_ptr(VALUE a)
^
../.././include/ruby/internal/core/rarray.h:184:1: note: previous definition is here
rb_array_const_ptr(VALUE a)
^
In file included from bigdecimal.c:13:
./bigdecimal.h:139:1: error: static declaration of 'rb_sym2str' follows non-static declaration
rb_sym2str(VALUE sym)
^
../.././include/ruby/internal/symbol.h:63:7: note: previous declaration is here
VALUE rb_sym2str(VALUE);
^
bigdecimal.c:108:1: error: static declaration of 'rb_rational_num' follows non-static declaration
rb_rational_num(VALUE rat)
^
../.././include/ruby/internal/intern/rational.h:39:7: note: previous declaration is here
VALUE rb_rational_num(VALUE rat);
^
bigdecimal.c:120:1: error: static declaration of 'rb_rational_den' follows non-static declaration
rb_rational_den(VALUE rat)
^
../.././include/ruby/internal/intern/rational.h:40:7: note: previous declaration is here
VALUE rb_rational_den(VALUE rat);
^
bigdecimal.c:132:1: error: static declaration of 'rb_complex_real' follows non-static declaration
rb_complex_real(VALUE cmp)
^
../.././include/ruby/internal/intern/complex.h:38:7: note: previous declaration is here
VALUE rb_complex_real(VALUE z);
^
bigdecimal.c:144:1: error: static declaration of 'rb_complex_imag' follows non-static declaration
rb_complex_imag(VALUE cmp)
^
../.././include/ruby/internal/intern/complex.h:39:7: note: previous declaration is here
VALUE rb_complex_imag(VALUE z);
^
linking shared-object -test-/time.bundle
compiling normalize.c
compiling qsort.c
compiling rb_interned_str.c
compiling coverage.c
compiling date_core.c
linking shared-object continuation.bundle
compiling rb_str_dup.c
compiling dbm.c
installing default bigdecimal libraries
compiling digest.c
compiling etc.c
linking shared-object cgi/escape.bundle
6 errors generated.
make[2]: *** [bigdecimal.o] Error 1
make[1]: *** [ext/bigdecimal/all] Error 2
make[1]: *** Waiting for unfinished jobs....
installing default coverage libraries
compiling date_parse.c
compiling set_len.c
compiling date_strftime.c
linking shared-object -test-/string.bundle
linking shared-object coverage.bundle
compiling date_strptime.c
installing default digest libraries
installing default date_core libraries
installing digest libraries
linking shared-object digest.bundle
linking shared-object etc.bundle
linking shared-object dbm.bundle
linking shared-object date_core.bundle
make: *** [build-ext] Error 2
Sign up for free to join this conversation on GitHub. Already have an account? Sign in to comment