Skip to content

Instantly share code, notes, and snippets.

@dalekurt

dalekurt/log.txt

Created Sep 18, 2019
Embed
What would you like to do?
Output logs
Error: Error refreshing state: 7 errors occurred:
* module.audit.data.terraform_remote_state.stage: 1 error occurred:
* module.audit.data.terraform_remote_state.stage: data.terraform_remote_state.stage: error loading the remote state: NoSuchBucket: The specified bucket does not exist
status code: 404, request id: 7FEE83248E60C945, host id: tbiIT+DulLbPdtVBbQuO/vdFKGm2Obuwm6tACMmcEZVvUR56aSPwTPI9rJrDz0eZcGavpZTd6+w=
* module.dev.data.terraform_remote_state.stage: 1 error occurred:
* module.dev.data.terraform_remote_state.stage: data.terraform_remote_state.stage: error loading the remote state: NoSuchBucket: The specified bucket does not exist
status code: 404, request id: 64C9D80849C8A6D5, host id: Qn5xcpRc20N5ybZex7QvSN9NBndBfqUSSbS4PbNmMsGn0mh06ux7n3bSoJP3x57m/DqKhAwI7F8=
* module.data.data.terraform_remote_state.stage: 1 error occurred:
* module.data.data.terraform_remote_state.stage: data.terraform_remote_state.stage: error loading the remote state: NoSuchBucket: The specified bucket does not exist
status code: 404, request id: 9AD9F39B089DC369, host id: w7RaqeXoHd+IpsSJo7qjBai2vm8MhSKznBRcHekwKDKPi/RQmPMfmG5qr1pHDh4ayGXYB5CLdU0=
* module.testing.data.terraform_remote_state.stage: 1 error occurred:
* module.testing.data.terraform_remote_state.stage: data.terraform_remote_state.stage: error loading the remote state: NoSuchBucket: The specified bucket does not exist
status code: 404, request id: F2A13A3AFE796C09, host id: S0/vcUVW8fwekqoSgqGyS9t1pBduT5PU+j6aih3+UoBUj26X+NT9FIJWkukrdnB+sHKcyL/XWSk=
* module.staging.data.terraform_remote_state.stage: 1 error occurred:
* module.staging.data.terraform_remote_state.stage: data.terraform_remote_state.stage: error loading the remote state: NoSuchBucket: The specified bucket does not exist
status code: 404, request id: 5F86ECEF58A46EEB, host id: Dnz2SNc7Qz8AuL7Ob/SfpvQxgb4iecmQdEdDMvzBLW1xxqKAbleOgbb5FJH2tMfhL3KAQLrUyUU=
* module.prod.data.terraform_remote_state.stage: 1 error occurred:
* module.prod.data.terraform_remote_state.stage: data.terraform_remote_state.stage: error loading the remote state: NoSuchBucket: The specified bucket does not exist
status code: 404, request id: E363AE873A5AAA49, host id: kKC5RZzJo+yksF/v1uOp4b6AL3fvXWJpPpM/+vF0BYIkX+Bt10hoBuGhnDE4ftTf77rRXNKPimA=
* module.corp.data.terraform_remote_state.stage: 1 error occurred:
* module.corp.data.terraform_remote_state.stage: data.terraform_remote_state.stage: error loading the remote state: NoSuchBucket: The specified bucket does not exist
status code: 404, request id: F2C073653C84FC11, host id: VyQHzMvFFg2CpIhvlr0RekEgnCKtHibraRucJy3UdaaJlB6cx5CPU/vT8b3BhYYMhS9SMkROk1E=
make: *** [Makefile:11: apply] Error 1
===============================================================================================
The root-dns module errored. Aborting.
* Please report this error here:
https://github.com/cloudposse/reference-architectures/issues/new
Goodbye
make: *** [root/finalize] Error 1
Sign up for free to join this conversation on GitHub. Already have an account? Sign in to comment