Skip to content

Instantly share code, notes, and snippets.

Embed
What would you like to do?
chrome driver parallel
Running 4 parallel behat sites:
[behatrun1] vendor/bin/behat --config /var/www/moodledata/behat/behatrun1/behat/behat.yml
[behatrun2] vendor/bin/behat --config /var/www/moodledata/behat/behatrun2/behat/behat.yml
[behatrun3] vendor/bin/behat --config /var/www/moodledata/behat/behatrun3/behat/behat.yml
[behatrun4] vendor/bin/behat --config /var/www/moodledata/behat/behatrun4/behat/behat.yml
Moodle 3.4dev (Build: 20170622), b095b36c02bbbf2806e5dfa493cc272b1ec740e7
Php: 7.1.6, pgsql: 9.6.3, OS: Linux 4.4.0-81-generic x86_64
Server OS "Linux", Browser: "chrome"
Browser specific fixes have been applied. See http://docs.moodle.org/dev/Acceptance_testing#Browser_specific_fixes
Started at 07-07-2017, 19:22
Moodle 3.4dev (Build: 20170622), b095b36c02bbbf2806e5dfa493cc272b1ec740e7
Php: 7.1.6, pgsql: 9.6.3, OS: Linux 4.4.0-81-generic x86_64
Server OS "Linux", Browser: "chrome"
Browser specific fixes have been applied. See http://docs.moodle.org/dev/Acceptance_testing#Browser_specific_fixes
Started at 07-07-2017, 19:22
Moodle 3.4dev (Build: 20170622), b095b36c02bbbf2806e5dfa493cc272b1ec740e7
Php: 7.1.6, pgsql: 9.6.3, OS: Linux 4.4.0-81-generic x86_64
Server OS "Linux", Browser: "chrome"
Browser specific fixes have been applied. See http://docs.moodle.org/dev/Acceptance_testing#Browser_specific_fixes
Started at 07-07-2017, 19:22
Moodle 3.4dev (Build: 20170622), b095b36c02bbbf2806e5dfa493cc272b1ec740e7
Php: 7.1.6, pgsql: 9.6.3, OS: Linux 4.4.0-81-generic x86_64
Server OS "Linux", Browser: "chrome"
Browser specific fixes have been applied. See http://docs.moodle.org/dev/Acceptance_testing#Browser_specific_fixes
Started at 07-07-2017, 19:22
...................................................................... 70
...................................................................... 140
...................................................................... 210
...................................................................... 280
.....................................................F---------....... 350
...................................................................... 420
...F----.........F-----------------------------....................... 490
F-.F----..F--.................................F-----------F----------- 560
.................................F-----------.F---.----------......... 630
F------------..........F-----------................................... 700
...............................................F---------------------- 770
..........----......................F------------................F---- 840
-....................................F-------------------............. 910
...........F----F---.................................................. 980
...........................................................F-----..... 1050
......F---------------F-----------.....................F-----------... 1120
......F---....F-----.............................F-------------....... 1190
........F-------F-----------.....F----------F------------............. 1260
...................F-------......................F.--------...F---.... 1330
.............F--------------------------------.............F------.... 1400
.............F-----------------------------------..................... 1470
......F----------.....F-....................................F--------- 1540
..............................F--------------------------------------. 1610
...F---------------................................................... 1680
.............................F-...............F------................. 1750
...................................................................... 1820
..............F-----F-----...........F----............................ 1890
...................................................................... 1960
...................................----F-------------------------..... 2030
...............F----------------------................................ 2100
...........F---...............................F----................... 2170
..F-----------.........................F---------.-----------..------- 2240
......................................F-...........F----.............. 2310
---.......F--------........F-------.......F-----------................ 2380
.............F------................................F---------------.. 2450
...F-----------------------........F-------..........F---------------. 2520
......................F--------------..F-............................. 2590
..................F--------........................................... 2660
...................................................................... 2730
.F---------------........F-------.----................................ 2800
...................................................................... 2870
....................................................................F- 2940
...F-------------------------......................................... 3010
F----................................................................. 3080
...................................................................... 3150
...F-----------------...........F-----------F-------------------...... 3220
..........................F-----------................................ 3290
......................---F--------------.----------------------------. 3360
...............................................................----... 3430
...................................................................... 3500
.........................F--------....F-------------------.----------- 3570
------------------------.............................................. 3640
...................................................................... 3710
..............F-------.......F----------.............................. 3780
............................................F------------............. 3850
.........F---------------------------................................. 3920
.......F------..--------------..........F------------................. 3990
..............F--.-----............................................... 4060
.......................F--------------------......................F--- 4130
.------------------------------------------------------------------... 4200
F---.--------------................................................... 4270
................................................................F----. 4340
.......................F------------------------------------------.... 4410
..............................................F--------------------... 4480
..F-------------.................F---------------------.......F------- 4550
.............................................................F-------- 4620
-----------..............F-----..--------..-------.................... 4690
...................................................................... 4760
....................................................F-------.......... 4830
...............................F---------.-----------.----------...... 4900
...................................................................... 4970
...........................................................F------.... 5040
.........F----------......................................-----------. 5110
........F-----------.F----------------F-----------.---------------.... 5180
.......................................F--............................ 5250
...................................................................... 5320
...................................................................... 5390
...................................................................... 5460
...................................................................... 5530
...................................................................... 5600
...................................................................... 5670
...................................................................... 5740
...................................................................... 5810
...................................................................... 5880
...................................................................... 5950
...................................................................... 6020
...................................................................... 6090
........................................F----------------------------- 6160
-----------------------------------------------------------------..... 6230
.....................--------------................................... 6300
..............................................------------------------ 6370
-------------------------------------------------..................... 6440
...................................................................... 6510
...................................................................... 6580
...................................................................... 6650
......------------------------------------------------------------.... 6720
...................................................................... 6790
.....................................................................- 6860
---------------------------------------------------------------------- 6930
---------------------------------------------------------------------- 7000
-------------------------------------------------..................... 7070
...................................-----------------------------...... 7140
.........................-----------------------...................... 7210
........................---------------------------------------------- 7280
----------------...................----------------------------------- 7350
--------------------------------------------------------------------.. 7420
...................................................................... 7490
...................................................................... 7560
...................................................................... 7630
...................................................................... 7700
...................................................................... 7770
---------------------------------------------------------------------. 7840
..................-----------------------------------------........... 7910
...................................................................... 7980
...................................................................... 8050
...................................................................... 8120
...................................................................... 8190
---------------------------------------------------------------------. 8260
......................------------------------------------............ 8330
...------------------------------------------------------------------. 8400
...................................................................... 8470
.................................................................----- 8540
---------------------------------------------------------------------- 8610
---------------------------------------------------------------------- 8680
-------------------------........................................----- 8750
---------------------------------------------------------------------- 8820
---------------------------------------------------------------------- 8890
------------------------------------------------------------------.... 8960
...................................................................... 9030
...------------------------------------------......................... 9100
............................................................---------- 9170
--------------........................................................ 9240
...................................................................... 9310
...................----------------------------..--------------....... 9380
....................------------------------------------------------.. 9450
...................................................................... 9520
.....................................................----------------- 9590
---------------------------------------------------------------------- 9660
-----------------..................................................... 9730
..........................................---------------------------. 9800
...................................................................... 9870
.--------------------------------------............................... 9940
...................................................................... 10010
...................................................................... 10080
...................................................................... 10150
.......................................----------............--------- 10220
---------------------------------------------------------------------- 10290
---------------------------------------------------------------------- 10360
.......................................................--------------- 10430
---------------------------........................................... 10500
...................................................................... 10570
...................................................................... 10640
---------------------------------------------------------------------- 10710
---------------------------------------------------------------------- 10780
-----------------------
Finished in 0h 41m 49s
**************** [behatrun1] ****************
Moodle 3.4dev (Build: 20170622), b095b36c02bbbf2806e5dfa493cc272b1ec740e7
Php: 7.1.6, pgsql: 9.6.3, OS: Linux 4.4.0-81-generic x86_64
Server OS "Linux", Browser: "chrome"
Browser specific fixes have been applied. See http://docs.moodle.org/dev/Acceptance_testing#Browser_specific_fixes
Started at 07-07-2017, 19:22
...................................................................... 70
.........................................................F----........ 140
.....F----........................................F-------------...F-- 210
--------.....F-------------------.....F--------------...F------------- 280
-.....F-----------------------------------.....F---------------------- 350
------------.....F-----------------------------------.....F---------.. 420
...F-....F----............................F---....F-...F--------...... 490
...F-------------------------------------------------......F---------- 560
------------------......F-............................................ 630
.................................F-................................... 700
...................................................F-----------.....F- 770
----................F------------------------------------------------- 840
----------------........F-------.......F------------------------------ 910
--------.............................................................. 980
..........F---------.....F-------------.....F-------------------...... 1050
......................F--------------------------------...........
Fatal error: Uncaught Behat\Testwork\Call\Exception\CallErrorException: Notice: fwrite(): send of 56 bytes failed with errno=32 Broken pipe in /var/www/html/vendor/textalk/websocket/lib/Base.php line 246 in /var/www/html/vendor/behat/behat/src/Behat/Testwork/Call/Handler/RuntimeCallHandler.php:85
Stack trace:
#0 [internal function]: Behat\Testwork\Call\Handler\RuntimeCallHandler->handleError(8, 'fwrite(): send ...', '/var/www/html/v...', 246, Array)
#1 /var/www/html/vendor/textalk/websocket/lib/Base.php(246): fwrite(Resource id #16319, '\x81\xB2_\xE3s\xA7$\xC1\x1A\xC3}\xD9J\x93m...')
#2 /var/www/html/vendor/textalk/websocket/lib/Base.php(126): WebSocket\Base->write('\x81\xB2_\xE3s\xA7$\xC1\x1A\xC3}\xD9J\x93m...')
#3 /var/www/html/vendor/textalk/websocket/lib/Base.php(70): WebSocket\Base->send_fragment(true, '{"id":9422,"met...', 'text', true)
#4 /var/www/html/vendor/dmore/chrome-mink-driver/src/DevToolsConnection.php(47): WebSocket\Base->send('{"id":9422,"met...')
#5 /var/www/html/vendor/dmore/chrome-mink-driver/src/Chrom in /var/www/html/vendor/behat/behat/src/Behat/Testwork/Call/Handler/RuntimeCallHandler.php on line 85
[DMore\ChromeDriver\StreamReadException]
behat [-s|--suite SUITE] [-f|--format FORMAT] [-o|--out OUT] [--format-settings FORMAT-SETTINGS] [--init] [--lang LANG] [--name NAME] [--tags TAGS] [--role ROLE] [--story-syntax] [-d|--definitions DEFINITIONS] [--snippets-for [SNIPPETS-FOR]] [--snippets-type SNIPPETS-TYPE] [--append-snippets] [--no-snippets] [--strict] [--order ORDER] [--skip-passed] [--rerun] [--stop-on-failure] [--dry-run] [--] [<paths>]
**************** [behatrun2] ****************
Moodle 3.4dev (Build: 20170622), b095b36c02bbbf2806e5dfa493cc272b1ec740e7
Php: 7.1.6, pgsql: 9.6.3, OS: Linux 4.4.0-81-generic x86_64
Server OS "Linux", Browser: "chrome"
Browser specific fixes have been applied. See http://docs.moodle.org/dev/Acceptance_testing#Browser_specific_fixes
Started at 07-07-2017, 19:22
...................................................................... 70
............................................................F--------- 140
--..F-----------..F-----------..F-----------.......................... 210
...................F----------------------....F-----.....F----........ 280
...................................................................... 350
.......F-----......................................................... 420
...........................................F-.....F------------------- 490
-------------------------------..........F------........F-----.....F-- 560
---------........F----....F-----------........F----........F-------... 630
..F-----------------------........F--------------....F---------------- 700
------....F-------------------------....F-------------------.....F---- 770
-------------------------------....................................... 840
...................................................................... 910
.............................................F------------------------ 980
-.....F--------------------------------------------------------------- 1050
-------------------------------------------........................... 1120
..................F---------------------.............................. 1190
.............................F--------------------------
Fatal error: Uncaught Behat\Testwork\Call\Exception\CallErrorException: Notice: fwrite(): send of 56 bytes failed with errno=32 Broken pipe in /var/www/html/vendor/textalk/websocket/lib/Base.php line 246 in /var/www/html/vendor/behat/behat/src/Behat/Testwork/Call/Handler/RuntimeCallHandler.php:85
Stack trace:
#0 [internal function]: Behat\Testwork\Call\Handler\RuntimeCallHandler->handleError(8, 'fwrite(): send ...', '/var/www/html/v...', 246, Array)
#1 /var/www/html/vendor/textalk/websocket/lib/Base.php(246): fwrite(Resource id #8557, '\x81\xB2\x15\xF5\xB3\x1An\xD7\xDA~7\xCF\x85"!...')
#2 /var/www/html/vendor/textalk/websocket/lib/Base.php(126): WebSocket\Base->write('\x81\xB2\x15\xF5\xB3\x1An\xD7\xDA~7\xCF\x85"!...')
#3 /var/www/html/vendor/textalk/websocket/lib/Base.php(70): WebSocket\Base->send_fragment(true, '{"id":6847,"met...', 'text', true)
#4 /var/www/html/vendor/dmore/chrome-mink-driver/src/DevToolsConnection.php(47): WebSocket\Base->send('{"id":6847,"met...')
#5 /var/www/html/vendor/dmore/chrome-mink-driver/src/ in /var/www/html/vendor/behat/behat/src/Behat/Testwork/Call/Handler/RuntimeCallHandler.php on line 85
[Behat\Testwork\Call\Exception\CallErrorException]
Notice: fwrite(): send of 56 bytes failed with errno=32 Broken pipe in /var/www/html/vendor/textalk/websocket/lib/Base.php line 246
behat [-s|--suite SUITE] [-f|--format FORMAT] [-o|--out OUT] [--format-settings FORMAT-SETTINGS] [--init] [--lang LANG] [--name NAME] [--tags TAGS] [--role ROLE] [--story-syntax] [-d|--definitions DEFINITIONS] [--snippets-for [SNIPPETS-FOR]] [--snippets-type SNIPPETS-TYPE] [--append-snippets] [--no-snippets] [--strict] [--order ORDER] [--skip-passed] [--rerun] [--stop-on-failure] [--dry-run] [--] [<paths>]
**************** [behatrun3] ****************
Moodle 3.4dev (Build: 20170622), b095b36c02bbbf2806e5dfa493cc272b1ec740e7
Php: 7.1.6, pgsql: 9.6.3, OS: Linux 4.4.0-81-generic x86_64
Server OS "Linux", Browser: "chrome"
Browser specific fixes have been applied. See http://docs.moodle.org/dev/Acceptance_testing#Browser_specific_fixes
Started at 07-07-2017, 19:22
.........F------------------.......................................... 70
F------------------................................................... 140
...................................................................... 210
...................................................................... 280
.F---------------...F---....F-------...F------------.........F-------. 350
.......F--------...F----------...F---------------..................... 420
...................................................................... 490
............F--------------------------------------------------------- 560
---------------------------------------------------------............. 630
...................................................................... 700
...................................................................F-- 770
-----........F------.......F-------................................... 840
...................................................................... 910
...................................................................... 980
...................................................................... 1050
...................................................................... 1120
...................................................................... 1190
...................................................................... 1260
...................................................................... 1330
...................................................................... 1400
..............F------------------------------------------------------- 1470
-----.........F-------------------------------------------------...... 1540
...................................................................... 1610
...................................................................... 1680
...................................................................... 1750
...................................................................... 1820
.........................................................F------------ 1890
---------------------------------------------------------------------- 1960
---------------------------------------------------------------------- 2030
--------------------------
Fatal error: Uncaught Behat\Testwork\Call\Exception\CallErrorException: Notice: fwrite(): send of 56 bytes failed with errno=32 Broken pipe in /var/www/html/vendor/textalk/websocket/lib/Base.php line 246 in /var/www/html/vendor/behat/behat/src/Behat/Testwork/Call/Handler/RuntimeCallHandler.php:85
Stack trace:
#0 [internal function]: Behat\Testwork\Call\Handler\RuntimeCallHandler->handleError(8, 'fwrite(): send ...', '/var/www/html/v...', 246, Array)
#1 /var/www/html/vendor/textalk/websocket/lib/Base.php(246): fwrite(Resource id #2900, '\x81\xB2\xAE\x01=\xBE\xD5#T\xDA\x8C;\t\x8C\x9E...')
#2 /var/www/html/vendor/textalk/websocket/lib/Base.php(126): WebSocket\Base->write('\x81\xB2\xAE\x01=\xBE\xD5#T\xDA\x8C;\t\x8C\x9E...')
#3 /var/www/html/vendor/textalk/websocket/lib/Base.php(70): WebSocket\Base->send_fragment(true, '{"id":4201,"met...', 'text', true)
#4 /var/www/html/vendor/dmore/chrome-mink-driver/src/DevToolsConnection.php(47): WebSocket\Base->send('{"id":4201,"met...')
#5 /var/www/html/vendor/dmore/chrome-mink-driver/sr in /var/www/html/vendor/behat/behat/src/Behat/Testwork/Call/Handler/RuntimeCallHandler.php on line 85
[Behat\Testwork\Call\Exception\CallErrorException]
Notice: fwrite(): send of 56 bytes failed with errno=32 Broken pipe in /var/www/html/vendor/textalk/websocket/lib/Base.php line 246
behat [-s|--suite SUITE] [-f|--format FORMAT] [-o|--out OUT] [--format-settings FORMAT-SETTINGS] [--init] [--lang LANG] [--name NAME] [--tags TAGS] [--role ROLE] [--story-syntax] [-d|--definitions DEFINITIONS] [--snippets-for [SNIPPETS-FOR]] [--snippets-type SNIPPETS-TYPE] [--append-snippets] [--no-snippets] [--strict] [--order ORDER] [--skip-passed] [--rerun] [--stop-on-failure] [--dry-run] [--] [<paths>]
**************** [behatrun4] ****************
Moodle 3.4dev (Build: 20170622), b095b36c02bbbf2806e5dfa493cc272b1ec740e7
Php: 7.1.6, pgsql: 9.6.3, OS: Linux 4.4.0-81-generic x86_64
Server OS "Linux", Browser: "chrome"
Browser specific fixes have been applied. See http://docs.moodle.org/dev/Acceptance_testing#Browser_specific_fixes
Started at 07-07-2017, 19:22
...................................................................... 70
................................................F--------------------- 140
------------------.........F------------------------------------------ 210
-------------..F--......F------------......F------------......F------- 280
------....F--------------------......F-----------.F----------......... 350
F--------------------------------.....F------------------------------- 420
--------------------------............................................ 490
...................................................................... 560
................................................F-----................ 630
...................................................................... 700
...............................F----------------------.....F---------- 770
----------------------------............F-----------....F------------- 840
------......................................................F--------- 910
--......................F-----------.................................. 980
...............................................F----..........F------- 1050
-.............F-----------------..F-----------........................ 1120
.F--------------........F------------------------........F--------.... 1190
.....F----------........F------------........F------------........F--- 1260
--------------........F--------------------........F------------------ 1330
-..................................................................... 1400
......................F-----------------------------....F------------- 1470
-----------------.....F-------.....F---------------------------------- 1540
-------.......................F-------------------------.......F------ 1610
----------.........................................F--................ 1680
...................................................................... 1750
...................................................................... 1820
...................................................................... 1890
...................................................................... 1960
...................................................................... 2030
...................................................................... 2100
...................................................................... 2170
...................................................................... 2240
...................................................................... 2310
...................................................................... 2380
...................................................................... 2450
...................................................................... 2520
....................................................F----------------- 2590
---------------------------------------------------------------------- 2660
---------------------------------------------------------------------- 2730
---------------------------..........................----------------- 2800
-------............................................................... 2870
..................---------------------------------------------------- 2940
---------------------------------------------------................... 3010
...................................................................... 3080
...................................................................... 3150
...................................................................... 3220
........-------------------------------------------------------------- 3290
--------------------.................................................. 3360
...................................................................... 3430
.......................----------------------------------------------- 3500
---------------------------------------------------------------------- 3570
---------------------------------------------------------------------- 3640
---------------------------------------------------------------------- 3710
---------------------------------------------------------------------- 3780
---------------------------------------------------------------------- 3850
------........................................................-------- 3920
------------------------------------------------------................ 3990
...............-----------------------................................ 4060
..............-------------------------------------------------------- 4130
---------------------------------------------------------------------- 4200
---------------------------------------------------------------------- 4270
----------------...................----------------------------------- 4340
---------------------------------------------------------------------- 4410
---------------------------------------------------------------------- 4480
---------------------------------------------------------------------- 4550
-------............................................................... 4620
...................................................................... 4690
...................................................................... 4760
...................................................................... 4830
...................................................................... 4900
.............--------------------------------------------------------- 4970
---------------------------------------------------------------------- 5040
------------...................--------------------------------------- 5110
------------.......................................................... 5180
...................................................................... 5250
...................................................................... 5320
...................................................................... 5390
.......................----------------------------------------------- 5460
----------------------------.......................------------------- 5530
---------------------------...............---------------------------- 5600
---------------------------------------------------------------------- 5670
---------------------------------------------------------------------- 5740
------------------------------........................................ 5810
...................................................................... 5880
..........................-------------------------------------------- 5950
---------------------------------------------------------------------- 6020
---------------------------------------------------------------------- 6090
---------------------------------------------------------------------- 6160
---------------------------------------------------------------------- 6230
---------------------------------------------------------------------- 6300
---------------------------------------------------------------------- 6370
-----------------........................................------------- 6440
---------------------------------------------------------------------- 6510
---------------------------------------------------------------------- 6580
---------------------------------------------------------------------- 6650
---------------------------------------------------------------------- 6720
---------------------------------------------------------------------- 6790
---------------------------------------------------------------------- 6860
------................................................................ 6930
.............------------------------------------------............... 7000
...................................................................... 7070
---------------------------------------------......................... 7140
...................................................................... 7210
..................................................-------------------- 7280
--------------------..--------------------------...................... 7350
.....----------------------------------------------------------------- 7420
-..................................................................... 7490
........................................................-------------- 7560
---------------------------------------------------------------------- 7630
---------------------------------------------------------------------- 7700
---------------------------------------------------------------------- 7770
---------------------------------------------------------------------- 7840
-------------------------------------------------..................... 7910
...................................................................... 7980
....------------------------------------------------------------------ 8050
----------------------------------------------------------------...... 8120
..................................................................---- 8190
----------------------------------------------........................ 8260
...................................................................... 8330
...................................................................... 8400
.......----........................................................... 8470
....................................................----------........ 8540
....------------------------------------------------------------------ 8610
---------------------------------------------------------------------- 8680
---------------------------------------------------------------------- 8750
---------------------------------------------------------------------- 8820
-----------------..................................................... 8890
..-------------------------------------------------------------------- 8960
--------------------------------...................................... 9030
...................................................................... 9100
...................................................................... 9170
........-------------------------------------------------------------- 9240
---------------------------------------------------------------------- 9310
---------------------------------------------------------------------- 9380
---------------------------------------------------------------------- 9450
---------------------------------------------------------------------- 9520
---------------------------------------------------------------------- 9590
---
--- Failed hooks:
BeforeScenario # behat_hooks::before_scenario_hook()
(DMore\ChromeDriver\StreamReadException)
BeforeScenario # behat_hooks::before_scenario_hook()
(DMore\ChromeDriver\StreamReadException)
BeforeScenario # behat_hooks::before_scenario_hook()
(DMore\ChromeDriver\StreamReadException)
BeforeScenario # behat_hooks::before_scenario_hook()
(DMore\ChromeDriver\StreamReadException)
BeforeScenario # behat_hooks::before_scenario_hook()
(DMore\ChromeDriver\StreamReadException)
BeforeScenario # behat_hooks::before_scenario_hook()
(DMore\ChromeDriver\StreamReadException)
BeforeScenario # behat_hooks::before_scenario_hook()
(DMore\ChromeDriver\StreamReadException)
BeforeScenario # behat_hooks::before_scenario_hook()
(DMore\ChromeDriver\StreamReadException)
BeforeScenario # behat_hooks::before_scenario_hook()
(DMore\ChromeDriver\StreamReadException)
BeforeScenario # behat_hooks::before_scenario_hook()
(DMore\ChromeDriver\StreamReadException)
BeforeScenario # behat_hooks::before_scenario_hook()
(DMore\ChromeDriver\StreamReadException)
BeforeScenario # behat_hooks::before_scenario_hook()
(DMore\ChromeDriver\StreamReadException)
BeforeScenario # behat_hooks::before_scenario_hook()
(DMore\ChromeDriver\StreamReadException)
BeforeScenario # behat_hooks::before_scenario_hook()
(DMore\ChromeDriver\StreamReadException)
BeforeScenario # behat_hooks::before_scenario_hook()
(DMore\ChromeDriver\StreamReadException)
BeforeScenario # behat_hooks::before_scenario_hook()
(DMore\ChromeDriver\StreamReadException)
BeforeScenario # behat_hooks::before_scenario_hook()
(DMore\ChromeDriver\StreamReadException)
BeforeScenario # behat_hooks::before_scenario_hook()
(DMore\ChromeDriver\StreamReadException)
BeforeScenario # behat_hooks::before_scenario_hook()
(DMore\ChromeDriver\StreamReadException)
BeforeScenario # behat_hooks::before_scenario_hook()
(DMore\ChromeDriver\StreamReadException)
BeforeScenario # behat_hooks::before_scenario_hook()
(DMore\ChromeDriver\StreamReadException)
BeforeScenario # behat_hooks::before_scenario_hook()
(DMore\ChromeDriver\StreamReadException)
BeforeScenario # behat_hooks::before_scenario_hook()
(DMore\ChromeDriver\StreamReadException)
BeforeScenario # behat_hooks::before_scenario_hook()
(DMore\ChromeDriver\StreamReadException)
BeforeScenario # behat_hooks::before_scenario_hook()
(DMore\ChromeDriver\StreamReadException)
BeforeScenario # behat_hooks::before_scenario_hook()
(DMore\ChromeDriver\StreamReadException)
BeforeScenario # behat_hooks::before_scenario_hook()
(DMore\ChromeDriver\StreamReadException)
BeforeScenario # behat_hooks::before_scenario_hook()
(DMore\ChromeDriver\StreamReadException)
BeforeScenario # behat_hooks::before_scenario_hook()
(DMore\ChromeDriver\StreamReadException)
BeforeScenario # behat_hooks::before_scenario_hook()
(DMore\ChromeDriver\StreamReadException)
BeforeScenario # behat_hooks::before_scenario_hook()
(DMore\ChromeDriver\StreamReadException)
BeforeScenario # behat_hooks::before_scenario_hook()
(DMore\ChromeDriver\StreamReadException)
BeforeScenario # behat_hooks::before_scenario_hook()
(DMore\ChromeDriver\StreamReadException)
BeforeScenario # behat_hooks::before_scenario_hook()
(DMore\ChromeDriver\StreamReadException)
BeforeScenario # behat_hooks::before_scenario_hook()
(DMore\ChromeDriver\StreamReadException)
BeforeScenario # behat_hooks::before_scenario_hook()
(DMore\ChromeDriver\StreamReadException)
BeforeScenario # behat_hooks::before_scenario_hook()
(DMore\ChromeDriver\StreamReadException)
BeforeScenario # behat_hooks::before_scenario_hook()
(DMore\ChromeDriver\StreamReadException)
BeforeScenario # behat_hooks::before_scenario_hook()
(DMore\ChromeDriver\StreamReadException)
BeforeScenario # behat_hooks::before_scenario_hook()
(DMore\ChromeDriver\StreamReadException)
BeforeScenario # behat_hooks::before_scenario_hook()
(DMore\ChromeDriver\StreamReadException)
BeforeScenario # behat_hooks::before_scenario_hook()
(DMore\ChromeDriver\StreamReadException)
BeforeScenario # behat_hooks::before_scenario_hook()
(DMore\ChromeDriver\StreamReadException)
BeforeScenario # behat_hooks::before_scenario_hook()
(DMore\ChromeDriver\StreamReadException)
BeforeScenario # behat_hooks::before_scenario_hook()
(DMore\ChromeDriver\StreamReadException)
BeforeScenario # behat_hooks::before_scenario_hook()
(DMore\ChromeDriver\StreamReadException)
BeforeScenario # behat_hooks::before_scenario_hook()
(DMore\ChromeDriver\StreamReadException)
BeforeScenario # behat_hooks::before_scenario_hook()
(DMore\ChromeDriver\StreamReadException)
BeforeScenario # behat_hooks::before_scenario_hook()
(DMore\ChromeDriver\StreamReadException)
BeforeScenario # behat_hooks::before_scenario_hook()
(DMore\ChromeDriver\StreamReadException)
BeforeScenario # behat_hooks::before_scenario_hook()
(DMore\ChromeDriver\StreamReadException)
BeforeScenario # behat_hooks::before_scenario_hook()
(DMore\ChromeDriver\StreamReadException)
BeforeScenario # behat_hooks::before_scenario_hook()
(DMore\ChromeDriver\StreamReadException)
BeforeScenario # behat_hooks::before_scenario_hook()
(DMore\ChromeDriver\StreamReadException)
BeforeScenario # behat_hooks::before_scenario_hook()
(DMore\ChromeDriver\StreamReadException)
BeforeScenario # behat_hooks::before_scenario_hook()
(DMore\ChromeDriver\StreamReadException)
BeforeScenario # behat_hooks::before_scenario_hook()
(DMore\ChromeDriver\StreamReadException)
BeforeScenario # behat_hooks::before_scenario_hook()
(DMore\ChromeDriver\StreamReadException)
BeforeScenario # behat_hooks::before_scenario_hook()
(DMore\ChromeDriver\StreamReadException)
BeforeScenario # behat_hooks::before_scenario_hook()
(DMore\ChromeDriver\StreamReadException)
BeforeScenario # behat_hooks::before_scenario_hook()
(DMore\ChromeDriver\StreamReadException)
BeforeScenario # behat_hooks::before_scenario_hook()
(DMore\ChromeDriver\StreamReadException)
BeforeScenario # behat_hooks::before_scenario_hook()
(DMore\ChromeDriver\StreamReadException)
BeforeScenario # behat_hooks::before_scenario_hook()
(DMore\ChromeDriver\StreamReadException)
BeforeScenario # behat_hooks::before_scenario_hook()
(DMore\ChromeDriver\StreamReadException)
BeforeScenario # behat_hooks::before_scenario_hook()
(DMore\ChromeDriver\StreamReadException)
BeforeScenario # behat_hooks::before_scenario_hook()
(DMore\ChromeDriver\StreamReadException)
BeforeScenario # behat_hooks::before_scenario_hook()
(DMore\ChromeDriver\StreamReadException)
BeforeScenario # behat_hooks::before_scenario_hook()
(DMore\ChromeDriver\StreamReadException)
BeforeScenario # behat_hooks::before_scenario_hook()
(DMore\ChromeDriver\StreamReadException)
BeforeScenario # behat_hooks::before_scenario_hook()
(DMore\ChromeDriver\StreamReadException)
BeforeScenario # behat_hooks::before_scenario_hook()
(DMore\ChromeDriver\StreamReadException)
BeforeScenario # behat_hooks::before_scenario_hook()
(DMore\ChromeDriver\StreamReadException)
BeforeScenario # behat_hooks::before_scenario_hook()
(DMore\ChromeDriver\StreamReadException)
BeforeScenario # behat_hooks::before_scenario_hook()
(DMore\ChromeDriver\StreamReadException)
BeforeScenario # behat_hooks::before_scenario_hook()
(DMore\ChromeDriver\StreamReadException)
BeforeScenario # behat_hooks::before_scenario_hook()
(DMore\ChromeDriver\StreamReadException)
BeforeScenario # behat_hooks::before_scenario_hook()
(DMore\ChromeDriver\StreamReadException)
BeforeScenario # behat_hooks::before_scenario_hook()
(DMore\ChromeDriver\StreamReadException)
BeforeScenario # behat_hooks::before_scenario_hook()
(DMore\ChromeDriver\StreamReadException)
BeforeScenario # behat_hooks::before_scenario_hook()
(DMore\ChromeDriver\StreamReadException)
BeforeScenario # behat_hooks::before_scenario_hook()
(DMore\ChromeDriver\StreamReadException)
BeforeScenario # behat_hooks::before_scenario_hook()
(DMore\ChromeDriver\StreamReadException)
BeforeScenario # behat_hooks::before_scenario_hook()
(DMore\ChromeDriver\StreamReadException)
BeforeScenario # behat_hooks::before_scenario_hook()
(DMore\ChromeDriver\StreamReadException)
BeforeScenario # behat_hooks::before_scenario_hook()
(DMore\ChromeDriver\StreamReadException)
BeforeScenario # behat_hooks::before_scenario_hook()
(DMore\ChromeDriver\StreamReadException)
BeforeScenario # behat_hooks::before_scenario_hook()
(DMore\ChromeDriver\StreamReadException)
BeforeScenario # behat_hooks::before_scenario_hook()
(DMore\ChromeDriver\StreamReadException)
BeforeScenario # behat_hooks::before_scenario_hook()
(DMore\ChromeDriver\StreamReadException)
BeforeScenario # behat_hooks::before_scenario_hook()
(DMore\ChromeDriver\StreamReadException)
BeforeScenario # behat_hooks::before_scenario_hook()
(DMore\ChromeDriver\StreamReadException)
BeforeScenario # behat_hooks::before_scenario_hook()
(DMore\ChromeDriver\StreamReadException)
BeforeScenario # behat_hooks::before_scenario_hook()
(DMore\ChromeDriver\StreamReadException)
BeforeScenario # behat_hooks::before_scenario_hook()
(DMore\ChromeDriver\StreamReadException)
BeforeScenario # behat_hooks::before_scenario_hook()
(DMore\ChromeDriver\StreamReadException)
BeforeScenario # behat_hooks::before_scenario_hook()
(DMore\ChromeDriver\StreamReadException)
BeforeScenario # behat_hooks::before_scenario_hook()
(DMore\ChromeDriver\StreamReadException)
BeforeScenario # behat_hooks::before_scenario_hook()
(DMore\ChromeDriver\StreamReadException)
BeforeScenario # behat_hooks::before_scenario_hook()
(DMore\ChromeDriver\StreamReadException)
BeforeScenario # behat_hooks::before_scenario_hook()
(DMore\ChromeDriver\StreamReadException)
BeforeScenario # behat_hooks::before_scenario_hook()
(DMore\ChromeDriver\StreamReadException)
BeforeScenario # behat_hooks::before_scenario_hook()
(DMore\ChromeDriver\StreamReadException)
BeforeScenario # behat_hooks::before_scenario_hook()
(DMore\ChromeDriver\StreamReadException)
BeforeScenario # behat_hooks::before_scenario_hook()
(DMore\ChromeDriver\StreamReadException)
BeforeScenario # behat_hooks::before_scenario_hook()
(DMore\ChromeDriver\StreamReadException)
BeforeScenario # behat_hooks::before_scenario_hook()
(DMore\ChromeDriver\StreamReadException)
BeforeScenario # behat_hooks::before_scenario_hook()
(DMore\ChromeDriver\StreamReadException)
BeforeScenario # behat_hooks::before_scenario_hook()
(DMore\ChromeDriver\StreamReadException)
BeforeScenario # behat_hooks::before_scenario_hook()
(DMore\ChromeDriver\StreamReadException)
BeforeScenario # behat_hooks::before_scenario_hook()
(DMore\ChromeDriver\StreamReadException)
BeforeScenario # behat_hooks::before_scenario_hook()
(DMore\ChromeDriver\StreamReadException)
BeforeScenario # behat_hooks::before_scenario_hook()
(DMore\ChromeDriver\StreamReadException)
BeforeScenario # behat_hooks::before_scenario_hook()
(DMore\ChromeDriver\StreamReadException)
BeforeScenario # behat_hooks::before_scenario_hook()
(DMore\ChromeDriver\StreamReadException)
BeforeScenario # behat_hooks::before_scenario_hook()
(DMore\ChromeDriver\StreamReadException)
BeforeScenario # behat_hooks::before_scenario_hook()
(DMore\ChromeDriver\StreamReadException)
BeforeScenario # behat_hooks::before_scenario_hook()
(DMore\ChromeDriver\StreamReadException)
BeforeScenario # behat_hooks::before_scenario_hook()
(DMore\ChromeDriver\StreamReadException)
BeforeScenario # behat_hooks::before_scenario_hook()
(DMore\ChromeDriver\StreamReadException)
BeforeScenario # behat_hooks::before_scenario_hook()
(DMore\ChromeDriver\StreamReadException)
BeforeScenario # behat_hooks::before_scenario_hook()
(DMore\ChromeDriver\StreamReadException)
BeforeScenario # behat_hooks::before_scenario_hook()
(DMore\ChromeDriver\StreamReadException)
BeforeScenario # behat_hooks::before_scenario_hook()
(DMore\ChromeDriver\StreamReadException)
BeforeScenario # behat_hooks::before_scenario_hook()
(DMore\ChromeDriver\StreamReadException)
BeforeScenario # behat_hooks::before_scenario_hook()
(DMore\ChromeDriver\StreamReadException)
BeforeScenario # behat_hooks::before_scenario_hook()
(DMore\ChromeDriver\StreamReadException)
BeforeScenario # behat_hooks::before_scenario_hook()
(DMore\ChromeDriver\StreamReadException)
BeforeScenario # behat_hooks::before_scenario_hook()
(DMore\ChromeDriver\StreamReadException)
BeforeScenario # behat_hooks::before_scenario_hook()
(DMore\ChromeDriver\StreamReadException)
BeforeScenario # behat_hooks::before_scenario_hook()
(DMore\ChromeDriver\StreamReadException)
BeforeScenario # behat_hooks::before_scenario_hook()
(DMore\ChromeDriver\StreamReadException)
BeforeScenario # behat_hooks::before_scenario_hook()
(DMore\ChromeDriver\StreamReadException)
BeforeScenario # behat_hooks::before_scenario_hook()
(DMore\ChromeDriver\StreamReadException)
BeforeScenario # behat_hooks::before_scenario_hook()
(DMore\ChromeDriver\StreamReadException)
BeforeScenario # behat_hooks::before_scenario_hook()
(DMore\ChromeDriver\StreamReadException)
BeforeScenario # behat_hooks::before_scenario_hook()
(DMore\ChromeDriver\StreamReadException)
BeforeScenario # behat_hooks::before_scenario_hook()
(DMore\ChromeDriver\StreamReadException)
BeforeScenario # behat_hooks::before_scenario_hook()
(DMore\ChromeDriver\StreamReadException)
BeforeScenario # behat_hooks::before_scenario_hook()
(DMore\ChromeDriver\StreamReadException)
BeforeScenario # behat_hooks::before_scenario_hook()
(DMore\ChromeDriver\StreamReadException)
BeforeScenario # behat_hooks::before_scenario_hook()
(DMore\ChromeDriver\StreamReadException)
BeforeScenario # behat_hooks::before_scenario_hook()
(DMore\ChromeDriver\StreamReadException)
BeforeScenario # behat_hooks::before_scenario_hook()
(DMore\ChromeDriver\StreamReadException)
BeforeScenario # behat_hooks::before_scenario_hook()
(DMore\ChromeDriver\StreamReadException)
BeforeScenario # behat_hooks::before_scenario_hook()
(DMore\ChromeDriver\StreamReadException)
BeforeScenario # behat_hooks::before_scenario_hook()
(DMore\ChromeDriver\StreamReadException)
BeforeScenario # behat_hooks::before_scenario_hook()
(DMore\ChromeDriver\StreamReadException)
BeforeScenario # behat_hooks::before_scenario_hook()
(DMore\ChromeDriver\StreamReadException)
BeforeScenario # behat_hooks::before_scenario_hook()
(DMore\ChromeDriver\StreamReadException)
BeforeScenario # behat_hooks::before_scenario_hook()
(DMore\ChromeDriver\StreamReadException)
BeforeScenario # behat_hooks::before_scenario_hook()
(DMore\ChromeDriver\StreamReadException)
BeforeScenario # behat_hooks::before_scenario_hook()
(DMore\ChromeDriver\StreamReadException)
BeforeScenario # behat_hooks::before_scenario_hook()
(DMore\ChromeDriver\StreamReadException)
BeforeScenario # behat_hooks::before_scenario_hook()
(DMore\ChromeDriver\StreamReadException)
BeforeScenario # behat_hooks::before_scenario_hook()
(DMore\ChromeDriver\StreamReadException)
BeforeScenario # behat_hooks::before_scenario_hook()
(DMore\ChromeDriver\StreamReadException)
BeforeScenario # behat_hooks::before_scenario_hook()
(DMore\ChromeDriver\StreamReadException)
BeforeScenario # behat_hooks::before_scenario_hook()
(DMore\ChromeDriver\StreamReadException)
BeforeScenario # behat_hooks::before_scenario_hook()
(DMore\ChromeDriver\StreamReadException)
BeforeScenario # behat_hooks::before_scenario_hook()
(DMore\ChromeDriver\StreamReadException)
BeforeScenario # behat_hooks::before_scenario_hook()
(DMore\ChromeDriver\StreamReadException)
BeforeScenario # behat_hooks::before_scenario_hook()
(DMore\ChromeDriver\StreamReadException)
BeforeScenario # behat_hooks::before_scenario_hook()
(DMore\ChromeDriver\StreamReadException)
BeforeScenario # behat_hooks::before_scenario_hook()
(DMore\ChromeDriver\StreamReadException)
BeforeScenario # behat_hooks::before_scenario_hook()
(DMore\ChromeDriver\StreamReadException)
BeforeScenario # behat_hooks::before_scenario_hook()
(DMore\ChromeDriver\StreamReadException)
BeforeScenario # behat_hooks::before_scenario_hook()
(DMore\ChromeDriver\StreamReadException)
BeforeScenario # behat_hooks::before_scenario_hook()
(DMore\ChromeDriver\StreamReadException)
BeforeScenario # behat_hooks::before_scenario_hook()
(DMore\ChromeDriver\StreamReadException)
--- Failed steps:
001 Scenario: Complete non anonymous feedback and view analysis on the front page as an authenticated user # /var/www/html/mod/feedback/tests/behat/non_anonymous.feature:64
And I add a "Multiple choice" question to the feedback with: # /var/www/html/mod/feedback/tests/behat/non_anonymous.feature:33
Field matching locator "'Add question'" not found. (Behat\Mink\Exception\ElementNotFoundException)
002 Scenario: Non anonymous feedback in a course # /var/www/html/mod/feedback/tests/behat/non_anonymous.feature:110
And I add a "Multiple choice" question to the feedback with: # /var/www/html/mod/feedback/tests/behat/non_anonymous.feature:33
Moodle exception: Web service is not available (it doesn't exist or might be disabled) File: /lib/externallib.php Line: 214 Stack trace: Error code: servicenotavailable* line 214 of /lib/externallib.php: moodle_exception thrown* line 59 of /lib/ajax/service.php: call to external_api::call_external_function()Error code: servicenotavailable* line 214 of /lib/externallib.php: moodle_exception thrown* line 59 of /lib/ajax/service.php: call to external_api::call_external_function()
Web service is not available (it doesn't exist or might be disabled) (Exception)
003 Scenario: User navigates to preferences page # /var/www/html/message/output/popup/tests/behat/notification_popover_preferences.feature:13
And I open the notification popover # /var/www/html/message/output/popup/tests/behat/notification_popover_preferences.feature:15
Moodle exception: Web service is not available (it doesn't exist or might be disabled) File: /lib/externallib.php Line: 214 Stack trace: Error code: servicenotavailable* line 214 of /lib/externallib.php: moodle_exception thrown* line 59 of /lib/ajax/service.php: call to external_api::call_external_function()Error code: servicenotavailable* line 214 of /lib/externallib.php: moodle_exception thrown* line 59 of /lib/ajax/service.php: call to external_api::call_external_function()
Web service is not available (it doesn't exist or might be disabled) (Exception)
004 Scenario: Notification popover shows correct unread count # /var/www/html/message/output/popup/tests/behat/notification_popover_unread.feature:45
And I add a "Assignment" to section "1" and I fill the form with: # /var/www/html/message/output/popup/tests/behat/notification_popover_unread.feature:29
Xpath matching locator "//li[@id='section-1']/descendant::div[contains(concat(' ', normalize-space(@class) , ' '), ' section-modchooser ')]/span/a" not found. (Behat\Mink\Exception\ElementNotFoundException)
005 Scenario: Clicking a notification marks it as read # /var/www/html/message/output/popup/tests/behat/notification_popover_unread.feature:55
And I add a "Assignment" to section "1" and I fill the form with: # /var/www/html/message/output/popup/tests/behat/notification_popover_unread.feature:29
Xpath matching locator "//li[@id='section-1']/descendant::div[contains(concat(' ', normalize-space(@class) , ' '), ' section-modchooser ')]/span/a" not found. (Behat\Mink\Exception\ElementNotFoundException)
006 Scenario: Mark all notifications as read # /var/www/html/message/output/popup/tests/behat/notification_popover_unread.feature:64
And I add a "Assignment" to section "1" and I fill the form with: # /var/www/html/message/output/popup/tests/behat/notification_popover_unread.feature:29
Xpath matching locator "//li[@id='section-1']/descendant::div[contains(concat(' ', normalize-space(@class) , ' '), ' section-modchooser ')]/span/a" not found. (Behat\Mink\Exception\ElementNotFoundException)
007 Scenario: Submit a text online and edit the submission # /var/www/html/mod/assign/tests/behat/online_submissions.feature:8
And I am on "Course 1" course homepage with editing mode on # /var/www/html/mod/assign/tests/behat/online_submissions.feature:21
Page administration menu is not found not found. (Behat\Mink\Exception\ElementNotFoundException)
008 Scenario: Auto-draft save online text submission # /var/www/html/mod/assign/tests/behat/online_submissions.feature:53
And I add a "Assignment" to section "1" and I fill the form with: # /var/www/html/mod/assign/tests/behat/online_submissions.feature:69
Xpath matching locator "//li[@id='section-1']/descendant::div[contains(concat(' ', normalize-space(@class) , ' '), ' section-modchooser ')]/span/a" not found. (Behat\Mink\Exception\ElementNotFoundException)
009 Scenario: Make a list from some text # /var/www/html/lib/editor/atto/plugins/orderedlist/tests/behat/orderedlist.feature:6
And I open my profile in edit mode # /var/www/html/lib/editor/atto/plugins/orderedlist/tests/behat/orderedlist.feature:8
Coding error detected, it must be fixed by a programmer: failed to get moodle session (coding_exception)
010 Scenario: Giving an outcome to a student # /var/www/html/mod/assign/tests/behat/outcome_grading.feature:43
And I navigate to "Outcomes" node in "Site administration > Grades" # /var/www/html/mod/assign/tests/behat/outcome_grading.feature:30
Xpath matching locator "//button[contains(@data-action,'toggle-drawer')]" not found. (Behat\Mink\Exception\ElementNotFoundException)
011 Scenario: Giving an outcome to a group submission # /var/www/html/mod/assign/tests/behat/outcome_grading.feature:75
And I navigate to "Scales" node in "Site administration > Grades" # /var/www/html/mod/assign/tests/behat/outcome_grading.feature:24
Moodle exception: Web service is not available (it doesn't exist or might be disabled) File: /lib/externallib.php Line: 214 Stack trace: Error code: servicenotavailable* line 214 of /lib/externallib.php: moodle_exception thrown* line 59 of /lib/ajax/service.php: call to external_api::call_external_function()Error code: servicenotavailable* line 214 of /lib/externallib.php: moodle_exception thrown* line 59 of /lib/ajax/service.php: call to external_api::call_external_function()
Web service is not available (it doesn't exist or might be disabled) (Exception)
012 Scenario: Override a permission # /var/www/html/admin/roles/tests/behat/override_roles_highlighting.feature:14
And I navigate to "Users > Permissions" in current page administration # /var/www/html/admin/roles/tests/behat/override_roles_highlighting.feature:16
Moodle exception: Web service is not available (it doesn't exist or might be disabled) File: /lib/externallib.php Line: 214 Stack trace: Error code: servicenotavailable* line 214 of /lib/externallib.php: moodle_exception thrown* line 59 of /lib/ajax/service.php: call to external_api::call_external_function()Error code: servicenotavailable* line 214 of /lib/externallib.php: moodle_exception thrown* line 59 of /lib/ajax/service.php: call to external_api::call_external_function()
Web service is not available (it doesn't exist or might be disabled) (Exception)
013 Scenario: Upload a file in filemanager and overwrite it # /var/www/html/repository/tests/behat/overwrite_file.feature:8
And I upload "lib/tests/fixtures/empty.txt" file to "Files" filemanager # /var/www/html/repository/tests/behat/overwrite_file.feature:20
"Files" filepicker can not be found (Behat\Mink\Exception\ExpectationException)
014 Scenario: Wiki page edition history changes list # /var/www/html/mod/wiki/tests/behat/page_history.feature:8
And I add a "Wiki" to section "1" and I fill the form with: # /var/www/html/mod/wiki/tests/behat/page_history.feature:24
Xpath matching locator "//li[@id='section-1']/descendant::div[contains(concat(' ', normalize-space(@class) , ' '), ' section-modchooser ')]/span/a" not found. (Behat\Mink\Exception\ElementNotFoundException)
015 Example: | topics | "Topic 1" | "Topic 2" | "Topic 3" | "Topic 0" | "Topic 4" | # /var/www/html/course/tests/behat/paged_course_navigation.feature:38
And I should see "Topic 2" in the "div.single-section" "css_element" # /var/www/html/course/tests/behat/paged_course_navigation.feature:23
Css matching locator "div.single-section" not found. (Behat\Mink\Exception\ElementNotFoundException)
016 Example: | weeks | "1 January - 7 January" | "8 January - 14 January" | "15 January - 21 January" | "25 December - 31 December" | "22 January - 28 January" | # /var/www/html/course/tests/behat/paged_course_navigation.feature:39
And I follow "C1" # /var/www/html/course/tests/behat/paged_course_navigation.feature:15
Link matching locator "'C1'" not found. (Behat\Mink\Exception\ElementNotFoundException)
017 Scenario: Course participants link is displayed to enrolled students after expanding the course node # /var/www/html/blocks/navigation/tests/behat/participants_link.feature:29
And I add the "Navigation" block if not present # /var/www/html/blocks/navigation/tests/behat/participants_link.feature:21
Xpath matching locator "//button[contains(@data-action,'toggle-drawer')]" not found. (Behat\Mink\Exception\ElementNotFoundException)
018 Scenario: Site participants link is not displayed to students (MDL-55667) # /var/www/html/blocks/navigation/tests/behat/participants_link.feature:47
And I turn editing mode on # /var/www/html/blocks/navigation/tests/behat/participants_link.feature:20
Page administration menu is not found not found. (Behat\Mink\Exception\ElementNotFoundException)
019 Scenario: Create a learning plan based on template # /var/www/html/admin/tool/lp/tests/behat/plan_crud.feature:24
And I click on ".form-autocomplete-downarrow" "css_element" # /var/www/html/admin/tool/lp/tests/behat/plan_crud.feature:31
Css matching locator ".form-autocomplete-downarrow" not found. (Behat\Mink\Exception\ElementNotFoundException)
020 Scenario: Create a learning plan from template cohort # /var/www/html/admin/tool/lp/tests/behat/plan_crud.feature:37
And I click on ".template-cohorts" "css_element" in the "Science template cohort" "table_row" # /var/www/html/admin/tool/lp/tests/behat/plan_crud.feature:54
Table_row matching locator "'Science template cohort'" not found. (Behat\Mink\Exception\ElementNotFoundException)
021 Scenario: Manage a learning plan competencies # /var/www/html/admin/tool/lp/tests/behat/plan_crud.feature:74
Then I should see "Learning plans" # /var/www/html/admin/tool/lp/tests/behat/plan_crud.feature:11
Moodle exception: Web service is not available (it doesn't exist or might be disabled) File: /lib/externallib.php Line: 214 Stack trace: Error code: servicenotavailable* line 214 of /lib/externallib.php: moodle_exception thrown* line 59 of /lib/ajax/service.php: call to external_api::call_external_function()Error code: servicenotavailable* line 214 of /lib/externallib.php: moodle_exception thrown* line 59 of /lib/ajax/service.php: call to external_api::call_external_function()
Web service is not available (it doesn't exist or might be disabled) (Exception)
022 Scenario: Edit a learning plan # /var/www/html/admin/tool/lp/tests/behat/plan_crud.feature:100
When I follow "Profile" in the user menu # /var/www/html/admin/tool/lp/tests/behat/plan_crud.feature:10
Xpath matching locator "//div[@class='usermenu']//a[contains(concat(' ', @class, ' '), ' dropdown-toggle ')]" not found. (Behat\Mink\Exception\ElementNotFoundException)
023 Scenario: User can manages his own plan draft # /var/www/html/admin/tool/lp/tests/behat/plan_workflow.feature:58
And I set the following system permissions of "User manage own draft plan role" role: # /var/www/html/admin/tool/lp/tests/behat/plan_workflow.feature:41
Link "Users > Permissions > Define roles"" not found on the page not found. (Behat\Mink\Exception\ElementNotFoundException)
024 Scenario: User can manages his own plan # /var/www/html/admin/tool/lp/tests/behat/plan_workflow.feature:71
And I set the following system permissions of "User manage own draft plan role" role: # /var/www/html/admin/tool/lp/tests/behat/plan_workflow.feature:41
Moodle exception: Web service is not available (it doesn't exist or might be disabled) File: /lib/externallib.php Line: 214 Stack trace: Error code: servicenotavailable* line 214 of /lib/externallib.php: moodle_exception thrown* line 59 of /lib/ajax/service.php: call to external_api::call_external_function()Error code: servicenotavailable* line 214 of /lib/externallib.php: moodle_exception thrown* line 59 of /lib/ajax/service.php: call to external_api::call_external_function()
Web service is not available (it doesn't exist or might be disabled) (Exception)
025 Scenario: Manager can see learning plan with status waiting for review # /var/www/html/admin/tool/lp/tests/behat/plan_workflow.feature:94
And I set the following system permissions of "User manage own draft plan role" role: # /var/www/html/admin/tool/lp/tests/behat/plan_workflow.feature:41
Xpath matching locator "//input[@name="moodle/competency:planmanageowndraft" and @value="1"]" not found. (Behat\Mink\Exception\ElementNotFoundException)
026 Scenario: Manager can start review of learning plan with status waiting for review # /var/www/html/admin/tool/lp/tests/behat/plan_workflow.feature:104
And I set the following system permissions of "User manage own plan role" role: # /var/www/html/admin/tool/lp/tests/behat/plan_workflow.feature:44
Link matching locator "Site administration" in the "#nav-drawer" "css_element"" not found. (Behat\Mink\Exception\ElementNotFoundException)
027 Scenario: Manager can reject a learning plan with status in review # /var/www/html/admin/tool/lp/tests/behat/plan_workflow.feature:116
And I set the following system permissions of "User manage own draft plan role" role: # /var/www/html/admin/tool/lp/tests/behat/plan_workflow.feature:41
Link matching locator "'Edit User manage own draft plan role role'" not found. (Behat\Mink\Exception\ElementNotFoundException)
028 Scenario: Manager can accept a learning plan with status in review # /var/www/html/admin/tool/lp/tests/behat/plan_workflow.feature:129
And I set the following system permissions of "User manage own draft plan role" role: # /var/www/html/admin/tool/lp/tests/behat/plan_workflow.feature:41
Link matching locator "Site administration" in the "#nav-drawer" "css_element"" not found. (Behat\Mink\Exception\ElementNotFoundException)
029 Scenario: Manager send back to draft an active learning plan # /var/www/html/admin/tool/lp/tests/behat/plan_workflow.feature:142
And I set the following system permissions of "User manage own draft plan role" role: # /var/www/html/admin/tool/lp/tests/behat/plan_workflow.feature:41
Moodle exception: Web service is not available (it doesn't exist or might be disabled) File: /lib/externallib.php Line: 214 Stack trace: Error code: servicenotavailable* line 214 of /lib/externallib.php: moodle_exception thrown* line 59 of /lib/ajax/service.php: call to external_api::call_external_function()Error code: servicenotavailable* line 214 of /lib/externallib.php: moodle_exception thrown* line 59 of /lib/ajax/service.php: call to external_api::call_external_function()
Web service is not available (it doesn't exist or might be disabled) (Exception)
030 Scenario: Manager change an active learning plan to completed # /var/www/html/admin/tool/lp/tests/behat/plan_workflow.feature:161
And I set the following system permissions of "User manage own draft plan role" role: # /var/www/html/admin/tool/lp/tests/behat/plan_workflow.feature:41
Link matching locator "Site administration" in the "#nav-drawer" "css_element"" not found. (Behat\Mink\Exception\ElementNotFoundException)
031 Scenario: Manager reopen a complete learning plan # /var/www/html/admin/tool/lp/tests/behat/plan_workflow.feature:183
And I set the following system permissions of "User manage own draft plan role" role: # /var/www/html/admin/tool/lp/tests/behat/plan_workflow.feature:41
Moodle exception: Web service is not available (it doesn't exist or might be disabled) File: /lib/externallib.php Line: 214 Stack trace: Error code: servicenotavailable* line 214 of /lib/externallib.php: moodle_exception thrown* line 59 of /lib/ajax/service.php: call to external_api::call_external_function()Error code: servicenotavailable* line 214 of /lib/externallib.php: moodle_exception thrown* line 59 of /lib/ajax/service.php: call to external_api::call_external_function()
Web service is not available (it doesn't exist or might be disabled) (Exception)
032 Scenario: Replying to a blog post or editing it does not affect its display order # /var/www/html/mod/forum/tests/behat/posts_ordering_blog.feature:33
And I add a "Forum" to section "1" and I fill the form with: # /var/www/html/mod/forum/tests/behat/posts_ordering_blog.feature:21
Xpath matching locator "//li[@id='section-1']/descendant::div[contains(concat(' ', normalize-space(@class) , ' '), ' section-modchooser ')]/span/a" not found. (Behat\Mink\Exception\ElementNotFoundException)
033 Scenario: Replying to a forum post or editing it puts the discussion to the front # /var/www/html/mod/forum/tests/behat/posts_ordering_general.feature:33
And I am on "Course 1" course homepage with editing mode on # /var/www/html/mod/forum/tests/behat/posts_ordering_general.feature:20
Moodle exception: Web service is not available (it doesn't exist or might be disabled) File: /lib/externallib.php Line: 214 Stack trace: Error code: servicenotavailable* line 214 of /lib/externallib.php: moodle_exception thrown* line 59 of /lib/ajax/service.php: call to external_api::call_external_function()Error code: servicenotavailable* line 214 of /lib/externallib.php: moodle_exception thrown* line 59 of /lib/ajax/service.php: call to external_api::call_external_function()
Web service is not available (it doesn't exist or might be disabled) (Exception)
034 Scenario: Prevent duplicate entries # /var/www/html/mod/glossary/tests/behat/prevent_duplicate_entries.feature:8
And I add a "Glossary" to section "1" and I fill the form with: # /var/www/html/mod/glossary/tests/behat/prevent_duplicate_entries.feature:20
Xpath matching locator "//li[@id='section-1']/descendant::div[contains(concat(' ', normalize-space(@class) , ' '), ' section-modchooser ')]/span/a" not found. (Behat\Mink\Exception\ElementNotFoundException)
035 Scenario: Preventing changes and allowing them again # /var/www/html/mod/assign/tests/behat/prevent_submission_changes.feature:23
And I add a "Assignment" to section "1" and I fill the form with: # /var/www/html/mod/assign/tests/behat/prevent_submission_changes.feature:26
Moodle exception: Sorry, but your session key could not be confirmed to carry out this action. This security feature prevents against accidental or malicious execution of important functions in your name. Please make sure you really wanted to execute this function. More information about this error
×
Debug info:
Error code: confirmsesskeybad
×
Stack trace:
line 503 of /lib/setuplib.php: moodle_exception thrown
line 34 of /course/jumpto.php: call to print_error()
(Exception)
036 Scenario: Preventing changes and allowing them again (batch action) # /var/www/html/mod/assign/tests/behat/prevent_submission_changes.feature:77
And I click on "Go" "button" confirming the dialogue # /var/www/html/mod/assign/tests/behat/prevent_submission_changes.feature:102
Fatal error: Call to undefined method DMore\ChromeDriver\ChromeDriver::getWebDriverSession() (Behat\Testwork\Call\Exception\FatalThrowableError)
037 Scenario: Preview a question using the mouse. # /var/www/html/question/type/ddimageortext/tests/behat/preview.feature:28
And I navigate to "Question bank" node in "Course administration" # /var/www/html/question/type/ddimageortext/tests/behat/preview.feature:25
Xpath matching locator "//header//div[@id='page-navbar']//a[contains(@href,'/course/view.php?id=')]" not found. (Behat\Mink\Exception\ElementNotFoundException)
038 Scenario: Preview a question using the mouse. # /var/www/html/question/type/ddmarker/tests/behat/preview.feature:28
Then the state of "Please place the markers on the map of Milton Keynes" question is shown as "Correct" # /var/www/html/question/type/ddmarker/tests/behat/preview.feature:41
Question "Please place the markers on the map of Milton Keynes" state is not "Correct" (Behat\Mink\Exception\ExpectationException)
039 Scenario: questions with images in answers and responses # /var/www/html/mod/lesson/tests/behat/questions_images.feature:7
And I click on "Save changes" "button" # /var/www/html/mod/lesson/tests/behat/questions_images.feature:22
Javascript code and/or AJAX requests are not ready after 10 seconds. There is a Javascript error or the code is extremely slow. (Exception)
394 scenarios (185 passed, 39 failed, 170 skipped)
9593 steps (4510 passed, 39 failed, 5044 skipped)
41m49.70s (44.72Mb)
Exit codes for each behat run:
behatrun1: 1
behatrun2: 1
behatrun3: 1
behatrun4: 1
To re-run failed processes, you can use following command:
php admin/tool/behat/cli/run.php --rerun
Sign up for free to join this conversation on GitHub. Already have an account? Sign in to comment