Skip to content

Instantly share code, notes, and snippets.

@drumnation
Created Aug 5, 2019
Embed
What would you like to do?
> Task :app:installRelease
01:20:03 V/ddms: execute: running am get-configcript > Resolve files of :react-native-onesignal:relea
01:20:03 V/ddms: execute 'am get-config' on 'ce07171754cb3a3a017e' : EOF hit. Read: -1
01:20:04 V/ddms: execute: returning
Installing APK 'app-release.apk' on 'SM-N950U - 9' for app:releasees of :react-native-onesignal:relea
01:20:04 D/app-release.apk: Uploading app-release.apk onto device 'ce07171754cb3a3a017e'
01:20:04 D/Device: Uploading file onto device 'ce07171754cb3a3a017e'
01:20:04 D/ddms: Reading file permision of /Users/davidmieloch/Dev/dray/dnp-mobile/android/app/build/o
utputs/apk/release/app-release.apk as: rw-r--r--
01:20:07 V/ddms: execute: running pm install -r -t "/data/local/tmp/app-release.apk"
01:20:10 V/ddms: execute 'pm install -r -t "/data/local/tmp/app-release.apk"' on 'ce07171754cb3a3a017e
' : EOF hit. Read: -1
01:20:10 V/ddms: execute: returning
Unable to install /Users/davidmieloch/Dev/dray/dnp-mobile/android/app/build/outputs/apk/release/app-re
lease.apk
com.android.ddmlib.InstallException: Unknown failure: Exception occurred while executing:
android.os.ParcelableException: java.io.IOException: Requested internal only, but not enough space
at android.util.ExceptionUtils.wrap(ExceptionUtils.java:34)
at com.android.server.pm.PackageInstallerService.createSession(PackageInstallerService.java:501)
at com.android.server.pm.PackageManagerShellCommand.doCreateSession(PackageManagerShellCommand.java:24
15)
at com.android.server.pm.PackageManagerShellCommand.runInstall(PackageManagerShellCommand.java:907)
at com.android.server.pm.PackageManagerShellCommand.onCommand(PackageManagerShellCommand.java:158)
at android.os.ShellCommand.exec(ShellCommand.java:103)
at com.android.server.pm.PackageManagerService.onShellCommand(PackageManagerService.java:25990)
at android.os.Binder.shellCommand(Binder.java:642)
at android.os.Binder.onTransact(Binder.java:540)
at android.content.pm.IPackageManager$Stub.onTransact(IPackageManager.java:3329)
at com.android.server.pm.PackageManagerService.onTransact(PackageManagerService.java:4763)
at android.os.Binder.execTransact(Binder.java:739)
Caused by: java.io.IOException: Requested internal only, but not enough space
at com.android.internal.content.PackageHelper.resolveInstallVolume(PackageHelper.java:531)
at com.android.internal.content.PackageHelper.resolveInstallVolume(PackageHelper.java:447)
at com.android.internal.content.PackageHelper.resolveInstallVolume(PackageHelper.java:462)
at com.android.server.pm.PackageInstallerService.createSessionInternal(PackageInstallerService.java:657)
at com.android.server.pm.PackageInstallerService.createSession(PackageInstallerService.java:499)
... 10 more
at com.android.ddmlib.Device.installRemotePackage(Device.java:1022)
at com.android.ddmlib.Device.installPackage(Device.java:903)
at com.android.ddmlib.Device.installPackage(Device.java:881)
at com.android.ddmlib.Device.installPackage(Device.java:870)
at com.android.builder.testing.ConnectedDevice.installPackage(ConnectedDevice.java:126)
at com.android.build.gradle.internal.tasks.InstallVariantTask.install(InstallVariantTask.java:179)
at com.android.build.gradle.internal.tasks.InstallVariantTask.install(InstallVariantTask.java:110)
at java.base/jdk.internal.reflect.NativeMethodAccessorImpl.invoke0(Native Method)
at java.base/jdk.internal.reflect.NativeMethodAccessorImpl.invoke(NativeMethodAccessorImpl.java:62)
at java.base/jdk.internal.reflect.DelegatingMethodAccessorImpl.invoke(DelegatingMethodAccessorImpl.java:43)
at org.gradle.internal.reflect.JavaMethod.invoke(JavaMethod.java:73)
at org.gradle.api.internal.project.taskfactory.StandardTaskAction.doExecute(StandardTaskAction.java:46)
at org.gradle.api.internal.project.taskfactory.StandardTaskAction.execute(StandardTaskAction.java:39)
at org.gradle.api.internal.project.taskfactory.StandardTaskAction.execute(StandardTaskAction.java:26)
at org.gradle.api.internal.AbstractTask$TaskActionWrapper.execute(AbstractTask.java:801)
at org.gradle.api.internal.AbstractTask$TaskActionWrapper.execute(AbstractTask.java:768)
at org.gradle.api.internal.tasks.execution.ExecuteActionsTaskExecuter$1.run(ExecuteActionsTaskExecuter.java:131)
at org.gradle.internal.operations.DefaultBuildOperationExecutor$RunnableBuildOperationWorker.execute(DefaultBuildOperationExecutor.java:300)
at org.gradle.internal.operations.DefaultBuildOperationExecutor$RunnableBuildOperationWorker.execute(DefaultBuildOperationExecutor.java:292)
at org.gradle.internal.operations.DefaultBuildOperationExecutor.execute(DefaultBuildOperationExecutor.java:174)
at org.gradle.internal.operations.DefaultBuildOperationExecutor.run(DefaultBuildOperationExecutor.java:90)
at org.gradle.internal.operations.DelegatingBuildOperationExecutor.run(DelegatingBuildOperationExecutor.java:31)
at org.gradle.api.internal.tasks.execution.ExecuteActionsTaskExecuter.executeAction(ExecuteActionsTaskExecuter.java:120)
at org.gradle.api.internal.tasks.execution.ExecuteActionsTaskExecuter.executeActions(ExecuteActionsTaskExecuter.java:99)
at org.gradle.api.internal.tasks.execution.ExecuteActionsTaskExecuter.execute(ExecuteActionsTaskExecuter.java:77)
at org.gradle.api.internal.tasks.execution.OutputDirectoryCreatingTaskExecuter.execute(OutputDirectoryCreatingTaskExecuter.java:51)
at org.gradle.api.internal.tasks.execution.SkipUpToDateTaskExecuter.execute(SkipUpToDateTaskExecuter.java:59)
at org.gradle.api.internal.tasks.execution.ResolveTaskOutputCachingStateExecuter.execute(ResolveTaskOutputCachingStateExecuter.java:54)
at org.gradle.api.internal.tasks.execution.ValidatingTaskExecuter.execute(ValidatingTaskExecuter.java:59)
at org.gradle.api.internal.tasks.execution.SkipEmptySourceFilesTaskExecuter.execute(SkipEmptySourceFilesTaskExecuter.java:101)
at org.gradle.api.internal.tasks.execution.FinalizeInputFilePropertiesTaskExecuter.execute(FinalizeInputFilePropertiesTaskExecuter.java:44)
at org.gradle.api.internal.tasks.execution.CleanupStaleOutputsExecuter.execute(CleanupStaleOutputsExecuter.java:91)
at org.gradle.api.internal.tasks.execution.ResolveTaskArtifactStateTaskExecuter.execute(ResolveTaskArtifactStateTaskExecuter.java:62)
at org.gradle.api.internal.tasks.execution.SkipTaskWithNoActionsExecuter.execute(SkipTaskWithNoActionsExecuter.java:59)
at org.gradle.api.internal.tasks.execution.SkipOnlyIfTaskExecuter.execute(SkipOnlyIfTaskExecuter.java:54)
at org.gradle.api.internal.tasks.execution.ExecuteAtMostOnceTaskExecuter.execute(ExecuteAtMostOnceTaskExecuter.java:43)
at org.gradle.api.internal.tasks.execution.CatchExceptionTaskExecuter.execute(CatchExceptionTaskExecuter.java:34)
at org.gradle.api.internal.tasks.execution.EventFiringTaskExecuter$1.run(EventFiringTaskExecuter.java:51)
at org.gradle.internal.operations.DefaultBuildOperationExecutor$RunnableBuildOperationWorker.execute(DefaultBuildOperationExecutor.java:300)
at org.gradle.internal.operations.DefaultBuildOperationExecutor$RunnableBuildOperationWorker.execute(DefaultBuildOperationExecutor.java:292)
at org.gradle.internal.operations.DefaultBuildOperationExecutor.execute(DefaultBuildOperationExecutor.java:174)
at org.gradle.internal.operations.DefaultBuildOperationExecutor.run(DefaultBuildOperationExecutor.java:90)
at org.gradle.internal.operations.DelegatingBuildOperationExecutor.run(DelegatingBuildOperationExecutor.java:31)
at org.gradle.api.internal.tasks.execution.EventFiringTaskExecuter.execute(EventFiringTaskExecuter.java:46)
at org.gradle.execution.taskgraph.LocalTaskInfoExecutor.execute(LocalTaskInfoExecutor.java:42)
at org.gradle.execution.taskgraph.DefaultTaskExecutionGraph$BuildOperationAwareWorkItemExecutor.execute(DefaultTaskExecutionGraph.java:277)
at org.gradle.execution.taskgraph.DefaultTaskExecutionGraph$BuildOperationAwareWorkItemExecutor.execute(DefaultTaskExecutionGraph.java:262)
at org.gradle.execution.taskgraph.DefaultTaskPlanExecutor$ExecutorWorker$1.execute(DefaultTaskPlanExecutor.java:135)
at org.gradle.execution.taskgraph.DefaultTaskPlanExecutor$ExecutorWorker$1.execute(DefaultTaskPlanExecutor.java:130)
at org.gradle.execution.taskgraph.DefaultTaskPlanExecutor$ExecutorWorker.execute(DefaultTaskPlanExecutor.java:200)
at org.gradle.execution.taskgraph.DefaultTaskPlanExecutor$ExecutorWorker.executeWithWork(DefaultTaskPlanExecutor.java:191)
at org.gradle.execution.taskgraph.DefaultTaskPlanExecutor$ExecutorWorker.run(DefaultTaskPlanExecutor.java:130)
at org.gradle.internal.concurrent.ExecutorPolicy$CatchAndRecordFailures.onExecute(ExecutorPolicy.java:63)
at org.gradle.internal.concurrent.ManagedExecutorImpl$1.run(ManagedExecutorImpl.java:46)
at org.gradle.internal.concurrent.ThreadFactoryImpl$ManagedThreadRunnable.run(ThreadFactoryImpl.java:55)
> Task :app:installRelease FAILED
FAILURE: Build failed with an exception.
* What went wrong:
Execution failed for task ':app:installRelease'.
> com.android.builder.testing.api.DeviceException: com.android.ddmlib.InstallException: Unknown failure: Exception occurred while executing:
android.os.ParcelableException: java.io.IOException: Requested internal only, but not enough space
at android.util.ExceptionUtils.wrap(ExceptionUtils.java:34)
at com.android.server.pm.PackageInstallerService.createSession(PackageInstallerService.java:501)
at com.android.server.pm.PackageManagerShellCommand.doCreateSession(PackageManagerShellCommand.java:2415)
at com.android.server.pm.PackageManagerShellCommand.runInstall(PackageManagerShellCommand.java:907)
at com.android.server.pm.PackageManagerShellCommand.onCommand(PackageManagerShellCommand.java:158)
at android.os.ShellCommand.exec(ShellCommand.java:103)
at com.android.server.pm.PackageManagerService.onShellCommand(PackageManagerService.java:25990)
at android.os.Binder.shellCommand(Binder.java:642)
at android.os.Binder.onTransact(Binder.java:540)
at android.content.pm.IPackageManager$Stub.onTransact(IPackageManager.java:3329)
at com.android.server.pm.PackageManagerService.onTransact(PackageManagerService.java:4763)
at android.os.Binder.execTransact(Binder.java:739)
Caused by: java.io.IOException: Requested internal only, but not enough space
at com.android.internal.content.PackageHelper.resolveInstallVolume(PackageHelper.java:531)
at com.android.internal.content.PackageHelper.resolveInstallVolume(PackageHelper.java:447)
at com.android.internal.content.PackageHelper.resolveInstallVolume(PackageHelper.java:462)
at com.android.server.pm.PackageInstallerService.createSessionInternal(PackageInstallerService.java:657)
at com.android.server.pm.PackageInstallerService.createSession(PackageInstallerService.java:499)
... 10 more
* Try:
Run with --stacktrace option to get the stack trace. Run with --info or --debug option to get more log output. Run with --scan to get full insights.
* Get more help at https://help.gradle.org
Deprecated Gradle features were used in this build, making it incompatible with Gradle 5.0.
Use '--warning-mode all' to show the individual deprecation warnings.
See https://docs.gradle.org/4.10.1/userguide/command_line_interface.html#sec:command_line_warnings
Sign up for free to join this conversation on GitHub. Already have an account? Sign in to comment