Skip to content

Instantly share code, notes, and snippets.

Embed
What would you like to do?
telemetry fail for --browser=cros-chrome-guest
dshwang:src(gbm_one_copy2)> tools/perf/run_benchmark --browser=cros-chrome-guest --remote=10.237.104.237 smoothness.tough_texture_upload_cases --results-label=ʺzero-copyʺ --story-filter=background_color_animation.html
[ RUN ] background_color_animation.html
Traceback (most recent call last):
File "/home/dshwang/chromium/src/tools/telemetry/telemetry/internal/story_runner.py", line 83, in _RunStoryAndProcessErrorIfNeeded
state.RunStory(results)
File "/home/dshwang/chromium/src/tools/telemetry/telemetry/page/shared_page_state.py", line 298, in RunStory
self._current_page.Run(self)
File "/home/dshwang/chromium/src/tools/telemetry/telemetry/page/__init__.py", line 83, in Run
shared_state.page_test.WillNavigateToPage(self, current_tab)
File "/home/dshwang/chromium/src/tools/perf/measurements/smoothness.py", line 56, in WillNavigateToPage
self._tbm.WillRunStory(tab.browser.platform)
File "/home/dshwang/chromium/src/tools/telemetry/telemetry/web_perf/timeline_based_measurement.py", line 256, in WillRunStory
if not platform.tracing_controller.IsChromeTracingSupported():
File "/home/dshwang/chromium/src/tools/telemetry/telemetry/core/tracing_controller.py", line 40, in IsChromeTracingSupported
return self._tracing_controller_backend.IsChromeTracingSupported()
File "/home/dshwang/chromium/src/tools/telemetry/telemetry/internal/platform/tracing_controller_backend.py", line 94, in IsChromeTracingSupported
self._platform_backend)
File "/home/dshwang/chromium/src/tools/telemetry/telemetry/internal/platform/tracing_agent/chrome_tracing_agent.py", line 61, in IsSupported
return chrome_tracing_devtools_manager.IsSupported(platform_backend)
File "/home/dshwang/chromium/src/tools/telemetry/telemetry/internal/platform/tracing_agent/chrome_tracing_devtools_manager.py", line 42, in IsSupported
if devtools_client.IsChromeTracingSupported():
File "/home/dshwang/chromium/src/tools/telemetry/telemetry/internal/backends/chrome_inspector/devtools_client_backend.py", line 295, in IsChromeTracingSupported
return self._tracing_backend.IsTracingSupported()
File "/home/dshwang/chromium/src/tools/telemetry/telemetry/decorators.py", line 34, in Cacher
cacher.__cache[key] = obj(*args, **kwargs)
File "/home/dshwang/chromium/src/tools/telemetry/telemetry/internal/backends/chrome_inspector/tracing_backend.py", line 244, in IsTracingSupported
res = self._inspector_websocket.SyncRequest(req)
File "/home/dshwang/chromium/src/tools/telemetry/telemetry/internal/backends/chrome_inspector/inspector_websocket.py", line 107, in SyncRequest
res = self._Receive(timeout)
File "/home/dshwang/chromium/src/tools/telemetry/telemetry/internal/backends/chrome_inspector/inspector_websocket.py", line 143, in _Receive
data = self._socket.recv()
File "/home/dshwang/chromium/src/tools/telemetry/third_party/websocket-client/websocket.py", line 596, in recv
opcode, data = self.recv_data()
File "/home/dshwang/chromium/src/tools/telemetry/third_party/websocket-client/websocket.py", line 606, in recv_data
frame = self.recv_frame()
File "/home/dshwang/chromium/src/tools/telemetry/third_party/websocket-client/websocket.py", line 637, in recv_frame
self._frame_header = self._recv_strict(2)
File "/home/dshwang/chromium/src/tools/telemetry/third_party/websocket-client/websocket.py", line 746, in _recv_strict
bytes = self._recv(shortage)
File "/home/dshwang/chromium/src/tools/telemetry/third_party/websocket-client/websocket.py", line 739, in _recv
raise WebSocketConnectionClosedException()
WebSocketConnectionClosedException
[ FAILED ] background_color_animation.html (9151 ms)
Traceback (most recent call last):
RunBenchmark at tools/telemetry/telemetry/internal/story_runner.py:294
Run(pt, stories, finder_options, results, benchmark.max_failures)
Run at tools/telemetry/telemetry/internal/story_runner.py:218
_RunStoryAndProcessErrorIfNeeded(story, results, state, test)
_RunStoryAndProcessErrorIfNeeded at tools/telemetry/telemetry/internal/story_runner.py:83
state.RunStory(results)
RunStory at tools/telemetry/telemetry/page/shared_page_state.py:298
self._current_page.Run(self)
Run at tools/telemetry/telemetry/page/__init__.py:83
shared_state.page_test.WillNavigateToPage(self, current_tab)
WillNavigateToPage at tools/perf/measurements/smoothness.py:56
self._tbm.WillRunStory(tab.browser.platform)
WillRunStory at tools/telemetry/telemetry/web_perf/timeline_based_measurement.py:256
if not platform.tracing_controller.IsChromeTracingSupported():
IsChromeTracingSupported at tools/telemetry/telemetry/core/tracing_controller.py:40
return self._tracing_controller_backend.IsChromeTracingSupported()
IsChromeTracingSupported at tools/telemetry/telemetry/internal/platform/tracing_controller_backend.py:94
self._platform_backend)
IsSupported at tools/telemetry/telemetry/internal/platform/tracing_agent/chrome_tracing_agent.py:61
return chrome_tracing_devtools_manager.IsSupported(platform_backend)
IsSupported at tools/telemetry/telemetry/internal/platform/tracing_agent/chrome_tracing_devtools_manager.py:42
if devtools_client.IsChromeTracingSupported():
IsChromeTracingSupported at tools/telemetry/telemetry/internal/backends/chrome_inspector/devtools_client_backend.py:295
return self._tracing_backend.IsTracingSupported()
Cacher at tools/telemetry/telemetry/decorators.py:34
cacher.__cache[key] = obj(*args, **kwargs)
IsTracingSupported at tools/telemetry/telemetry/internal/backends/chrome_inspector/tracing_backend.py:244
res = self._inspector_websocket.SyncRequest(req)
SyncRequest at tools/telemetry/telemetry/internal/backends/chrome_inspector/inspector_websocket.py:107
res = self._Receive(timeout)
_Receive at tools/telemetry/telemetry/internal/backends/chrome_inspector/inspector_websocket.py:143
data = self._socket.recv()
recv at tools/telemetry/third_party/websocket-client/websocket.py:596
opcode, data = self.recv_data()
recv_data at tools/telemetry/third_party/websocket-client/websocket.py:606
frame = self.recv_frame()
recv_frame at tools/telemetry/third_party/websocket-client/websocket.py:637
self._frame_header = self._recv_strict(2)
_recv_strict at tools/telemetry/third_party/websocket-client/websocket.py:746
bytes = self._recv(shortage)
_recv at tools/telemetry/third_party/websocket-client/websocket.py:739
raise WebSocketConnectionClosedException()
WebSocketConnectionClosedException
Locals:
bufsize : 2
bytes : ''
[ PASSED ] 0 tests.
[ FAILED ] 1 test, listed below:
[ FAILED ] background_color_animation.html
1 FAILED TEST
Pages: []
RESULT telemetry_page_measurement_results: num_failed= 1 count
RESULT telemetry_page_measurement_results: num_errored= 0 count
View result at file:///home/dshwang/chromium/src/tools/perf/results.html
(ERROR) 2015-10-20 16:51:19,720 ps_util._ListAllSubprocesses:85 Telemetry leaks these processes: python (8396) - []
Sign up for free to join this conversation on GitHub. Already have an account? Sign in to comment
You can’t perform that action at this time.