Skip to content

Instantly share code, notes, and snippets.

Embed
What would you like to do?
build log
Building Solution: StripeSampleiOS (Debug)
Building: StripeSampleiOS (Debug|iPhoneSimulator)
Build started 6/11/2015 3:17:08 PM.
__________________________________________________
Project "/Users/dylankelly/Downloads/stripe-1.0.3/samples/StripeSampleiOS/StripeSampleiOS/StripeSampleiOS.csproj" (Build target(s)):
Target PrepareForBuild:
Configuration: Debug Platform: iPhoneSimulator
Target _DetectAppManifest:
FindItemWithLogicalName Task
Items:
Info.plist
Entitlements.plist
LogicalName: Info.plist
ProjectDir: /Users/dylankelly/Downloads/stripe-1.0.3/samples/StripeSampleiOS/StripeSampleiOS
ResourcePrefix: Resources
Target _DetectSdkLocations:
DetectSdkLocations Task
Platform: iPhoneSimulator
SdkVersion: 8.3
XamarinSdkRoot: /Library/Frameworks/Xamarin.iOS.framework/Versions/Current
Target _CoreCompileInterfaceDefinitions:
IBTool Task
AppManifest: Info.plist
InterfaceDefinitions:
IntermediateOutputPath: obj/iPhoneSimulator/Debug/
IsWatchApp: False
Platform: iPhoneSimulator
ProjectDir: /Users/dylankelly/Downloads/stripe-1.0.3/samples/StripeSampleiOS/StripeSampleiOS
ResourcePrefix: Resources
SdkBinPath: /Applications/Xcode.app/Contents/Developer/Platforms/iPhoneSimulator.platform/Developer/SDKs/iPhoneSimulator8.3.sdk/Developer/usr/bin
SdkRoot: /Applications/Xcode.app/Contents/Developer/Platforms/iPhoneSimulator.platform/Developer/SDKs/iPhoneSimulator8.3.sdk
SdkVersion: 8.3
BundleResources Output:
OutputManifests Output:
Target _CollectColladaAssets:
CollectBundleResources Task
BundleResources: <null>
OptimizePNGs: False
ProjectDir: /Users/dylankelly/Downloads/stripe-1.0.3/samples/StripeSampleiOS/StripeSampleiOS
ResourcePrefix: Resources
Target _CoreCompileColladaAssets:
No input files were specified for target _CoreCompileColladaAssets, skipping.
Target _CoreCompileSceneKitAssets:
CompileSceneKitAssets Task
IntermediateOutputPath: obj/iPhoneSimulator/Debug/
ProjectDir: /Users/dylankelly/Downloads/stripe-1.0.3/samples/StripeSampleiOS/StripeSampleiOS
ResourcePrefix: Resources
SceneKitAssets:
SdkDevPath: /Applications/Xcode.app/Contents/Developer
SdkRoot: /Applications/Xcode.app/Contents/Developer/Platforms/iPhoneSimulator.platform/Developer/SDKs/iPhoneSimulator8.3.sdk
SdkVersion: 8.3
Target _CoreCompileTextureAtlases:
TextureAtlas Task
AtlasTextures: <null>
IntermediateOutputPath: obj/iPhoneSimulator/Debug/
ProjectDir: /Users/dylankelly/Downloads/stripe-1.0.3/samples/StripeSampleiOS/StripeSampleiOS
ResourcePrefix: Resources
SdkBinPath: /Applications/Xcode.app/Contents/Developer/Platforms/iPhoneSimulator.platform/Developer/SDKs/iPhoneSimulator8.3.sdk/Developer/usr/bin
SdkDevPath: /Applications/Xcode.app/Contents/Developer
SdkUsrPath: /Applications/Xcode.app/Contents/Developer/Platforms/iPhoneSimulator.platform/Developer/SDKs/iPhoneSimulator8.3.sdk/Developer/usr
Target _CollectITunesArtwork:
CollectITunesArtwork Task
ITunesArtwork: <null>
Target _CollectBundleResources:
CollectBundleResources Task
BundleResources:
Resources/Default-568h@2x.png
OptimizePNGs: True
ProjectDir: /Users/dylankelly/Downloads/stripe-1.0.3/samples/StripeSampleiOS/StripeSampleiOS
ResourcePrefix: Resources
Target _CoreOptimizePngImages:
OptimizeImage Task
InputImage: Resources/Default-568h@2x.png
OutputImage: obj/iPhoneSimulator/Debug/Default-568h@2x.png
SdkDevPath: /Applications/Xcode.app/Contents/Developer
Tool /Applications/Xcode.app/Contents/Developer/Platforms/iPhoneOS.platform/Developer/usr/bin/pngcrush execution started with arguments: -q -iphone -f 0 Resources/Default-568h@2x.png obj/iPhoneSimulator/Debug/Default-568h@2x.png
Target _UnpackLibraryResources:
UnpackLibraryResources Task
Prefix: monotouch
IntermediateOutputPath: obj/iPhoneSimulator/Debug/
NoOverwrite:
obj/iPhoneSimulator/Debug/Default-568h@2x.png
ReferencedLibraries:
/Library/Frameworks/Xamarin.iOS.framework/Versions/Current/lib/mono/Xamarin.iOS/System.dll
/Library/Frameworks/Xamarin.iOS.framework/Versions/Current/lib/mono/Xamarin.iOS/System.Xml.dll
/Library/Frameworks/Xamarin.iOS.framework/Versions/Current/lib/mono/Xamarin.iOS/Xamarin.iOS.dll
../../../lib//ios-unified/Stripe.dll
/Library/Frameworks/Xamarin.iOS.framework/Versions/Current/lib/mono/Xamarin.iOS/System.Core.dll
/Library/Frameworks/Xamarin.iOS.framework/Versions/Current/lib/mono/Xamarin.iOS/mscorlib.dll
/Library/Frameworks/Xamarin.iOS.framework/Versions/Current/lib/mono/Xamarin.iOS/mscorlib.dll
Unpacking: amex.png
Unpacking: amex@2x.png
Unpacking: credit.png
Unpacking: credit@2x.png
Unpacking: cvc.png
Unpacking: cvc@2x.png
Unpacking: diners.png
Unpacking: diners@2x.png
Unpacking: discover.png
Unpacking: discover@2x.png
Unpacking: jcb.png
Unpacking: jcb@2x.png
Unpacking: maestro.png
Unpacking: maestro@2x.png
Unpacking: mastercard.png
Unpacking: mastercard@2x.png
Unpacking: visa.png
Unpacking: visa@2x.png
Unpacking: amex@3x.png
Unpacking: credit@3x.png
Unpacking: cvc@3x.png
Unpacking: diners@3x.png
Unpacking: discover@3x.png
Unpacking: jcb@3x.png
Unpacking: maestro@3x.png
Unpacking: mastercard@3x.png
Unpacking: visa@3x.png
Target CopyFilesMarkedCopyLocal:
Copying file from '/Users/dylankelly/Downloads/stripe-1.0.3/lib/ios-unified/Stripe.dll' to '/Users/dylankelly/Downloads/stripe-1.0.3/samples/StripeSampleiOS/StripeSampleiOS/bin/iPhoneSimulator/Debug/Stripe.dll'
Target GenerateSatelliteAssemblies:
No input files were specified for target GenerateSatelliteAssemblies, skipping.
Target CoreCompile:
Tool /Library/Frameworks/Xamarin.iOS.framework/Versions/Current/bin/smcs execution started with arguments: /noconfig /debug:full /debug+ /optimize- /out:obj/iPhoneSimulator/Debug/StripeSampleiOS.exe Main.cs AppDelegate.cs MainViewController.cs CreditCardInputViewController.cs obj/iPhoneSimulator/Debug/Xamarin.iOS,Version=v1.0.AssemblyAttribute.cs /target:exe /define:"__UNIFIED__;__MOBILE__;__IOS__;DEBUG" /nostdlib /reference:/Library/Frameworks/Xamarin.iOS.framework/Versions/Current/lib/mono/Xamarin.iOS/System.dll /reference:/Library/Frameworks/Xamarin.iOS.framework/Versions/Current/lib/mono/Xamarin.iOS/System.Xml.dll /reference:/Library/Frameworks/Xamarin.iOS.framework/Versions/Current/lib/mono/Xamarin.iOS/Xamarin.iOS.dll /reference:../../../lib//ios-unified/Stripe.dll /reference:/Library/Frameworks/Xamarin.iOS.framework/Versions/Current/lib/mono/Xamarin.iOS/System.Core.dll /reference:/Library/Frameworks/Xamarin.iOS.framework/Versions/Current/lib/mono/Xamarin.iOS/mscorlib.dll /warn:4
MainViewController.cs(127,6): warning CS0162: Unreachable code detected
MainViewController.cs(29,15): error CS0535: `StripeSampleiOS.MainViewController' does not implement interface member `PassKit.IPKPaymentAuthorizationViewControllerDelegate.WillAuthorizePayment(PassKit.PKPaymentAuthorizationViewController)'
/Library/Frameworks/Xamarin.iOS.framework/Versions/Current/lib/mono/Xamarin.iOS/Xamarin.iOS.dll (Location of the symbol related to previous error)
Task "Csc" execution -- FAILED
Done building target "CoreCompile" in project "/Users/dylankelly/Downloads/stripe-1.0.3/samples/StripeSampleiOS/StripeSampleiOS/StripeSampleiOS.csproj".-- FAILED
Done building project "/Users/dylankelly/Downloads/stripe-1.0.3/samples/StripeSampleiOS/StripeSampleiOS/StripeSampleiOS.csproj".-- FAILED
Build FAILED.
Warnings:
/Users/dylankelly/Downloads/stripe-1.0.3/samples/StripeSampleiOS/StripeSampleiOS/StripeSampleiOS.csproj (Build) ->
/Library/Frameworks/Mono.framework/Versions/4.0.1/lib/mono/4.5/Microsoft.CSharp.targets (CoreCompile target) ->
MainViewController.cs(127,6): warning CS0162: Unreachable code detected
Errors:
/Users/dylankelly/Downloads/stripe-1.0.3/samples/StripeSampleiOS/StripeSampleiOS/StripeSampleiOS.csproj (Build) ->
/Library/Frameworks/Mono.framework/Versions/4.0.1/lib/mono/4.5/Microsoft.CSharp.targets (CoreCompile target) ->
MainViewController.cs(29,15): error CS0535: `StripeSampleiOS.MainViewController' does not implement interface member `PassKit.IPKPaymentAuthorizationViewControllerDelegate.WillAuthorizePayment(PassKit.PKPaymentAuthorizationViewController)'
1 Warning(s)
1 Error(s)
Time Elapsed 00:00:00.8222980
---------------------- Done ----------------------
Build: 1 error, 1 warning
Sign up for free to join this conversation on GitHub. Already have an account? Sign in to comment
You can’t perform that action at this time.