Skip to content

Instantly share code, notes, and snippets.

Embed
What would you like to do?
first attempt at building ARM AppImage on my home machine
[e@librem MuseScore]$ sudo ./build/travis/job2_AppImage/build.sh --armhf
++ date -u +%Y%m%d%H%M
+ date=201801291713
+ branch=
+ '[' '' ']'
++ git rev-parse --abbrev-ref HEAD
+ branch=master
++ echo ''
++ cut -c 1-7
+ revision=
+ '[' '' ']'
++ make revision
++ cat mscore/revision.h
+ revision=78474ce
+ docker_tag=latest
+ '[' master == master ']'
++ grep '^[[:blank:]]*set( *MSCORE_UNSTABLE \+TRUE *)' CMakeLists.txt
+ '[' 'set(MSCORE_UNSTABLE TRUE) # Mark as unstable' ']'
+ '[' '' == musescore ']'
+ makefile_overrides='PREFIX='\''MuseScoreDev-201801291713-master-78474ce'\'' SUFFIX='\''-portable-dev'\'' LABEL='\''Unofficial Developer Build'\'''
+ case "$1" in
+ shift
+ docker run -i -v /var/MuseScore:/MuseScore ericfont/musescore:jessie-crosscompile-armhf /bin/bash -c '/MuseScore/build/Linux+BSD/portable/RecipeDebian --build-only armhf PREFIX='\''MuseScoreDev-201801291713-master-78474ce'\'' SUFFIX='\''-portable-dev'\'' LABEL='\''Unofficial Developer Build'\'''
Unable to find image 'ericfont/musescore:jessie-crosscompile-armhf' locally
jessie-crosscompile-armhf: Pulling from ericfont/musescore
fdd5d7827f33: Pull complete
a3ed95caeb02: Pull complete
d91d4f71726a: Pull complete
8fe6bbf31b1e: Pull complete
e72df72d62c2: Pull complete
8f2c4462f9ab: Pull complete
Digest: sha256:e01c58720042c829268db651cecea2e659cd15bfd8618b5e1d8f5dee278e84d0
Status: Downloaded newer image for ericfont/musescore:jessie-crosscompile-armhf
+ shift 2
+ case $COMMAND in
+ build PREFIX=MuseScoreDev-201801291713-master-78474ce SUFFIX=-portable-dev 'LABEL=Unofficial Developer Build'
+ echo 'building MuseScore Portable for arch: armhf'
+ cd MuseScore
+ make revision
building MuseScore Portable for arch: armhf
+ '[' armhf == armhf ']'
+ LIBARM=/lib/arm-linux-gnueabihf
+ CMAKE_TOOLCHAIN_FILE=/MuseScore/build/Linux+BSD/portable/ARM/jessie-crosscompile-armhf.cmake
+ LD_LIBRARY_PATH=/usr/lib/arm-linux-gnueabihf:/usr/lib/arm-linux-gnueabihf/alsa-lib:/usr/lib/arm-linux-gnueabihf/pulseaudio:/lib/arm-linux-gnueabihf
+ make PREFIX=MuseScoreDev-201801291713-master-78474ce SUFFIX=-portable-dev 'LABEL=Unofficial Developer Build' portable
if test ! -d build.release; then mkdir build.release; fi; \
cd build.release; \
export PATH=/usr/local/sbin:/usr/local/bin:/usr/sbin:/usr/bin:/sbin:/bin; \
cmake -DCMAKE_BUILD_TYPE=RELEASE \
-DCMAKE_TOOLCHAIN_FILE="/MuseScore/build/Linux+BSD/portable/ARM/jessie-crosscompile-armhf.cmake" \
-DCMAKE_INSTALL_PREFIX="MuseScoreDev-201801291713-master-78474ce" \
-DMSCORE_INSTALL_SUFFIX="-portable-dev" \
-DMUSESCORE_LABEL="Unofficial Developer Build" \
-DBUILD_LAME=""ON" " \
-DBUILD_PULSEAUDIO=""ON" " \
-DBUILD_JACK=""ON" " \
-DBUILD_PORTAUDIO=""ON" " \
-DUSE_SYSTEM_FREETYPE=""OFF" " \
-DCMAKE_SKIP_RPATH="TRUE" ..; \
make lrelease; \
make -j 4; \
-- The C compiler identification is GNU 4.9.2
-- The CXX compiler identification is GNU 4.9.2
-- Check for working C compiler: /usr/bin/arm-linux-gnueabihf-gcc
-- Check for working C compiler: /usr/bin/arm-linux-gnueabihf-gcc -- works
-- Detecting C compiler ABI info
-- Detecting C compiler ABI info - done
-- Check for working CXX compiler: /usr/bin/arm-linux-gnueabihf-g++
-- Check for working CXX compiler: /usr/bin/arm-linux-gnueabihf-g++ -- works
-- Detecting CXX compiler ABI info
-- Detecting CXX compiler ABI info - done
CMake Warning at build/FindQt5.cmake:29 (find_package):
By not providing "FindQt5WebEngine.cmake" in CMAKE_MODULE_PATH this project
has asked CMake to find a package configuration file provided by
"Qt5WebEngine", but CMake did not find one.
Could not find a package configuration file provided by "Qt5WebEngine" with
any of the following names:
Qt5WebEngineConfig.cmake
qt5webengine-config.cmake
Add the installation prefix of "Qt5WebEngine" to CMAKE_PREFIX_PATH or set
"Qt5WebEngine_DIR" to a directory containing one of the above files. If
"Qt5WebEngine" provides a separate development package or SDK, be sure it
has been installed.
Call Stack (most recent call first):
CMakeLists.txt:68 (include)
CMake Warning at build/FindQt5.cmake:29 (find_package):
By not providing "FindQt5WebEngineCore.cmake" in CMAKE_MODULE_PATH this
project has asked CMake to find a package configuration file provided by
"Qt5WebEngineCore", but CMake did not find one.
Could not find a package configuration file provided by "Qt5WebEngineCore"
with any of the following names:
Qt5WebEngineCoreConfig.cmake
qt5webenginecore-config.cmake
Add the installation prefix of "Qt5WebEngineCore" to CMAKE_PREFIX_PATH or
set "Qt5WebEngineCore_DIR" to a directory containing one of the above
files. If "Qt5WebEngineCore" provides a separate development package or
SDK, be sure it has been installed.
Call Stack (most recent call first):
CMakeLists.txt:68 (include)
CMake Warning at build/FindQt5.cmake:29 (find_package):
By not providing "FindQt5WebEngineWidgets.cmake" in CMAKE_MODULE_PATH this
project has asked CMake to find a package configuration file provided by
"Qt5WebEngineWidgets", but CMake did not find one.
Could not find a package configuration file provided by
"Qt5WebEngineWidgets" with any of the following names:
Qt5WebEngineWidgetsConfig.cmake
qt5webenginewidgets-config.cmake
Add the installation prefix of "Qt5WebEngineWidgets" to CMAKE_PREFIX_PATH
or set "Qt5WebEngineWidgets_DIR" to a directory containing one of the above
files. If "Qt5WebEngineWidgets" provides a separate development package or
SDK, be sure it has been installed.
Call Stack (most recent call first):
CMakeLists.txt:68 (include)
-- WARNING: you are using the obsolete 'PKGCONFIG' macro, use FindPkgConfig
-- Found pulseaudio. LIB /usr/lib/arm-linux-gnueabihf/libpulse.so, INCLUDE /usr/include, LIBDIR /usr/lib/arm-linux-gnueabihf, LDFLAGS -L/usr/lib/arm-linux-gnueabihf -lpulse, CFLAGS -D_REENTRANT
ALSA >= 1.0.0 found. ALSA support enabled. INCDIR /usr/include, LIBDIR /usr/lib/arm-linux-gnueabihf, LIB -L/usr/lib/arm-linux-gnueabihf -lasound, CPP -I/usr/include/alsa
PulseAudio found. PulseAudio support enabled.
LAME not found.
-- JACK (Jack Audio Connection Kit) >= 0.98.0 found. jack support enabled.
PortAudio found. PortAudio support enabled. INCDIR /usr/include, LIBDIR /usr/lib/arm-linux-gnueabihf, LIB -L/usr/lib/arm-linux-gnueabihf -lportaudio -lasound -lm -lpthread
-- Found 'gzip'. Man pages will be compressed.
-- Found 'ln'. Symlink aliases will be created for MuseScore executable and the man pages.
-- Precompiled header generation
-- Creating directory /MuseScore/build.release/include/freetype/config
-- Creating file /MuseScore/build.release/include/freetype/config/ftconfig.h
-- Looking for unistd.h
-- Looking for unistd.h - found
-- Looking for fcntl.h
-- Looking for fcntl.h - found
-- Looking for stdint.h
-- Looking for stdint.h - found
-- Creating file /MuseScore/build.release/include/freetype/config/ftoption.h
-- Configuring done
-- Generating done
-- Build files have been written to: /MuseScore/build.release
make[1]: Entering directory '/MuseScore/build.release'
make[2]: Entering directory '/MuseScore/build.release'
make[3]: Entering directory '/MuseScore/build.release'
make[4]: Entering directory '/MuseScore/build.release'
Scanning dependencies of target lrelease
make[4]: Leaving directory '/MuseScore/build.release'
make[4]: Entering directory '/MuseScore/build.release'
/usr/lib/arm-linux-gnueabihf/qt5/bin/lrelease: 1: /usr/lib/arm-linux-gnueabihf/qt5/bin/lrelease: Syntax error: word unexpected (expecting ")")
make[4]: *** [CMakeFiles/lrelease] Error 2
CMakeFiles/lrelease.dir/build.make:49: recipe for target 'CMakeFiles/lrelease' failed
make[4]: Leaving directory '/MuseScore/build.release'
CMakeFiles/Makefile2:60: recipe for target 'CMakeFiles/lrelease.dir/all' failed
make[3]: *** [CMakeFiles/lrelease.dir/all] Error 2
make[3]: Leaving directory '/MuseScore/build.release'
CMakeFiles/Makefile2:68: recipe for target 'CMakeFiles/lrelease.dir/rule' failed
make[2]: *** [CMakeFiles/lrelease.dir/rule] Error 2
make[2]: Leaving directory '/MuseScore/build.release'
Makefile:171: recipe for target 'lrelease' failed
make[1]: Leaving directory '/MuseScore/build.release'
make[1]: *** [lrelease] Error 2
make[1]: Entering directory '/MuseScore/build.release'
make[2]: Entering directory '/MuseScore/build.release'
make[3]: Entering directory '/MuseScore/build.release'
make[3]: Entering directory '/MuseScore/build.release'
make[3]: Entering directory '/MuseScore/build.release'
make[3]: Entering directory '/MuseScore/build.release'
Scanning dependencies of target mscore_automoc
Scanning dependencies of target manpages
Scanning dependencies of target bww_automoc
Scanning dependencies of target mops1
make[3]: Leaving directory '/MuseScore/build.release'
make[3]: Leaving directory '/MuseScore/build.release'
make[3]: Leaving directory '/MuseScore/build.release'
make[3]: Leaving directory '/MuseScore/build.release'
make[3]: Entering directory '/MuseScore/build.release'
make[3]: Entering directory '/MuseScore/build.release'
make[3]: Entering directory '/MuseScore/build.release'
make[3]: Entering directory '/MuseScore/build.release'
[ 0%] [ 0%] [ 1%] [ 1%] Generating all.h
Automatic moc for target mscore
Generating mscore-portable-dev.1.gz
make[3]: Leaving directory '/MuseScore/build.release'
Man pages have been compressed ready for installation.
Creating symlink alias for man pages.
Symlink alias: musescore-portable-dev.1.gz -> mscore-portable-dev.1.gz
make[3]: Leaving directory '/MuseScore/build.release'
Automatic moc for target bww
[ 1%] Built target mops1
make[3]: Entering directory '/MuseScore/build.release'
make[3]: Leaving directory '/MuseScore/build.release'
[ 1%] [ 1%] Built target manpages
Scanning dependencies of target mops2
Built target bww_automoc
make[3]: Leaving directory '/MuseScore/build.release'
make[3]: Entering directory '/MuseScore/build.release'
make[3]: Entering directory '/MuseScore/build.release'
make[3]: Entering directory '/MuseScore/build.release'
Scanning dependencies of target qtsingleapp_automoc
[ 1%] Scanning dependencies of target awl_automoc
make[3]: Leaving directory '/MuseScore/build.release'
make[3]: Leaving directory '/MuseScore/build.release'
make[3]: Entering directory '/MuseScore/build.release'
make[3]: Entering directory '/MuseScore/build.release'
[ 1%] Generating all.h.gch
[ 1%] Automatic moc for target qtsingleapp
Automatic moc for target awl
Generating moc_qtlocalpeer.cpp
/usr/lib/arm-linux-gnueabihf/qt5/bin/moc: 1: /usr/lib/arm-linux-gnueabihf/qt5/bin/moc: Syntax error: word unexpected (expecting ")")
AUTOGEN: error: process for /MuseScore/build.release/thirdparty/singleapp/src/moc_qtlocalpeer.cpp failed:
/usr/lib/arm-linux-gnueabihf/qt5/bin/moc: 1: /usr/lib/arm-linux-gnueabihf/qt5/bin/moc: Syntax error: word unexpected (expecting ")")
Generating moc_abstractdialog.cpp
/usr/lib/arm-linux-gnueabihf/qt5/bin/moc: 1: /usr/lib/arm-linux-gnueabihf/qt5/bin/moc: Syntax error: word unexpected (expecting ")")
Generating moc_qtsingleapplication.cpp
/usr/lib/arm-linux-gnueabihf/qt5/bin/moc: 1: /usr/lib/arm-linux-gnueabihf/qt5/bin/moc: Syntax error: word unexpected (expecting ")")
AUTOGEN: error: process for /MuseScore/build.release/mscore/moc_abstractdialog.cpp failed:
/usr/lib/arm-linux-gnueabihf/qt5/bin/moc: 1: /usr/lib/arm-linux-gnueabihf/qt5/bin/moc: Syntax error: word unexpected (expecting ")")
AUTOGEN: error: process for /MuseScore/build.release/thirdparty/singleapp/src/moc_qtsingleapplication.cpp failed:
/usr/lib/arm-linux-gnueabihf/qt5/bin/moc: 1: /usr/lib/arm-linux-gnueabihf/qt5/bin/moc: Syntax error: word unexpected (expecting ")")
moc failed...
thirdparty/singleapp/src/CMakeFiles/qtsingleapp_automoc.dir/build.make:49: recipe for target 'thirdparty/singleapp/src/CMakeFiles/qtsingleapp_automoc' failed
make[3]: Leaving directory '/MuseScore/build.release'
make[3]: *** [thirdparty/singleapp/src/CMakeFiles/qtsingleapp_automoc] Error 1
make[2]: *** [thirdparty/singleapp/src/CMakeFiles/qtsingleapp_automoc.dir/all] Error 2
make[2]: *** Waiting for unfinished jobs....
CMakeFiles/Makefile2:7429: recipe for target 'thirdparty/singleapp/src/CMakeFiles/qtsingleapp_automoc.dir/all' failed
Generating moc_accessibletoolbutton.cpp
/usr/lib/arm-linux-gnueabihf/qt5/bin/moc: 1: /usr/lib/arm-linux-gnueabihf/qt5/bin/moc: Syntax error: word unexpected (expecting ")")
AUTOGEN: error: process for /MuseScore/build.release/mscore/moc_accessibletoolbutton.cpp failed:
/usr/lib/arm-linux-gnueabihf/qt5/bin/moc: 1: /usr/lib/arm-linux-gnueabihf/qt5/bin/moc: Syntax error: word unexpected (expecting ")")
Generating moc_aslider.cpp
/usr/lib/arm-linux-gnueabihf/qt5/bin/moc: 1: /usr/lib/arm-linux-gnueabihf/qt5/bin/moc: Syntax error: word unexpected (expecting ")")
AUTOGEN: error: process for /MuseScore/build.release/awl/moc_aslider.cpp failed:
/usr/lib/arm-linux-gnueabihf/qt5/bin/moc: 1: /usr/lib/arm-linux-gnueabihf/qt5/bin/moc: Syntax error: word unexpected (expecting ")")
Generating moc_albummanager.cpp
/usr/lib/arm-linux-gnueabihf/qt5/bin/moc: 1: /usr/lib/arm-linux-gnueabihf/qt5/bin/moc: Syntax error: word unexpected (expecting ")")
AUTOGEN: error: process for /MuseScore/build.release/mscore/moc_albummanager.cpp failed:
/usr/lib/arm-linux-gnueabihf/qt5/bin/moc: 1: /usr/lib/arm-linux-gnueabihf/qt5/bin/moc: Syntax error: word unexpected (expecting ")")
Generating moc_colorlabel.cpp
/usr/lib/arm-linux-gnueabihf/qt5/bin/moc: 1: /usr/lib/arm-linux-gnueabihf/qt5/bin/moc: Syntax error: word unexpected (expecting ")")
AUTOGEN: error: process for /MuseScore/build.release/awl/moc_colorlabel.cpp failed:
/usr/lib/arm-linux-gnueabihf/qt5/bin/moc: 1: /usr/lib/arm-linux-gnueabihf/qt5/bin/moc: Syntax error: word unexpected (expecting ")")
Generating moc_articulationprop.cpp
/usr/lib/arm-linux-gnueabihf/qt5/bin/moc: 1: /usr/lib/arm-linux-gnueabihf/qt5/bin/moc: Syntax error: word unexpected (expecting ")")
AUTOGEN: error: process for /MuseScore/build.release/mscore/moc_articulationprop.cpp failed:
/usr/lib/arm-linux-gnueabihf/qt5/bin/moc: 1: /usr/lib/arm-linux-gnueabihf/qt5/bin/moc: Syntax error: word unexpected (expecting ")")
Generating moc_denomspinbox.cpp
/usr/lib/arm-linux-gnueabihf/qt5/bin/moc: 1: /usr/lib/arm-linux-gnueabihf/qt5/bin/moc: Syntax error: word unexpected (expecting ")")
AUTOGEN: error: process for /MuseScore/build.release/awl/moc_denomspinbox.cpp failed:
/usr/lib/arm-linux-gnueabihf/qt5/bin/moc: 1: /usr/lib/arm-linux-gnueabihf/qt5/bin/moc: Syntax error: word unexpected (expecting ")")
Generating moc_knob.cpp
/usr/lib/arm-linux-gnueabihf/qt5/bin/moc: 1: /usr/lib/arm-linux-gnueabihf/qt5/bin/moc: Syntax error: word unexpected (expecting ")")
AUTOGEN: error: process for /MuseScore/build.release/awl/moc_knob.cpp failed:
/usr/lib/arm-linux-gnueabihf/qt5/bin/moc: 1: /usr/lib/arm-linux-gnueabihf/qt5/bin/moc: Syntax error: word unexpected (expecting ")")
AUTOGEN: error: process for /MuseScore/build.release/mscore/moc_bendcanvas.cpp failed:
/usr/lib/arm-linux-gnueabihf/qt5/bin/moc: 1: /usr/lib/arm-linux-gnueabihf/qt5/bin/moc: Syntax error: word unexpected (expecting ")")
Generating moc_bendcanvas.cpp
/usr/lib/arm-linux-gnueabihf/qt5/bin/moc: 1: /usr/lib/arm-linux-gnueabihf/qt5/bin/moc: Syntax error: word unexpected (expecting ")")
AUTOGEN: error: process for /MuseScore/build.release/awl/moc_midipanknob.cpp failed:
/usr/lib/arm-linux-gnueabihf/qt5/bin/moc: 1: /usr/lib/arm-linux-gnueabihf/qt5/bin/moc: Syntax error: word unexpected (expecting ")")
Generating moc_midipanknob.cpp
/usr/lib/arm-linux-gnueabihf/qt5/bin/moc: 1: /usr/lib/arm-linux-gnueabihf/qt5/bin/moc: Syntax error: word unexpected (expecting ")")
Generating moc_bendproperties.cpp
/usr/lib/arm-linux-gnueabihf/qt5/bin/moc: 1: /usr/lib/arm-linux-gnueabihf/qt5/bin/moc: Syntax error: word unexpected (expecting ")")
AUTOGEN: error: process for /MuseScore/build.release/mscore/moc_bendproperties.cpp failed:
/usr/lib/arm-linux-gnueabihf/qt5/bin/moc: 1: /usr/lib/arm-linux-gnueabihf/qt5/bin/moc: Syntax error: word unexpected (expecting ")")
Generating moc_mslider.cpp
/usr/lib/arm-linux-gnueabihf/qt5/bin/moc: 1: /usr/lib/arm-linux-gnueabihf/qt5/bin/moc: Syntax error: word unexpected (expecting ")")
AUTOGEN: error: process for /MuseScore/build.release/awl/moc_mslider.cpp failed:
/usr/lib/arm-linux-gnueabihf/qt5/bin/moc: 1: /usr/lib/arm-linux-gnueabihf/qt5/bin/moc: Syntax error: word unexpected (expecting ")")
Generating moc_panknob.cpp
/usr/lib/arm-linux-gnueabihf/qt5/bin/moc: 1: /usr/lib/arm-linux-gnueabihf/qt5/bin/moc: Syntax error: word unexpected (expecting ")")
AUTOGEN: error: process for /MuseScore/build.release/awl/moc_panknob.cpp failed:
/usr/lib/arm-linux-gnueabihf/qt5/bin/moc: 1: /usr/lib/arm-linux-gnueabihf/qt5/bin/moc: Syntax error: word unexpected (expecting ")")
Generating moc_breaksdialog.cpp
/usr/lib/arm-linux-gnueabihf/qt5/bin/moc: 1: /usr/lib/arm-linux-gnueabihf/qt5/bin/moc: Syntax error: word unexpected (expecting ")")
AUTOGEN: error: process for /MuseScore/build.release/mscore/moc_breaksdialog.cpp failed:
/usr/lib/arm-linux-gnueabihf/qt5/bin/moc: 1: /usr/lib/arm-linux-gnueabihf/qt5/bin/moc: Syntax error: word unexpected (expecting ")")
Generating moc_pitchedit.cpp
/usr/lib/arm-linux-gnueabihf/qt5/bin/moc: 1: /usr/lib/arm-linux-gnueabihf/qt5/bin/moc: Syntax error: word unexpected (expecting ")")
AUTOGEN: error: process for /MuseScore/build.release/awl/moc_pitchedit.cpp failed:
/usr/lib/arm-linux-gnueabihf/qt5/bin/moc: 1: /usr/lib/arm-linux-gnueabihf/qt5/bin/moc: Syntax error: word unexpected (expecting ")")
Generating moc_chordview.cpp
/usr/lib/arm-linux-gnueabihf/qt5/bin/moc: 1: /usr/lib/arm-linux-gnueabihf/qt5/bin/moc: Syntax error: word unexpected (expecting ")")
AUTOGEN: error: process for /MuseScore/build.release/mscore/moc_chordview.cpp failed:
/usr/lib/arm-linux-gnueabihf/qt5/bin/moc: 1: /usr/lib/arm-linux-gnueabihf/qt5/bin/moc: Syntax error: word unexpected (expecting ")")
Generating moc_pitchlabel.cpp
/usr/lib/arm-linux-gnueabihf/qt5/bin/moc: 1: /usr/lib/arm-linux-gnueabihf/qt5/bin/moc: Syntax error: word unexpected (expecting ")")
AUTOGEN: error: process for /MuseScore/build.release/awl/moc_pitchlabel.cpp failed:
/usr/lib/arm-linux-gnueabihf/qt5/bin/moc: 1: /usr/lib/arm-linux-gnueabihf/qt5/bin/moc: Syntax error: word unexpected (expecting ")")
Generating moc_debugger.cpp
/usr/lib/arm-linux-gnueabihf/qt5/bin/moc: 1: /usr/lib/arm-linux-gnueabihf/qt5/bin/moc: Syntax error: word unexpected (expecting ")")
AUTOGEN: error: process for /MuseScore/build.release/mscore/moc_debugger.cpp failed:
/usr/lib/arm-linux-gnueabihf/qt5/bin/moc: 1: /usr/lib/arm-linux-gnueabihf/qt5/bin/moc: Syntax error: word unexpected (expecting ")")
Generating moc_poslabel.cpp
/usr/lib/arm-linux-gnueabihf/qt5/bin/moc: 1: /usr/lib/arm-linux-gnueabihf/qt5/bin/moc: Syntax error: word unexpected (expecting ")")
AUTOGEN: error: process for /MuseScore/build.release/awl/moc_poslabel.cpp failed:
/usr/lib/arm-linux-gnueabihf/qt5/bin/moc: 1: /usr/lib/arm-linux-gnueabihf/qt5/bin/moc: Syntax error: word unexpected (expecting ")")
Generating moc_slider.cpp
/usr/lib/arm-linux-gnueabihf/qt5/bin/moc: 1: /usr/lib/arm-linux-gnueabihf/qt5/bin/moc: Syntax error: word unexpected (expecting ")")
AUTOGEN: error: process for /MuseScore/build.release/awl/moc_slider.cpp failed:
/usr/lib/arm-linux-gnueabihf/qt5/bin/moc: 1: /usr/lib/arm-linux-gnueabihf/qt5/bin/moc: Syntax error: word unexpected (expecting ")")
Generating moc_downloadUtils.cpp
/usr/lib/arm-linux-gnueabihf/qt5/bin/moc: 1: /usr/lib/arm-linux-gnueabihf/qt5/bin/moc: Syntax error: word unexpected (expecting ")")
Generating moc_volknob.cpp
/usr/lib/arm-linux-gnueabihf/qt5/bin/moc: 1: /usr/lib/arm-linux-gnueabihf/qt5/bin/moc: Syntax error: word unexpected (expecting ")")
AUTOGEN: error: process for /MuseScore/build.release/mscore/moc_downloadUtils.cpp failed:
/usr/lib/arm-linux-gnueabihf/qt5/bin/moc: 1: /usr/lib/arm-linux-gnueabihf/qt5/bin/moc: Syntax error: word unexpected (expecting ")")
AUTOGEN: error: process for /MuseScore/build.release/awl/moc_volknob.cpp failed:
/usr/lib/arm-linux-gnueabihf/qt5/bin/moc: 1: /usr/lib/arm-linux-gnueabihf/qt5/bin/moc: Syntax error: word unexpected (expecting ")")
Generating moc_volslider.cpp
/usr/lib/arm-linux-gnueabihf/qt5/bin/moc: 1: /usr/lib/arm-linux-gnueabihf/qt5/bin/moc: Syntax error: word unexpected (expecting ")")
AUTOGEN: error: process for /MuseScore/build.release/awl/moc_volslider.cpp failed:
/usr/lib/arm-linux-gnueabihf/qt5/bin/moc: 1: /usr/lib/arm-linux-gnueabihf/qt5/bin/moc: Syntax error: word unexpected (expecting ")")
moc failed...
awl/CMakeFiles/awl_automoc.dir/build.make:49: recipe for target 'awl/CMakeFiles/awl_automoc' failed
make[3]: *** [awl/CMakeFiles/awl_automoc] Error 1
make[3]: Leaving directory '/MuseScore/build.release'
Generating moc_drumroll.cpp
/usr/lib/arm-linux-gnueabihf/qt5/bin/moc: 1: /usr/lib/arm-linux-gnueabihf/qt5/bin/moc: Syntax error: word unexpected (expecting ")")
CMakeFiles/Makefile2:429: recipe for target 'awl/CMakeFiles/awl_automoc.dir/all' failed
make[2]: *** [awl/CMakeFiles/awl_automoc.dir/all] Error 2
AUTOGEN: error: process for /MuseScore/build.release/mscore/moc_drumroll.cpp failed:
/usr/lib/arm-linux-gnueabihf/qt5/bin/moc: 1: /usr/lib/arm-linux-gnueabihf/qt5/bin/moc: Syntax error: word unexpected (expecting ")")
Generating moc_drumtools.cpp
/usr/lib/arm-linux-gnueabihf/qt5/bin/moc: 1: /usr/lib/arm-linux-gnueabihf/qt5/bin/moc: Syntax error: word unexpected (expecting ")")
AUTOGEN: error: process for /MuseScore/build.release/mscore/moc_drumtools.cpp failed:
/usr/lib/arm-linux-gnueabihf/qt5/bin/moc: 1: /usr/lib/arm-linux-gnueabihf/qt5/bin/moc: Syntax error: word unexpected (expecting ")")
Generating moc_drumview.cpp
/usr/lib/arm-linux-gnueabihf/qt5/bin/moc: 1: /usr/lib/arm-linux-gnueabihf/qt5/bin/moc: Syntax error: word unexpected (expecting ")")
AUTOGEN: error: process for /MuseScore/build.release/mscore/moc_drumview.cpp failed:
/usr/lib/arm-linux-gnueabihf/qt5/bin/moc: 1: /usr/lib/arm-linux-gnueabihf/qt5/bin/moc: Syntax error: word unexpected (expecting ")")
Generating moc_editdrumset.cpp
/usr/lib/arm-linux-gnueabihf/qt5/bin/moc: 1: /usr/lib/arm-linux-gnueabihf/qt5/bin/moc: Syntax error: word unexpected (expecting ")")
AUTOGEN: error: process for /MuseScore/build.release/mscore/moc_editdrumset.cpp failed:
/usr/lib/arm-linux-gnueabihf/qt5/bin/moc: 1: /usr/lib/arm-linux-gnueabihf/qt5/bin/moc: Syntax error: word unexpected (expecting ")")
Generating moc_editinstrument.cpp
/usr/lib/arm-linux-gnueabihf/qt5/bin/moc: 1: /usr/lib/arm-linux-gnueabihf/qt5/bin/moc: Syntax error: word unexpected (expecting ")")
AUTOGEN: error: process for /MuseScore/build.release/mscore/moc_editinstrument.cpp failed:
/usr/lib/arm-linux-gnueabihf/qt5/bin/moc: 1: /usr/lib/arm-linux-gnueabihf/qt5/bin/moc: Syntax error: word unexpected (expecting ")")
Generating moc_editpitch.cpp
/usr/lib/arm-linux-gnueabihf/qt5/bin/moc: 1: /usr/lib/arm-linux-gnueabihf/qt5/bin/moc: Syntax error: word unexpected (expecting ")")
AUTOGEN: error: process for /MuseScore/build.release/mscore/moc_editpitch.cpp failed:
/usr/lib/arm-linux-gnueabihf/qt5/bin/moc: 1: /usr/lib/arm-linux-gnueabihf/qt5/bin/moc: Syntax error: word unexpected (expecting ")")
Generating moc_editraster.cpp
/usr/lib/arm-linux-gnueabihf/qt5/bin/moc: 1: /usr/lib/arm-linux-gnueabihf/qt5/bin/moc: Syntax error: word unexpected (expecting ")")
AUTOGEN: error: process for /MuseScore/build.release/mscore/moc_editraster.cpp failed:
/usr/lib/arm-linux-gnueabihf/qt5/bin/moc: 1: /usr/lib/arm-linux-gnueabihf/qt5/bin/moc: Syntax error: word unexpected (expecting ")")
Generating moc_editstaff.cpp
/usr/lib/arm-linux-gnueabihf/qt5/bin/moc: 1: /usr/lib/arm-linux-gnueabihf/qt5/bin/moc: Syntax error: word unexpected (expecting ")")
AUTOGEN: error: process for /MuseScore/build.release/mscore/moc_editstaff.cpp failed:
/usr/lib/arm-linux-gnueabihf/qt5/bin/moc: 1: /usr/lib/arm-linux-gnueabihf/qt5/bin/moc: Syntax error: word unexpected (expecting ")")
Generating moc_editstafftype.cpp
/usr/lib/arm-linux-gnueabihf/qt5/bin/moc: 1: /usr/lib/arm-linux-gnueabihf/qt5/bin/moc: Syntax error: word unexpected (expecting ")")
AUTOGEN: error: process for /MuseScore/build.release/mscore/moc_editstafftype.cpp failed:
/usr/lib/arm-linux-gnueabihf/qt5/bin/moc: 1: /usr/lib/arm-linux-gnueabihf/qt5/bin/moc: Syntax error: word unexpected (expecting ")")
Generating moc_editstringdata.cpp
/usr/lib/arm-linux-gnueabihf/qt5/bin/moc: 1: /usr/lib/arm-linux-gnueabihf/qt5/bin/moc: Syntax error: word unexpected (expecting ")")
AUTOGEN: error: process for /MuseScore/build.release/mscore/moc_editstringdata.cpp failed:
/usr/lib/arm-linux-gnueabihf/qt5/bin/moc: 1: /usr/lib/arm-linux-gnueabihf/qt5/bin/moc: Syntax error: word unexpected (expecting ")")
Generating moc_editstyle.cpp
/usr/lib/arm-linux-gnueabihf/qt5/bin/moc: 1: /usr/lib/arm-linux-gnueabihf/qt5/bin/moc: Syntax error: word unexpected (expecting ")")
AUTOGEN: error: process for /MuseScore/build.release/mscore/moc_editstyle.cpp failed:
/usr/lib/arm-linux-gnueabihf/qt5/bin/moc: 1: /usr/lib/arm-linux-gnueabihf/qt5/bin/moc: Syntax error: word unexpected (expecting ")")
Generating moc_exampleview.cpp
/usr/lib/arm-linux-gnueabihf/qt5/bin/moc: 1: /usr/lib/arm-linux-gnueabihf/qt5/bin/moc: Syntax error: word unexpected (expecting ")")
AUTOGEN: error: process for /MuseScore/build.release/mscore/moc_exampleview.cpp failed:
/usr/lib/arm-linux-gnueabihf/qt5/bin/moc: 1: /usr/lib/arm-linux-gnueabihf/qt5/bin/moc: Syntax error: word unexpected (expecting ")")
Generating moc_excerptsdialog.cpp
/usr/lib/arm-linux-gnueabihf/qt5/bin/moc: 1: /usr/lib/arm-linux-gnueabihf/qt5/bin/moc: Syntax error: word unexpected (expecting ")")
AUTOGEN: error: process for /MuseScore/build.release/mscore/moc_excerptsdialog.cpp failed:
/usr/lib/arm-linux-gnueabihf/qt5/bin/moc: 1: /usr/lib/arm-linux-gnueabihf/qt5/bin/moc: Syntax error: word unexpected (expecting ")")
Generating moc_file.cpp
/usr/lib/arm-linux-gnueabihf/qt5/bin/moc: 1: /usr/lib/arm-linux-gnueabihf/qt5/bin/moc: Syntax error: word unexpected (expecting ")")
AUTOGEN: error: process for /MuseScore/build.release/mscore/moc_file.cpp failed:
/usr/lib/arm-linux-gnueabihf/qt5/bin/moc: 1: /usr/lib/arm-linux-gnueabihf/qt5/bin/moc: Syntax error: word unexpected (expecting ")")
Generating moc_fretcanvas.cpp
/usr/lib/arm-linux-gnueabihf/qt5/bin/moc: 1: /usr/lib/arm-linux-gnueabihf/qt5/bin/moc: Syntax error: word unexpected (expecting ")")
AUTOGEN: error: process for /MuseScore/build.release/mscore/moc_fretcanvas.cpp failed:
/usr/lib/arm-linux-gnueabihf/qt5/bin/moc: 1: /usr/lib/arm-linux-gnueabihf/qt5/bin/moc: Syntax error: word unexpected (expecting ")")
Generating moc_fretproperties.cpp
/usr/lib/arm-linux-gnueabihf/qt5/bin/moc: 1: /usr/lib/arm-linux-gnueabihf/qt5/bin/moc: Syntax error: word unexpected (expecting ")")
AUTOGEN: error: process for /MuseScore/build.release/mscore/moc_fretproperties.cpp failed:
/usr/lib/arm-linux-gnueabihf/qt5/bin/moc: 1: /usr/lib/arm-linux-gnueabihf/qt5/bin/moc: Syntax error: word unexpected (expecting ")")
Generating moc_greendotbutton.cpp
/usr/lib/arm-linux-gnueabihf/qt5/bin/moc: 1: /usr/lib/arm-linux-gnueabihf/qt5/bin/moc: Syntax error: word unexpected (expecting ")")
AUTOGEN: error: process for /MuseScore/build.release/mscore/moc_greendotbutton.cpp failed:
/usr/lib/arm-linux-gnueabihf/qt5/bin/moc: 1: /usr/lib/arm-linux-gnueabihf/qt5/bin/moc: Syntax error: word unexpected (expecting ")")
Generating moc_harmonycanvas.cpp
/usr/lib/arm-linux-gnueabihf/qt5/bin/moc: 1: /usr/lib/arm-linux-gnueabihf/qt5/bin/moc: Syntax error: word unexpected (expecting ")")
AUTOGEN: error: process for /MuseScore/build.release/mscore/moc_harmonycanvas.cpp failed:
/usr/lib/arm-linux-gnueabihf/qt5/bin/moc: 1: /usr/lib/arm-linux-gnueabihf/qt5/bin/moc: Syntax error: word unexpected (expecting ")")
Generating moc_harmonyedit.cpp
/usr/lib/arm-linux-gnueabihf/qt5/bin/moc: 1: /usr/lib/arm-linux-gnueabihf/qt5/bin/moc: Syntax error: word unexpected (expecting ")")
AUTOGEN: error: process for /MuseScore/build.release/mscore/moc_harmonyedit.cpp failed:
/usr/lib/arm-linux-gnueabihf/qt5/bin/moc: 1: /usr/lib/arm-linux-gnueabihf/qt5/bin/moc: Syntax error: word unexpected (expecting ")")
Generating moc_help.cpp
/usr/lib/arm-linux-gnueabihf/qt5/bin/moc: 1: /usr/lib/arm-linux-gnueabihf/qt5/bin/moc: Syntax error: word unexpected (expecting ")")
AUTOGEN: error: process for /MuseScore/build.release/mscore/moc_help.cpp failed:
/usr/lib/arm-linux-gnueabihf/qt5/bin/moc: 1: /usr/lib/arm-linux-gnueabihf/qt5/bin/moc: Syntax error: word unexpected (expecting ")")
Generating moc_helpBrowser.cpp
/usr/lib/arm-linux-gnueabihf/qt5/bin/moc: 1: /usr/lib/arm-linux-gnueabihf/qt5/bin/moc: Syntax error: word unexpected (expecting ")")
AUTOGEN: error: process for /MuseScore/build.release/mscore/moc_helpBrowser.cpp failed:
/usr/lib/arm-linux-gnueabihf/qt5/bin/moc: 1: /usr/lib/arm-linux-gnueabihf/qt5/bin/moc: Syntax error: word unexpected (expecting ")")
Generating moc_importmidi_delegate.cpp
/usr/lib/arm-linux-gnueabihf/qt5/bin/moc: 1: /usr/lib/arm-linux-gnueabihf/qt5/bin/moc: Syntax error: word unexpected (expecting ")")
AUTOGEN: error: process for /MuseScore/build.release/mscore/moc_importmidi_delegate.cpp failed:
/usr/lib/arm-linux-gnueabihf/qt5/bin/moc: 1: /usr/lib/arm-linux-gnueabihf/qt5/bin/moc: Syntax error: word unexpected (expecting ")")
Generating moc_importmidi_panel.cpp
/usr/lib/arm-linux-gnueabihf/qt5/bin/moc: 1: /usr/lib/arm-linux-gnueabihf/qt5/bin/moc: Syntax error: word unexpected (expecting ")")
AUTOGEN: error: process for /MuseScore/build.release/mscore/moc_importmidi_panel.cpp failed:
/usr/lib/arm-linux-gnueabihf/qt5/bin/moc: 1: /usr/lib/arm-linux-gnueabihf/qt5/bin/moc: Syntax error: word unexpected (expecting ")")
Generating moc_importmidi_view.cpp
/usr/lib/arm-linux-gnueabihf/qt5/bin/moc: 1: /usr/lib/arm-linux-gnueabihf/qt5/bin/moc: Syntax error: word unexpected (expecting ")")
AUTOGEN: error: process for /MuseScore/build.release/mscore/moc_importmidi_view.cpp failed:
/usr/lib/arm-linux-gnueabihf/qt5/bin/moc: 1: /usr/lib/arm-linux-gnueabihf/qt5/bin/moc: Syntax error: word unexpected (expecting ")")
Generating moc_alignSelect.cpp
/usr/lib/arm-linux-gnueabihf/qt5/bin/moc: 1: /usr/lib/arm-linux-gnueabihf/qt5/bin/moc: Syntax error: word unexpected (expecting ")")
AUTOGEN: error: process for /MuseScore/build.release/mscore/moc_alignSelect.cpp failed:
/usr/lib/arm-linux-gnueabihf/qt5/bin/moc: 1: /usr/lib/arm-linux-gnueabihf/qt5/bin/moc: Syntax error: word unexpected (expecting ")")
Generating moc_inspector.cpp
/usr/lib/arm-linux-gnueabihf/qt5/bin/moc: 1: /usr/lib/arm-linux-gnueabihf/qt5/bin/moc: Syntax error: word unexpected (expecting ")")
AUTOGEN: error: process for /MuseScore/build.release/mscore/moc_inspector.cpp failed:
/usr/lib/arm-linux-gnueabihf/qt5/bin/moc: 1: /usr/lib/arm-linux-gnueabihf/qt5/bin/moc: Syntax error: word unexpected (expecting ")")
Generating moc_inspectorAmbitus.cpp
/usr/lib/arm-linux-gnueabihf/qt5/bin/moc: 1: /usr/lib/arm-linux-gnueabihf/qt5/bin/moc: Syntax error: word unexpected (expecting ")")
AUTOGEN: error: process for /MuseScore/build.release/mscore/moc_inspectorAmbitus.cpp failed:
/usr/lib/arm-linux-gnueabihf/qt5/bin/moc: 1: /usr/lib/arm-linux-gnueabihf/qt5/bin/moc: Syntax error: word unexpected (expecting ")")
Generating moc_inspectorArpeggio.cpp
/usr/lib/arm-linux-gnueabihf/qt5/bin/moc: 1: /usr/lib/arm-linux-gnueabihf/qt5/bin/moc: Syntax error: word unexpected (expecting ")")
AUTOGEN: error: process for /MuseScore/build.release/mscore/moc_inspectorArpeggio.cpp failed:
/usr/lib/arm-linux-gnueabihf/qt5/bin/moc: 1: /usr/lib/arm-linux-gnueabihf/qt5/bin/moc: Syntax error: word unexpected (expecting ")")
Generating moc_inspectorBarline.cpp
/usr/lib/arm-linux-gnueabihf/qt5/bin/moc: 1: /usr/lib/arm-linux-gnueabihf/qt5/bin/moc: Syntax error: word unexpected (expecting ")")
AUTOGEN: error: process for /MuseScore/build.release/mscore/moc_inspectorBarline.cpp failed:
/usr/lib/arm-linux-gnueabihf/qt5/bin/moc: 1: /usr/lib/arm-linux-gnueabihf/qt5/bin/moc: Syntax error: word unexpected (expecting ")")
Generating moc_inspectorBase.cpp
/usr/lib/arm-linux-gnueabihf/qt5/bin/moc: 1: /usr/lib/arm-linux-gnueabihf/qt5/bin/moc: Syntax error: word unexpected (expecting ")")
AUTOGEN: error: process for /MuseScore/build.release/mscore/moc_inspectorBase.cpp failed:
/usr/lib/arm-linux-gnueabihf/qt5/bin/moc: 1: /usr/lib/arm-linux-gnueabihf/qt5/bin/moc: Syntax error: word unexpected (expecting ")")
Generating moc_inspectorBeam.cpp
/usr/lib/arm-linux-gnueabihf/qt5/bin/moc: 1: /usr/lib/arm-linux-gnueabihf/qt5/bin/moc: Syntax error: word unexpected (expecting ")")
AUTOGEN: error: process for /MuseScore/build.release/mscore/moc_inspectorBeam.cpp failed:
/usr/lib/arm-linux-gnueabihf/qt5/bin/moc: 1: /usr/lib/arm-linux-gnueabihf/qt5/bin/moc: Syntax error: word unexpected (expecting ")")
Generating moc_inspectorDynamic.cpp
/usr/lib/arm-linux-gnueabihf/qt5/bin/moc: 1: /usr/lib/arm-linux-gnueabihf/qt5/bin/moc: Syntax error: word unexpected (expecting ")")
AUTOGEN: error: process for /MuseScore/build.release/mscore/moc_inspectorDynamic.cpp failed:
/usr/lib/arm-linux-gnueabihf/qt5/bin/moc: 1: /usr/lib/arm-linux-gnueabihf/qt5/bin/moc: Syntax error: word unexpected (expecting ")")
Generating moc_inspectorElementBase.cpp
/usr/lib/arm-linux-gnueabihf/qt5/bin/moc: 1: /usr/lib/arm-linux-gnueabihf/qt5/bin/moc: Syntax error: word unexpected (expecting ")")
AUTOGEN: error: process for /MuseScore/build.release/mscore/moc_inspectorElementBase.cpp failed:
/usr/lib/arm-linux-gnueabihf/qt5/bin/moc: 1: /usr/lib/arm-linux-gnueabihf/qt5/bin/moc: Syntax error: word unexpected (expecting ")")
Generating moc_inspectorFingering.cpp
/usr/lib/arm-linux-gnueabihf/qt5/bin/moc: 1: /usr/lib/arm-linux-gnueabihf/qt5/bin/moc: Syntax error: word unexpected (expecting ")")
AUTOGEN: error: process for /MuseScore/build.release/mscore/moc_inspectorFingering.cpp failed:
/usr/lib/arm-linux-gnueabihf/qt5/bin/moc: 1: /usr/lib/arm-linux-gnueabihf/qt5/bin/moc: Syntax error: word unexpected (expecting ")")
Generating moc_inspectorFret.cpp
/usr/lib/arm-linux-gnueabihf/qt5/bin/moc: 1: /usr/lib/arm-linux-gnueabihf/qt5/bin/moc: Syntax error: word unexpected (expecting ")")
AUTOGEN: error: process for /MuseScore/build.release/mscore/moc_inspectorFret.cpp failed:
/usr/lib/arm-linux-gnueabihf/qt5/bin/moc: 1: /usr/lib/arm-linux-gnueabihf/qt5/bin/moc: Syntax error: word unexpected (expecting ")")
Generating moc_inspectorGlissando.cpp
/usr/lib/arm-linux-gnueabihf/qt5/bin/moc: 1: /usr/lib/arm-linux-gnueabihf/qt5/bin/moc: Syntax error: word unexpected (expecting ")")
AUTOGEN: error: process for /MuseScore/build.release/mscore/moc_inspectorGlissando.cpp failed:
/usr/lib/arm-linux-gnueabihf/qt5/bin/moc: 1: /usr/lib/arm-linux-gnueabihf/qt5/bin/moc: Syntax error: word unexpected (expecting ")")
Generating moc_inspectorGroupElement.cpp
/usr/lib/arm-linux-gnueabihf/qt5/bin/moc: 1: /usr/lib/arm-linux-gnueabihf/qt5/bin/moc: Syntax error: word unexpected (expecting ")")
AUTOGEN: error: process for /MuseScore/build.release/mscore/moc_inspectorGroupElement.cpp failed:
/usr/lib/arm-linux-gnueabihf/qt5/bin/moc: 1: /usr/lib/arm-linux-gnueabihf/qt5/bin/moc: Syntax error: word unexpected (expecting ")")
Generating moc_inspectorHairpin.cpp
/usr/lib/arm-linux-gnueabihf/qt5/bin/moc: 1: /usr/lib/arm-linux-gnueabihf/qt5/bin/moc: Syntax error: word unexpected (expecting ")")
AUTOGEN: error: process for /MuseScore/build.release/mscore/moc_inspectorHairpin.cpp failed:
/usr/lib/arm-linux-gnueabihf/qt5/bin/moc: 1: /usr/lib/arm-linux-gnueabihf/qt5/bin/moc: Syntax error: word unexpected (expecting ")")
Generating moc_inspectorImage.cpp
/usr/lib/arm-linux-gnueabihf/qt5/bin/moc: 1: /usr/lib/arm-linux-gnueabihf/qt5/bin/moc: Syntax error: word unexpected (expecting ")")
AUTOGEN: error: process for /MuseScore/build.release/mscore/moc_inspectorImage.cpp failed:
/usr/lib/arm-linux-gnueabihf/qt5/bin/moc: 1: /usr/lib/arm-linux-gnueabihf/qt5/bin/moc: Syntax error: word unexpected (expecting ")")
Generating moc_inspectorJump.cpp
/usr/lib/arm-linux-gnueabihf/qt5/bin/moc: 1: /usr/lib/arm-linux-gnueabihf/qt5/bin/moc: Syntax error: word unexpected (expecting ")")
AUTOGEN: error: process for /MuseScore/build.release/mscore/moc_inspectorJump.cpp failed:
/usr/lib/arm-linux-gnueabihf/qt5/bin/moc: 1: /usr/lib/arm-linux-gnueabihf/qt5/bin/moc: Syntax error: word unexpected (expecting ")")
Generating moc_inspectorLasso.cpp
/usr/lib/arm-linux-gnueabihf/qt5/bin/moc: 1: /usr/lib/arm-linux-gnueabihf/qt5/bin/moc: Syntax error: word unexpected (expecting ")")
AUTOGEN: error: process for /MuseScore/build.release/mscore/moc_inspectorLasso.cpp failed:
/usr/lib/arm-linux-gnueabihf/qt5/bin/moc: 1: /usr/lib/arm-linux-gnueabihf/qt5/bin/moc: Syntax error: word unexpected (expecting ")")
Generating moc_inspectorMarker.cpp
/usr/lib/arm-linux-gnueabihf/qt5/bin/moc: 1: /usr/lib/arm-linux-gnueabihf/qt5/bin/moc: Syntax error: word unexpected (expecting ")")
AUTOGEN: error: process for /MuseScore/build.release/mscore/moc_inspectorMarker.cpp failed:
/usr/lib/arm-linux-gnueabihf/qt5/bin/moc: 1: /usr/lib/arm-linux-gnueabihf/qt5/bin/moc: Syntax error: word unexpected (expecting ")")
Generating moc_inspectorNote.cpp
/usr/lib/arm-linux-gnueabihf/qt5/bin/moc: 1: /usr/lib/arm-linux-gnueabihf/qt5/bin/moc: Syntax error: word unexpected (expecting ")")
AUTOGEN: error: process for /MuseScore/build.release/mscore/moc_inspectorNote.cpp failed:
/usr/lib/arm-linux-gnueabihf/qt5/bin/moc: 1: /usr/lib/arm-linux-gnueabihf/qt5/bin/moc: Syntax error: word unexpected (expecting ")")
Generating moc_inspectorOttava.cpp
/usr/lib/arm-linux-gnueabihf/qt5/bin/moc: 1: /usr/lib/arm-linux-gnueabihf/qt5/bin/moc: Syntax error: word unexpected (expecting ")")
AUTOGEN: error: process for /MuseScore/build.release/mscore/moc_inspectorOttava.cpp failed:
/usr/lib/arm-linux-gnueabihf/qt5/bin/moc: 1: /usr/lib/arm-linux-gnueabihf/qt5/bin/moc: Syntax error: word unexpected (expecting ")")
Generating moc_inspectorText.cpp
/usr/lib/arm-linux-gnueabihf/qt5/bin/moc: 1: /usr/lib/arm-linux-gnueabihf/qt5/bin/moc: Syntax error: word unexpected (expecting ")")
AUTOGEN: error: process for /MuseScore/build.release/mscore/moc_inspectorText.cpp failed:
/usr/lib/arm-linux-gnueabihf/qt5/bin/moc: 1: /usr/lib/arm-linux-gnueabihf/qt5/bin/moc: Syntax error: word unexpected (expecting ")")
Generating moc_inspectorTextBase.cpp
/usr/lib/arm-linux-gnueabihf/qt5/bin/moc: 1: /usr/lib/arm-linux-gnueabihf/qt5/bin/moc: Syntax error: word unexpected (expecting ")")
AUTOGEN: error: process for /MuseScore/build.release/mscore/moc_inspectorTextBase.cpp failed:
/usr/lib/arm-linux-gnueabihf/qt5/bin/moc: 1: /usr/lib/arm-linux-gnueabihf/qt5/bin/moc: Syntax error: word unexpected (expecting ")")
Generating moc_inspectorTextLine.cpp
/usr/lib/arm-linux-gnueabihf/qt5/bin/moc: 1: /usr/lib/arm-linux-gnueabihf/qt5/bin/moc: Syntax error: word unexpected (expecting ")")
AUTOGEN: error: process for /MuseScore/build.release/mscore/moc_inspectorTextLine.cpp failed:
/usr/lib/arm-linux-gnueabihf/qt5/bin/moc: 1: /usr/lib/arm-linux-gnueabihf/qt5/bin/moc: Syntax error: word unexpected (expecting ")")
Generating moc_inspectorTrill.cpp
/usr/lib/arm-linux-gnueabihf/qt5/bin/moc: 1: /usr/lib/arm-linux-gnueabihf/qt5/bin/moc: Syntax error: word unexpected (expecting ")")
AUTOGEN: error: process for /MuseScore/build.release/mscore/moc_inspectorTrill.cpp failed:
/usr/lib/arm-linux-gnueabihf/qt5/bin/moc: 1: /usr/lib/arm-linux-gnueabihf/qt5/bin/moc: Syntax error: word unexpected (expecting ")")
Generating moc_inspectorVolta.cpp
/usr/lib/arm-linux-gnueabihf/qt5/bin/moc: 1: /usr/lib/arm-linux-gnueabihf/qt5/bin/moc: Syntax error: word unexpected (expecting ")")
AUTOGEN: error: process for /MuseScore/build.release/mscore/moc_inspectorVolta.cpp failed:
/usr/lib/arm-linux-gnueabihf/qt5/bin/moc: 1: /usr/lib/arm-linux-gnueabihf/qt5/bin/moc: Syntax error: word unexpected (expecting ")")
Generating moc_offsetSelect.cpp
/usr/lib/arm-linux-gnueabihf/qt5/bin/moc: 1: /usr/lib/arm-linux-gnueabihf/qt5/bin/moc: Syntax error: word unexpected (expecting ")")
AUTOGEN: error: process for /MuseScore/build.release/mscore/moc_offsetSelect.cpp failed:
/usr/lib/arm-linux-gnueabihf/qt5/bin/moc: 1: /usr/lib/arm-linux-gnueabihf/qt5/bin/moc: Syntax error: word unexpected (expecting ")")
Generating moc_scaleSelect.cpp
/usr/lib/arm-linux-gnueabihf/qt5/bin/moc: 1: /usr/lib/arm-linux-gnueabihf/qt5/bin/moc: Syntax error: word unexpected (expecting ")")
AUTOGEN: error: process for /MuseScore/build.release/mscore/moc_scaleSelect.cpp failed:
/usr/lib/arm-linux-gnueabihf/qt5/bin/moc: 1: /usr/lib/arm-linux-gnueabihf/qt5/bin/moc: Syntax error: word unexpected (expecting ")")
Generating moc_sizeSelect.cpp
/usr/lib/arm-linux-gnueabihf/qt5/bin/moc: 1: /usr/lib/arm-linux-gnueabihf/qt5/bin/moc: Syntax error: word unexpected (expecting ")")
AUTOGEN: error: process for /MuseScore/build.release/mscore/moc_sizeSelect.cpp failed:
/usr/lib/arm-linux-gnueabihf/qt5/bin/moc: 1: /usr/lib/arm-linux-gnueabihf/qt5/bin/moc: Syntax error: word unexpected (expecting ")")
Generating moc_instrdialog.cpp
/usr/lib/arm-linux-gnueabihf/qt5/bin/moc: 1: /usr/lib/arm-linux-gnueabihf/qt5/bin/moc: Syntax error: word unexpected (expecting ")")
AUTOGEN: error: process for /MuseScore/build.release/mscore/moc_instrdialog.cpp failed:
/usr/lib/arm-linux-gnueabihf/qt5/bin/moc: 1: /usr/lib/arm-linux-gnueabihf/qt5/bin/moc: Syntax error: word unexpected (expecting ")")
Generating moc_instrwidget.cpp
/usr/lib/arm-linux-gnueabihf/qt5/bin/moc: 1: /usr/lib/arm-linux-gnueabihf/qt5/bin/moc: Syntax error: word unexpected (expecting ")")
AUTOGEN: error: process for /MuseScore/build.release/mscore/moc_instrwidget.cpp failed:
/usr/lib/arm-linux-gnueabihf/qt5/bin/moc: 1: /usr/lib/arm-linux-gnueabihf/qt5/bin/moc: Syntax error: word unexpected (expecting ")")
Generating moc_keycanvas.cpp
/usr/lib/arm-linux-gnueabihf/qt5/bin/moc: 1: /usr/lib/arm-linux-gnueabihf/qt5/bin/moc: Syntax error: word unexpected (expecting ")")
AUTOGEN: error: process for /MuseScore/build.release/mscore/moc_keycanvas.cpp failed:
/usr/lib/arm-linux-gnueabihf/qt5/bin/moc: 1: /usr/lib/arm-linux-gnueabihf/qt5/bin/moc: Syntax error: word unexpected (expecting ")")
Generating moc_keyedit.cpp
/usr/lib/arm-linux-gnueabihf/qt5/bin/moc: 1: /usr/lib/arm-linux-gnueabihf/qt5/bin/moc: Syntax error: word unexpected (expecting ")")
AUTOGEN: error: process for /MuseScore/build.release/mscore/moc_keyedit.cpp failed:
/usr/lib/arm-linux-gnueabihf/qt5/bin/moc: 1: /usr/lib/arm-linux-gnueabihf/qt5/bin/moc: Syntax error: word unexpected (expecting ")")
Generating moc_layer.cpp
/usr/lib/arm-linux-gnueabihf/qt5/bin/moc: 1: /usr/lib/arm-linux-gnueabihf/qt5/bin/moc: Syntax error: word unexpected (expecting ")")
AUTOGEN: error: process for /MuseScore/build.release/mscore/moc_layer.cpp failed:
/usr/lib/arm-linux-gnueabihf/qt5/bin/moc: 1: /usr/lib/arm-linux-gnueabihf/qt5/bin/moc: Syntax error: word unexpected (expecting ")")
Generating moc_logindialog.cpp
/usr/lib/arm-linux-gnueabihf/qt5/bin/moc: 1: /usr/lib/arm-linux-gnueabihf/qt5/bin/moc: Syntax error: word unexpected (expecting ")")
AUTOGEN: error: process for /MuseScore/build.release/mscore/moc_logindialog.cpp failed:
/usr/lib/arm-linux-gnueabihf/qt5/bin/moc: 1: /usr/lib/arm-linux-gnueabihf/qt5/bin/moc: Syntax error: word unexpected (expecting ")")
Generating moc_loginmanager.cpp
/usr/lib/arm-linux-gnueabihf/qt5/bin/moc: 1: /usr/lib/arm-linux-gnueabihf/qt5/bin/moc: Syntax error: word unexpected (expecting ")")
AUTOGEN: error: process for /MuseScore/build.release/mscore/moc_loginmanager.cpp failed:
/usr/lib/arm-linux-gnueabihf/qt5/bin/moc: 1: /usr/lib/arm-linux-gnueabihf/qt5/bin/moc: Syntax error: word unexpected (expecting ")")
Generating moc_magbox.cpp
/usr/lib/arm-linux-gnueabihf/qt5/bin/moc: 1: /usr/lib/arm-linux-gnueabihf/qt5/bin/moc: Syntax error: word unexpected (expecting ")")
AUTOGEN: error: process for /MuseScore/build.release/mscore/moc_magbox.cpp failed:
/usr/lib/arm-linux-gnueabihf/qt5/bin/moc: 1: /usr/lib/arm-linux-gnueabihf/qt5/bin/moc: Syntax error: word unexpected (expecting ")")
Generating moc_masterpalette.cpp
/usr/lib/arm-linux-gnueabihf/qt5/bin/moc: 1: /usr/lib/arm-linux-gnueabihf/qt5/bin/moc: Syntax error: word unexpected (expecting ")")
AUTOGEN: error: process for /MuseScore/build.release/mscore/moc_masterpalette.cpp failed:
/usr/lib/arm-linux-gnueabihf/qt5/bin/moc: 1: /usr/lib/arm-linux-gnueabihf/qt5/bin/moc: Syntax error: word unexpected (expecting ")")
Generating moc_measureproperties.cpp
/usr/lib/arm-linux-gnueabihf/qt5/bin/moc: 1: /usr/lib/arm-linux-gnueabihf/qt5/bin/moc: Syntax error: word unexpected (expecting ")")
AUTOGEN: error: process for /MuseScore/build.release/mscore/moc_measureproperties.cpp failed:
/usr/lib/arm-linux-gnueabihf/qt5/bin/moc: 1: /usr/lib/arm-linux-gnueabihf/qt5/bin/moc: Syntax error: word unexpected (expecting ")")
Generating moc_mediadialog.cpp
/usr/lib/arm-linux-gnueabihf/qt5/bin/moc: 1: /usr/lib/arm-linux-gnueabihf/qt5/bin/moc: Syntax error: word unexpected (expecting ")")
AUTOGEN: error: process for /MuseScore/build.release/mscore/moc_mediadialog.cpp failed:
/usr/lib/arm-linux-gnueabihf/qt5/bin/moc: 1: /usr/lib/arm-linux-gnueabihf/qt5/bin/moc: Syntax error: word unexpected (expecting ")")
Generating moc_metaedit.cpp
/usr/lib/arm-linux-gnueabihf/qt5/bin/moc: 1: /usr/lib/arm-linux-gnueabihf/qt5/bin/moc: Syntax error: word unexpected (expecting ")")
AUTOGEN: error: process for /MuseScore/build.release/mscore/moc_metaedit.cpp failed:
/usr/lib/arm-linux-gnueabihf/qt5/bin/moc: 1: /usr/lib/arm-linux-gnueabihf/qt5/bin/moc: Syntax error: word unexpected (expecting ")")
Generating moc_mixer.cpp
/usr/lib/arm-linux-gnueabihf/qt5/bin/moc: 1: /usr/lib/arm-linux-gnueabihf/qt5/bin/moc: Syntax error: word unexpected (expecting ")")
AUTOGEN: error: process for /MuseScore/build.release/mscore/moc_mixer.cpp failed:
/usr/lib/arm-linux-gnueabihf/qt5/bin/moc: 1: /usr/lib/arm-linux-gnueabihf/qt5/bin/moc: Syntax error: word unexpected (expecting ")")
Generating moc_musescore.cpp
/usr/lib/arm-linux-gnueabihf/qt5/bin/moc: 1: /usr/lib/arm-linux-gnueabihf/qt5/bin/moc: Syntax error: word unexpected (expecting ")")
AUTOGEN: error: process for /MuseScore/build.release/mscore/moc_musescore.cpp failed:
/usr/lib/arm-linux-gnueabihf/qt5/bin/moc: 1: /usr/lib/arm-linux-gnueabihf/qt5/bin/moc: Syntax error: word unexpected (expecting ")")
Generating moc_navigator.cpp
/usr/lib/arm-linux-gnueabihf/qt5/bin/moc: 1: /usr/lib/arm-linux-gnueabihf/qt5/bin/moc: Syntax error: word unexpected (expecting ")")
AUTOGEN: error: process for /MuseScore/build.release/mscore/moc_navigator.cpp failed:
/usr/lib/arm-linux-gnueabihf/qt5/bin/moc: 1: /usr/lib/arm-linux-gnueabihf/qt5/bin/moc: Syntax error: word unexpected (expecting ")")
Generating moc_newwizard.cpp
/usr/lib/arm-linux-gnueabihf/qt5/bin/moc: 1: /usr/lib/arm-linux-gnueabihf/qt5/bin/moc: Syntax error: word unexpected (expecting ")")
AUTOGEN: error: process for /MuseScore/build.release/mscore/moc_newwizard.cpp failed:
/usr/lib/arm-linux-gnueabihf/qt5/bin/moc: 1: /usr/lib/arm-linux-gnueabihf/qt5/bin/moc: Syntax error: word unexpected (expecting ")")
Generating moc_noteGroups.cpp
/usr/lib/arm-linux-gnueabihf/qt5/bin/moc: 1: /usr/lib/arm-linux-gnueabihf/qt5/bin/moc: Syntax error: word unexpected (expecting ")")
AUTOGEN: error: process for /MuseScore/build.release/mscore/moc_noteGroups.cpp failed:
/usr/lib/arm-linux-gnueabihf/qt5/bin/moc: 1: /usr/lib/arm-linux-gnueabihf/qt5/bin/moc: Syntax error: word unexpected (expecting ")")
Generating moc_omrpanel.cpp
/usr/lib/arm-linux-gnueabihf/qt5/bin/moc: 1: /usr/lib/arm-linux-gnueabihf/qt5/bin/moc: Syntax error: word unexpected (expecting ")")
AUTOGEN: error: process for /MuseScore/build.release/mscore/moc_omrpanel.cpp failed:
/usr/lib/arm-linux-gnueabihf/qt5/bin/moc: 1: /usr/lib/arm-linux-gnueabihf/qt5/bin/moc: Syntax error: word unexpected (expecting ")")
Generating moc_pagesettings.cpp
/usr/lib/arm-linux-gnueabihf/qt5/bin/moc: 1: /usr/lib/arm-linux-gnueabihf/qt5/bin/moc: Syntax error: word unexpected (expecting ")")
AUTOGEN: error: process for /MuseScore/build.release/mscore/moc_pagesettings.cpp failed:
/usr/lib/arm-linux-gnueabihf/qt5/bin/moc: 1: /usr/lib/arm-linux-gnueabihf/qt5/bin/moc: Syntax error: word unexpected (expecting ")")
Generating moc_palette.cpp
/usr/lib/arm-linux-gnueabihf/qt5/bin/moc: 1: /usr/lib/arm-linux-gnueabihf/qt5/bin/moc: Syntax error: word unexpected (expecting ")")
AUTOGEN: error: process for /MuseScore/build.release/mscore/moc_palette.cpp failed:
/usr/lib/arm-linux-gnueabihf/qt5/bin/moc: 1: /usr/lib/arm-linux-gnueabihf/qt5/bin/moc: Syntax error: word unexpected (expecting ")")
Generating moc_paletteBoxButton.cpp
/usr/lib/arm-linux-gnueabihf/qt5/bin/moc: 1: /usr/lib/arm-linux-gnueabihf/qt5/bin/moc: Syntax error: word unexpected (expecting ")")
AUTOGEN: error: process for /MuseScore/build.release/mscore/moc_paletteBoxButton.cpp failed:
/usr/lib/arm-linux-gnueabihf/qt5/bin/moc: 1: /usr/lib/arm-linux-gnueabihf/qt5/bin/moc: Syntax error: word unexpected (expecting ")")
Generating moc_palettebox.cpp
/usr/lib/arm-linux-gnueabihf/qt5/bin/moc: 1: /usr/lib/arm-linux-gnueabihf/qt5/bin/moc: Syntax error: word unexpected (expecting ")")
AUTOGEN: error: process for /MuseScore/build.release/mscore/moc_palettebox.cpp failed:
/usr/lib/arm-linux-gnueabihf/qt5/bin/moc: 1: /usr/lib/arm-linux-gnueabihf/qt5/bin/moc: Syntax error: word unexpected (expecting ")")
Generating moc_pathlistdialog.cpp
/usr/lib/arm-linux-gnueabihf/qt5/bin/moc: 1: /usr/lib/arm-linux-gnueabihf/qt5/bin/moc: Syntax error: word unexpected (expecting ")")
AUTOGEN: error: process for /MuseScore/build.release/mscore/moc_pathlistdialog.cpp failed:
/usr/lib/arm-linux-gnueabihf/qt5/bin/moc: 1: /usr/lib/arm-linux-gnueabihf/qt5/bin/moc: Syntax error: word unexpected (expecting ")")
Generating moc_piano.cpp
/usr/lib/arm-linux-gnueabihf/qt5/bin/moc: 1: /usr/lib/arm-linux-gnueabihf/qt5/bin/moc: Syntax error: word unexpected (expecting ")")
AUTOGEN: error: process for /MuseScore/build.release/mscore/moc_piano.cpp failed:
/usr/lib/arm-linux-gnueabihf/qt5/bin/moc: 1: /usr/lib/arm-linux-gnueabihf/qt5/bin/moc: Syntax error: word unexpected (expecting ")")
Generating moc_pianoroll.cpp
/usr/lib/arm-linux-gnueabihf/qt5/bin/moc: 1: /usr/lib/arm-linux-gnueabihf/qt5/bin/moc: Syntax error: word unexpected (expecting ")")
AUTOGEN: error: process for /MuseScore/build.release/mscore/moc_pianoroll.cpp failed:
/usr/lib/arm-linux-gnueabihf/qt5/bin/moc: 1: /usr/lib/arm-linux-gnueabihf/qt5/bin/moc: Syntax error: word unexpected (expecting ")")
Generating moc_pianotools.cpp
/usr/lib/arm-linux-gnueabihf/qt5/bin/moc: 1: /usr/lib/arm-linux-gnueabihf/qt5/bin/moc: Syntax error: word unexpected (expecting ")")
AUTOGEN: error: process for /MuseScore/build.release/mscore/moc_pianotools.cpp failed:
/usr/lib/arm-linux-gnueabihf/qt5/bin/moc: 1: /usr/lib/arm-linux-gnueabihf/qt5/bin/moc: Syntax error: word unexpected (expecting ")")
Generating moc_pianoview.cpp
/usr/lib/arm-linux-gnueabihf/qt5/bin/moc: 1: /usr/lib/arm-linux-gnueabihf/qt5/bin/moc: Syntax error: word unexpected (expecting ")")
AUTOGEN: error: process for /MuseScore/build.release/mscore/moc_pianoview.cpp failed:
/usr/lib/arm-linux-gnueabihf/qt5/bin/moc: 1: /usr/lib/arm-linux-gnueabihf/qt5/bin/moc: Syntax error: word unexpected (expecting ")")
Generating moc_playpanel.cpp
/usr/lib/arm-linux-gnueabihf/qt5/bin/moc: 1: /usr/lib/arm-linux-gnueabihf/qt5/bin/moc: Syntax error: word unexpected (expecting ")")
AUTOGEN: error: process for /MuseScore/build.release/mscore/moc_playpanel.cpp failed:
/usr/lib/arm-linux-gnueabihf/qt5/bin/moc: 1: /usr/lib/arm-linux-gnueabihf/qt5/bin/moc: Syntax error: word unexpected (expecting ")")
Generating moc_pluginCreator.cpp
/usr/lib/arm-linux-gnueabihf/qt5/bin/moc: 1: /usr/lib/arm-linux-gnueabihf/qt5/bin/moc: Syntax error: word unexpected (expecting ")")
AUTOGEN: error: process for /MuseScore/build.release/mscore/moc_pluginCreator.cpp failed:
/usr/lib/arm-linux-gnueabihf/qt5/bin/moc: 1: /usr/lib/arm-linux-gnueabihf/qt5/bin/moc: Syntax error: word unexpected (expecting ")")
Generating moc_pluginManager.cpp
/usr/lib/arm-linux-gnueabihf/qt5/bin/moc: 1: /usr/lib/arm-linux-gnueabihf/qt5/bin/moc: Syntax error: word unexpected (expecting ")")
AUTOGEN: error: process for /MuseScore/build.release/mscore/moc_pluginManager.cpp failed:
/usr/lib/arm-linux-gnueabihf/qt5/bin/moc: 1: /usr/lib/arm-linux-gnueabihf/qt5/bin/moc: Syntax error: word unexpected (expecting ")")
Generating moc_prefsdialog.cpp
/usr/lib/arm-linux-gnueabihf/qt5/bin/moc: 1: /usr/lib/arm-linux-gnueabihf/qt5/bin/moc: Syntax error: word unexpected (expecting ")")
AUTOGEN: error: process for /MuseScore/build.release/mscore/moc_prefsdialog.cpp failed:
/usr/lib/arm-linux-gnueabihf/qt5/bin/moc: 1: /usr/lib/arm-linux-gnueabihf/qt5/bin/moc: Syntax error: word unexpected (expecting ")")
Generating moc_qmledit.cpp
/usr/lib/arm-linux-gnueabihf/qt5/bin/moc: 1: /usr/lib/arm-linux-gnueabihf/qt5/bin/moc: Syntax error: word unexpected (expecting ")")
AUTOGEN: error: process for /MuseScore/build.release/mscore/moc_qmledit.cpp failed:
/usr/lib/arm-linux-gnueabihf/qt5/bin/moc: 1: /usr/lib/arm-linux-gnueabihf/qt5/bin/moc: Syntax error: word unexpected (expecting ")")
Generating moc_qmlplugin.cpp
/usr/lib/arm-linux-gnueabihf/qt5/bin/moc: 1: /usr/lib/arm-linux-gnueabihf/qt5/bin/moc: Syntax error: word unexpected (expecting ")")
AUTOGEN: error: process for /MuseScore/build.release/mscore/moc_qmlplugin.cpp failed:
/usr/lib/arm-linux-gnueabihf/qt5/bin/moc: 1: /usr/lib/arm-linux-gnueabihf/qt5/bin/moc: Syntax error: word unexpected (expecting ")")
Generating moc_recordbutton.cpp
/usr/lib/arm-linux-gnueabihf/qt5/bin/moc: 1: /usr/lib/arm-linux-gnueabihf/qt5/bin/moc: Syntax error: word unexpected (expecting ")")
AUTOGEN: error: process for /MuseScore/build.release/mscore/moc_recordbutton.cpp failed:
/usr/lib/arm-linux-gnueabihf/qt5/bin/moc: 1: /usr/lib/arm-linux-gnueabihf/qt5/bin/moc: Syntax error: word unexpected (expecting ")")
Generating moc_resourceManager.cpp
/usr/lib/arm-linux-gnueabihf/qt5/bin/moc: 1: /usr/lib/arm-linux-gnueabihf/qt5/bin/moc: Syntax error: word unexpected (expecting ")")
AUTOGEN: error: process for /MuseScore/build.release/mscore/moc_resourceManager.cpp failed:
/usr/lib/arm-linux-gnueabihf/qt5/bin/moc: 1: /usr/lib/arm-linux-gnueabihf/qt5/bin/moc: Syntax error: word unexpected (expecting ")")
Generating moc_ruler.cpp
/usr/lib/arm-linux-gnueabihf/qt5/bin/moc: 1: /usr/lib/arm-linux-gnueabihf/qt5/bin/moc: Syntax error: word unexpected (expecting ")")
AUTOGEN: error: process for /MuseScore/build.release/mscore/moc_ruler.cpp failed:
/usr/lib/arm-linux-gnueabihf/qt5/bin/moc: 1: /usr/lib/arm-linux-gnueabihf/qt5/bin/moc: Syntax error: word unexpected (expecting ")")
Generating moc_scoreBrowser.cpp
/usr/lib/arm-linux-gnueabihf/qt5/bin/moc: 1: /usr/lib/arm-linux-gnueabihf/qt5/bin/moc: Syntax error: word unexpected (expecting ")")
AUTOGEN: error: process for /MuseScore/build.release/mscore/moc_scoreBrowser.cpp failed:
/usr/lib/arm-linux-gnueabihf/qt5/bin/moc: 1: /usr/lib/arm-linux-gnueabihf/qt5/bin/moc: Syntax error: word unexpected (expecting ")")
Generating moc_scorePreview.cpp
/usr/lib/arm-linux-gnueabihf/qt5/bin/moc: 1: /usr/lib/arm-linux-gnueabihf/qt5/bin/moc: Syntax error: word unexpected (expecting ")")
AUTOGEN: error: process for /MuseScore/build.release/mscore/moc_scorePreview.cpp failed:
/usr/lib/arm-linux-gnueabihf/qt5/bin/moc: 1: /usr/lib/arm-linux-gnueabihf/qt5/bin/moc: Syntax error: word unexpected (expecting ")")
Generating moc_scoreaccessibility.cpp
/usr/lib/arm-linux-gnueabihf/qt5/bin/moc: 1: /usr/lib/arm-linux-gnueabihf/qt5/bin/moc: Syntax error: word unexpected (expecting ")")
AUTOGEN: error: process for /MuseScore/build.release/mscore/moc_scoreaccessibility.cpp failed:
/usr/lib/arm-linux-gnueabihf/qt5/bin/moc: 1: /usr/lib/arm-linux-gnueabihf/qt5/bin/moc: Syntax error: word unexpected (expecting ")")
Generating moc_scoretab.cpp
/usr/lib/arm-linux-gnueabihf/qt5/bin/moc: 1: /usr/lib/arm-linux-gnueabihf/qt5/bin/moc: Syntax error: word unexpected (expecting ")")
AUTOGEN: error: process for /MuseScore/build.release/mscore/moc_scoretab.cpp failed:
/usr/lib/arm-linux-gnueabihf/qt5/bin/moc: 1: /usr/lib/arm-linux-gnueabihf/qt5/bin/moc: Syntax error: word unexpected (expecting ")")
Generating moc_scoreview.cpp
/usr/lib/arm-linux-gnueabihf/qt5/bin/moc: 1: /usr/lib/arm-linux-gnueabihf/qt5/bin/moc: Syntax error: word unexpected (expecting ")")
AUTOGEN: error: process for /MuseScore/build.release/mscore/moc_scoreview.cpp failed:
/usr/lib/arm-linux-gnueabihf/qt5/bin/moc: 1: /usr/lib/arm-linux-gnueabihf/qt5/bin/moc: Syntax error: word unexpected (expecting ")")
Generating moc_searchComboBox.cpp
/usr/lib/arm-linux-gnueabihf/qt5/bin/moc: 1: /usr/lib/arm-linux-gnueabihf/qt5/bin/moc: Syntax error: word unexpected (expecting ")")
AUTOGEN: error: process for /MuseScore/build.release/mscore/moc_searchComboBox.cpp failed:
/usr/lib/arm-linux-gnueabihf/qt5/bin/moc: 1: /usr/lib/arm-linux-gnueabihf/qt5/bin/moc: Syntax error: word unexpected (expecting ")")
Generating moc_sectionbreakprop.cpp
/usr/lib/arm-linux-gnueabihf/qt5/bin/moc: 1: /usr/lib/arm-linux-gnueabihf/qt5/bin/moc: Syntax error: word unexpected (expecting ")")
AUTOGEN: error: process for /MuseScore/build.release/mscore/moc_sectionbreakprop.cpp failed:
/usr/lib/arm-linux-gnueabihf/qt5/bin/moc: 1: /usr/lib/arm-linux-gnueabihf/qt5/bin/moc: Syntax error: word unexpected (expecting ")")
Generating moc_selectdialog.cpp
/usr/lib/arm-linux-gnueabihf/qt5/bin/moc: 1: /usr/lib/arm-linux-gnueabihf/qt5/bin/moc: Syntax error: word unexpected (expecting ")")
AUTOGEN: error: process for /MuseScore/build.release/mscore/moc_selectdialog.cpp failed:
/usr/lib/arm-linux-gnueabihf/qt5/bin/moc: 1: /usr/lib/arm-linux-gnueabihf/qt5/bin/moc: Syntax error: word unexpected (expecting ")")
Generating moc_selectionwindow.cpp
/usr/lib/arm-linux-gnueabihf/qt5/bin/moc: 1: /usr/lib/arm-linux-gnueabihf/qt5/bin/moc: Syntax error: word unexpected (expecting ")")
AUTOGEN: error: process for /MuseScore/build.release/mscore/moc_selectionwindow.cpp failed:
/usr/lib/arm-linux-gnueabihf/qt5/bin/moc: 1: /usr/lib/arm-linux-gnueabihf/qt5/bin/moc: Syntax error: word unexpected (expecting ")")
Generating moc_selectnotedialog.cpp
/usr/lib/arm-linux-gnueabihf/qt5/bin/moc: 1: /usr/lib/arm-linux-gnueabihf/qt5/bin/moc: Syntax error: word unexpected (expecting ")")
AUTOGEN: error: process for /MuseScore/build.release/mscore/moc_selectnotedialog.cpp failed:
/usr/lib/arm-linux-gnueabihf/qt5/bin/moc: 1: /usr/lib/arm-linux-gnueabihf/qt5/bin/moc: Syntax error: word unexpected (expecting ")")
Generating moc_selinstrument.cpp
/usr/lib/arm-linux-gnueabihf/qt5/bin/moc: 1: /usr/lib/arm-linux-gnueabihf/qt5/bin/moc: Syntax error: word unexpected (expecting ")")
AUTOGEN: error: process for /MuseScore/build.release/mscore/moc_selinstrument.cpp failed:
/usr/lib/arm-linux-gnueabihf/qt5/bin/moc: 1: /usr/lib/arm-linux-gnueabihf/qt5/bin/moc: Syntax error: word unexpected (expecting ")")
Generating moc_seq.cpp
/usr/lib/arm-linux-gnueabihf/qt5/bin/moc: 1: /usr/lib/arm-linux-gnueabihf/qt5/bin/moc: Syntax error: word unexpected (expecting ")")
AUTOGEN: error: process for /MuseScore/build.release/mscore/moc_seq.cpp failed:
/usr/lib/arm-linux-gnueabihf/qt5/bin/moc: 1: /usr/lib/arm-linux-gnueabihf/qt5/bin/moc: Syntax error: word unexpected (expecting ")")
Generating moc_shortcutcapturedialog.cpp
/usr/lib/arm-linux-gnueabihf/qt5/bin/moc: 1: /usr/lib/arm-linux-gnueabihf/qt5/bin/moc: Syntax error: word unexpected (expecting ")")
AUTOGEN: error: process for /MuseScore/build.release/mscore/moc_shortcutcapturedialog.cpp failed:
/usr/lib/arm-linux-gnueabihf/qt5/bin/moc: 1: /usr/lib/arm-linux-gnueabihf/qt5/bin/moc: Syntax error: word unexpected (expecting ")")
Generating moc_simplebutton.cpp
/usr/lib/arm-linux-gnueabihf/qt5/bin/moc: 1: /usr/lib/arm-linux-gnueabihf/qt5/bin/moc: Syntax error: word unexpected (expecting ")")
AUTOGEN: error: process for /MuseScore/build.release/mscore/moc_simplebutton.cpp failed:
/usr/lib/arm-linux-gnueabihf/qt5/bin/moc: 1: /usr/lib/arm-linux-gnueabihf/qt5/bin/moc: Syntax error: word unexpected (expecting ")")
Generating moc_splitstaff.cpp
/usr/lib/arm-linux-gnueabihf/qt5/bin/moc: 1: /usr/lib/arm-linux-gnueabihf/qt5/bin/moc: Syntax error: word unexpected (expecting ")")
AUTOGEN: error: process for /MuseScore/build.release/mscore/moc_splitstaff.cpp failed:
/usr/lib/arm-linux-gnueabihf/qt5/bin/moc: 1: /usr/lib/arm-linux-gnueabihf/qt5/bin/moc: Syntax error: word unexpected (expecting ")")
Generating moc_stafftextproperties.cpp
/usr/lib/arm-linux-gnueabihf/qt5/bin/moc: 1: /usr/lib/arm-linux-gnueabihf/qt5/bin/moc: Syntax error: word unexpected (expecting ")")
AUTOGEN: error: process for /MuseScore/build.release/mscore/moc_stafftextproperties.cpp failed:
/usr/lib/arm-linux-gnueabihf/qt5/bin/moc: 1: /usr/lib/arm-linux-gnueabihf/qt5/bin/moc: Syntax error: word unexpected (expecting ")")
Generating moc_startcenter.cpp
/usr/lib/arm-linux-gnueabihf/qt5/bin/moc: 1: /usr/lib/arm-linux-gnueabihf/qt5/bin/moc: Syntax error: word unexpected (expecting ")")
AUTOGEN: error: process for /MuseScore/build.release/mscore/moc_startcenter.cpp failed:
/usr/lib/arm-linux-gnueabihf/qt5/bin/moc: 1: /usr/lib/arm-linux-gnueabihf/qt5/bin/moc: Syntax error: word unexpected (expecting ")")
Generating moc_startupWizard.cpp
/usr/lib/arm-linux-gnueabihf/qt5/bin/moc: 1: /usr/lib/arm-linux-gnueabihf/qt5/bin/moc: Syntax error: word unexpected (expecting ")")
AUTOGEN: error: process for /MuseScore/build.release/mscore/moc_startupWizard.cpp failed:
/usr/lib/arm-linux-gnueabihf/qt5/bin/moc: 1: /usr/lib/arm-linux-gnueabihf/qt5/bin/moc: Syntax error: word unexpected (expecting ")")
Generating moc_symboldialog.cpp
/usr/lib/arm-linux-gnueabihf/qt5/bin/moc: 1: /usr/lib/arm-linux-gnueabihf/qt5/bin/moc: Syntax error: word unexpected (expecting ")")
AUTOGEN: error: process for /MuseScore/build.release/mscore/moc_symboldialog.cpp failed:
/usr/lib/arm-linux-gnueabihf/qt5/bin/moc: 1: /usr/lib/arm-linux-gnueabihf/qt5/bin/moc: Syntax error: word unexpected (expecting ")")
Generating moc_synthcontrol.cpp
/usr/lib/arm-linux-gnueabihf/qt5/bin/moc: 1: /usr/lib/arm-linux-gnueabihf/qt5/bin/moc: Syntax error: word unexpected (expecting ")")
AUTOGEN: error: process for /MuseScore/build.release/mscore/moc_synthcontrol.cpp failed:
/usr/lib/arm-linux-gnueabihf/qt5/bin/moc: 1: /usr/lib/arm-linux-gnueabihf/qt5/bin/moc: Syntax error: word unexpected (expecting ")")
Generating moc_textpalette.cpp
/usr/lib/arm-linux-gnueabihf/qt5/bin/moc: 1: /usr/lib/arm-linux-gnueabihf/qt5/bin/moc: Syntax error: word unexpected (expecting ")")
AUTOGEN: error: process for /MuseScore/build.release/mscore/moc_textpalette.cpp failed:
/usr/lib/arm-linux-gnueabihf/qt5/bin/moc: 1: /usr/lib/arm-linux-gnueabihf/qt5/bin/moc: Syntax error: word unexpected (expecting ")")
Generating moc_texttools.cpp
/usr/lib/arm-linux-gnueabihf/qt5/bin/moc: 1: /usr/lib/arm-linux-gnueabihf/qt5/bin/moc: Syntax error: word unexpected (expecting ")")
AUTOGEN: error: process for /MuseScore/build.release/mscore/moc_texttools.cpp failed:
/usr/lib/arm-linux-gnueabihf/qt5/bin/moc: 1: /usr/lib/arm-linux-gnueabihf/qt5/bin/moc: Syntax error: word unexpected (expecting ")")
Generating moc_timedialog.cpp
/usr/lib/arm-linux-gnueabihf/qt5/bin/moc: 1: /usr/lib/arm-linux-gnueabihf/qt5/bin/moc: Syntax error: word unexpected (expecting ")")
AUTOGEN: error: process for /MuseScore/build.release/mscore/moc_timedialog.cpp failed:
/usr/lib/arm-linux-gnueabihf/qt5/bin/moc: 1: /usr/lib/arm-linux-gnueabihf/qt5/bin/moc: Syntax error: word unexpected (expecting ")")
Generating moc_timeline.cpp
/usr/lib/arm-linux-gnueabihf/qt5/bin/moc: 1: /usr/lib/arm-linux-gnueabihf/qt5/bin/moc: Syntax error: word unexpected (expecting ")")
AUTOGEN: error: process for /MuseScore/build.release/mscore/moc_timeline.cpp failed:
/usr/lib/arm-linux-gnueabihf/qt5/bin/moc: 1: /usr/lib/arm-linux-gnueabihf/qt5/bin/moc: Syntax error: word unexpected (expecting ")")
Generating moc_timesigproperties.cpp
/usr/lib/arm-linux-gnueabihf/qt5/bin/moc: 1: /usr/lib/arm-linux-gnueabihf/qt5/bin/moc: Syntax error: word unexpected (expecting ")")
AUTOGEN: error: process for /MuseScore/build.release/mscore/moc_timesigproperties.cpp failed:
/usr/lib/arm-linux-gnueabihf/qt5/bin/moc: 1: /usr/lib/arm-linux-gnueabihf/qt5/bin/moc: Syntax error: word unexpected (expecting ")")
Generating moc_toolbarEditor.cpp
/usr/lib/arm-linux-gnueabihf/qt5/bin/moc: 1: /usr/lib/arm-linux-gnueabihf/qt5/bin/moc: Syntax error: word unexpected (expecting ")")
AUTOGEN: error: process for /MuseScore/build.release/mscore/moc_toolbarEditor.cpp failed:
/usr/lib/arm-linux-gnueabihf/qt5/bin/moc: 1: /usr/lib/arm-linux-gnueabihf/qt5/bin/moc: Syntax error: word unexpected (expecting ")")
Generating moc_toolbuttonmenu.cpp
/usr/lib/arm-linux-gnueabihf/qt5/bin/moc: 1: /usr/lib/arm-linux-gnueabihf/qt5/bin/moc: Syntax error: word unexpected (expecting ")")
AUTOGEN: error: process for /MuseScore/build.release/mscore/moc_toolbuttonmenu.cpp failed:
/usr/lib/arm-linux-gnueabihf/qt5/bin/moc: 1: /usr/lib/arm-linux-gnueabihf/qt5/bin/moc: Syntax error: word unexpected (expecting ")")
Generating moc_transposedialog.cpp
/usr/lib/arm-linux-gnueabihf/qt5/bin/moc: 1: /usr/lib/arm-linux-gnueabihf/qt5/bin/moc: Syntax error: word unexpected (expecting ")")
AUTOGEN: error: process for /MuseScore/build.release/mscore/moc_transposedialog.cpp failed:
/usr/lib/arm-linux-gnueabihf/qt5/bin/moc: 1: /usr/lib/arm-linux-gnueabihf/qt5/bin/moc: Syntax error: word unexpected (expecting ")")
Generating moc_tremolobarcanvas.cpp
/usr/lib/arm-linux-gnueabihf/qt5/bin/moc: 1: /usr/lib/arm-linux-gnueabihf/qt5/bin/moc: Syntax error: word unexpected (expecting ")")
AUTOGEN: error: process for /MuseScore/build.release/mscore/moc_tremolobarcanvas.cpp failed:
/usr/lib/arm-linux-gnueabihf/qt5/bin/moc: 1: /usr/lib/arm-linux-gnueabihf/qt5/bin/moc: Syntax error: word unexpected (expecting ")")
Generating moc_tremolobarprop.cpp
/usr/lib/arm-linux-gnueabihf/qt5/bin/moc: 1: /usr/lib/arm-linux-gnueabihf/qt5/bin/moc: Syntax error: word unexpected (expecting ")")
AUTOGEN: error: process for /MuseScore/build.release/mscore/moc_tremolobarprop.cpp failed:
/usr/lib/arm-linux-gnueabihf/qt5/bin/moc: 1: /usr/lib/arm-linux-gnueabihf/qt5/bin/moc: Syntax error: word unexpected (expecting ")")
Generating moc_tupletdialog.cpp
/usr/lib/arm-linux-gnueabihf/qt5/bin/moc: 1: /usr/lib/arm-linux-gnueabihf/qt5/bin/moc: Syntax error: word unexpected (expecting ")")
AUTOGEN: error: process for /MuseScore/build.release/mscore/moc_tupletdialog.cpp failed:
/usr/lib/arm-linux-gnueabihf/qt5/bin/moc: 1: /usr/lib/arm-linux-gnueabihf/qt5/bin/moc: Syntax error: word unexpected (expecting ")")
Generating moc_updatechecker.cpp
/usr/lib/arm-linux-gnueabihf/qt5/bin/moc: 1: /usr/lib/arm-linux-gnueabihf/qt5/bin/moc: Syntax error: word unexpected (expecting ")")
AUTOGEN: error: process for /MuseScore/build.release/mscore/moc_updatechecker.cpp failed:
/usr/lib/arm-linux-gnueabihf/qt5/bin/moc: 1: /usr/lib/arm-linux-gnueabihf/qt5/bin/moc: Syntax error: word unexpected (expecting ")")
Generating moc_uploadscoredialog.cpp
/usr/lib/arm-linux-gnueabihf/qt5/bin/moc: 1: /usr/lib/arm-linux-gnueabihf/qt5/bin/moc: Syntax error: word unexpected (expecting ")")
AUTOGEN: error: process for /MuseScore/build.release/mscore/moc_uploadscoredialog.cpp failed:
/usr/lib/arm-linux-gnueabihf/qt5/bin/moc: 1: /usr/lib/arm-linux-gnueabihf/qt5/bin/moc: Syntax error: word unexpected (expecting ")")
Generating moc_waveview.cpp
/usr/lib/arm-linux-gnueabihf/qt5/bin/moc: 1: /usr/lib/arm-linux-gnueabihf/qt5/bin/moc: Syntax error: word unexpected (expecting ")")
AUTOGEN: error: process for /MuseScore/build.release/mscore/moc_waveview.cpp failed:
/usr/lib/arm-linux-gnueabihf/qt5/bin/moc: 1: /usr/lib/arm-linux-gnueabihf/qt5/bin/moc: Syntax error: word unexpected (expecting ")")
Generating moc_workspace.cpp
/usr/lib/arm-linux-gnueabihf/qt5/bin/moc: 1: /usr/lib/arm-linux-gnueabihf/qt5/bin/moc: Syntax error: word unexpected (expecting ")")
AUTOGEN: error: process for /MuseScore/build.release/mscore/moc_workspace.cpp failed:
/usr/lib/arm-linux-gnueabihf/qt5/bin/moc: 1: /usr/lib/arm-linux-gnueabihf/qt5/bin/moc: Syntax error: word unexpected (expecting ")")
moc failed...
mscore/CMakeFiles/mscore_automoc.dir/build.make:49: recipe for target 'mscore/CMakeFiles/mscore_automoc' failed
make[3]: *** [mscore/CMakeFiles/mscore_automoc] Error 1
make[3]: Leaving directory '/MuseScore/build.release'
CMakeFiles/Makefile2:343: recipe for target 'mscore/CMakeFiles/mscore_automoc.dir/all' failed
make[2]: *** [mscore/CMakeFiles/mscore_automoc.dir/all] Error 2
make[3]: Leaving directory '/MuseScore/build.release'
[ 1%] Built target mops2
make[2]: Leaving directory '/MuseScore/build.release'
Makefile:137: recipe for target 'all' failed
make[1]: *** [all] Error 2
make[1]: Leaving directory '/MuseScore/build.release'
make: *** [release] Error 2
Makefile:49: recipe for target 'release' failed
Sign up for free to join this conversation on GitHub. Already have an account? Sign in to comment