Skip to content

Instantly share code, notes, and snippets.

@furkantoptass
Last active Apr 13, 2021
Embed
What would you like to do?
Turkce karakter hatası
FAILURE: Build failed with an exception.
* Where:
Build file 'C:\Users\Furkan\Desktop\t�rk�e karakter hatas�\soruncozumu\android\app\build.gradle' line: 24
* What went wrong:
A problem occurred evaluating project ':app'.
> Failed to apply plugin 'com.android.internal.application'.
> Your project path contains non-ASCII characters. This will most likely cause the build to fail on Windows. Please move your project to a different directory. See http://b.android.com/95744 for details. This warning can be disabled by adding the line 'android.overridePathCheck=true' to gradle.properties file in the project directory.
* Try:
Run with --stacktrace option to get the stack trace. Run with --info or --debug option to get more log output. Run with --scan to get full insights.
* Get more help at https://help.gradle.org
BU�LD FAILED in 12s
Exception: Gradle task assembleDebug failed with exit code 1
Exited (sigterm)
Sign up for free to join this conversation on GitHub. Already have an account? Sign in to comment