Skip to content

Instantly share code, notes, and snippets.

Embed
What would you like to do?
info: Welcome to Nodejitsu nko3-la-salsa-picante
info: jitsu v0.11.0, node v0.8.14
info: It worked if it ends with Nodejitsu ok
info: Executing command deploy
info: Analyzing application dependencies in node server.js
info: Creating snapshot 0.0.1
info Uploading: [ ] 1%
error: Error running command deploy
error: Nodejitsu Error (500): Internal Server Error
error: npm http GET http://nj-npm.irisnpm.com/connect/1.8.5
npm http GET http://nj-npm.irisnpm.com/express/2.5.2
npm http GET http://nj-npm.irisnpm.com/jade/0.20.0
npm http GET http://nj-npm.irisnpm.com/mongoose/2.4.8
npm http GET http://nj-npm.irisnpm.com/socket.io/0.8.7
npm http GET http://nj-npm.irisnpm.com/feedparser/0.10.8
npm http GET http://nj-npm.irisnpm.com/redis/0.8.2
npm http GET http://nj-npm.irisnpm.com/kue/0.4.2
npm http 200 http://nj-npm.irisnpm.com/connect/1.8.5
npm http GET http://nj-npm.irisnpm.com/connect/-/connect-1.8.5.tgz
npm http 200 http://nj-npm.irisnpm.com/express/2.5.2
npm http 200 http://nj-npm.irisnpm.com/socket.io/0.8.7
npm http 200 http://nj-npm.irisnpm.com/jade/0.20.0
npm http GET http://nj-npm.irisnpm.com/express/-/express-2.5.2.tgz
npm http GET http://nj-npm.irisnpm.com/socket.io/-/socket.io-0.8.7.tgz
npm http GET http://nj-npm.irisnpm.com/jade/-/jade-0.20.0.tgz
npm http 200 http://nj-npm.irisnpm.com/mongoose/2.4.8
npm http GET http://nj-npm.irisnpm.com/mongoose/-/mongoose-2.4.8.tgz
npm http 200 http://nj-npm.irisnpm.com/connect/-/connect-1.8.5.tgz
npm http 200 http://nj-npm.irisnpm.com/express/-/express-2.5.2.tgz
npm http 200 http://nj-npm.irisnpm.com/feedparser/0.10.8
npm http GET http://nj-npm.irisnpm.com/feedparser/-/feedparser-0.10.8.tgz
npm http 200 http://nj-npm.irisnpm.com/socket.io/-/socket.io-0.8.7.tgz
npm http 200 http://nj-npm.irisnpm.com/redis/0.8.2
npm http GET http://nj-npm.irisnpm.com/redis/-/redis-0.8.2.tgz
npm http 200 http://nj-npm.irisnpm.com/kue/0.4.2
npm http 200 http://nj-npm.irisnpm.com/jade/-/jade-0.20.0.tgz
npm http GET http://nj-npm.irisnpm.com/kue/-/kue-0.4.2.tgz
npm http 200 http://nj-npm.irisnpm.com/mongoose/-/mongoose-2.4.8.tgz
npm http 200 http://nj-npm.irisnpm.com/feedparser/-/feedparser-0.10.8.tgz
npm http 200 http://nj-npm.irisnpm.com/redis/-/redis-0.8.2.tgz
npm http 200 http://nj-npm.irisnpm.com/kue/-/kue-0.4.2.tgz
npm WARN excluding symbolic link lib/index.js -> jade.js
npm WARN package.json connect@1.8.5 No README.md file found!
npm WARN engine express@2.5.2: wanted: {"node":">= 0.4.1 < 0.7.0"} (current: {"node":"0.8.8","npm":"1.1.59"})
npm WARN engine connect@1.8.5: wanted: {"node":">= 0.4.1 < 0.7.0"} (current: {"node":"0.8.8","npm":"1.1.59"})
npm http GET http://nj-npm.irisnpm.com/mime
npm http GET http://nj-npm.irisnpm.com/qs
npm http GET http://nj-npm.irisnpm.com/socket.io-client/0.8.7
npm http GET http://nj-npm.irisnpm.com/policyfile/0.0.4
npm http GET http://nj-npm.irisnpm.com/commander
npm http GET http://nj-npm.irisnpm.com/mkdirp
npm http GET http://nj-npm.irisnpm.com/mkdirp/0.0.7
npm http GET http://nj-npm.irisnpm.com/redis/0.6.7
npm http GET http://nj-npm.irisnpm.com/redis/0.7.2
npm http GET http://nj-npm.irisnpm.com/express/2.5.11
npm http GET http://nj-npm.irisnpm.com/jade/0.26.3
npm http GET http://nj-npm.irisnpm.com/stylus/0.27.2
npm http GET http://nj-npm.irisnpm.com/nib/0.5.0
npm http GET http://nj-npm.irisnpm.com/reds/0.1.4
npm http GET http://nj-npm.irisnpm.com/qs
npm http GET http://nj-npm.irisnpm.com/formidable
npm http GET http://nj-npm.irisnpm.com/sax
npm http GET http://nj-npm.irisnpm.com/request
npm http GET http://nj-npm.irisnpm.com/addressparser
npm http GET http://nj-npm.irisnpm.com/hooks/0.1.9
npm http GET http://nj-npm.irisnpm.com/mongodb/0.9.7-2-5
npm http GET http://nj-npm.irisnpm.com/colors/0.5.1
npm http 200 http://nj-npm.irisnpm.com/policyfile/0.0.4
npm http GET http://nj-npm.irisnpm.com/policyfile/-/policyfile-0.0.4.tgz
npm http 200 http://nj-npm.irisnpm.com/socket.io-client/0.8.7
npm http GET http://nj-npm.irisnpm.com/socket.io-client/-/socket.io-client-0.8.7.tgz
npm http 200 http://nj-npm.irisnpm.com/mime
npm http GET http://nj-npm.irisnpm.com/mime/-/mime-1.2.7.tgz
npm http 200 http://nj-npm.irisnpm.com/qs
npm http GET http://nj-npm.irisnpm.com/qs/-/qs-0.5.1.tgz
npm http 200 http://nj-npm.irisnpm.com/commander
npm http GET http://nj-npm.irisnpm.com/commander/-/commander-0.2.1.tgz
npm http 200 http://nj-npm.irisnpm.com/mkdirp/0.0.7
npm http GET http://nj-npm.irisnpm.com/mkdirp/-/mkdirp-0.0.7.tgz
npm http 200 http://nj-npm.irisnpm.com/mkdirp
npm http GET http://nj-npm.irisnpm.com/mkdirp/-/mkdirp-0.3.4.tgz
npm http 200 http://nj-npm.irisnpm.com/redis/0.6.7
npm http GET http://nj-npm.irisnpm.com/redis/-/redis-0.6.7.tgz
npm http 200 http://nj-npm.irisnpm.com/redis/0.7.2
npm http GET http://nj-npm.irisnpm.com/redis/-/redis-0.7.2.tgz
npm http 200 http://nj-npm.irisnpm.com/express/2.5.11
npm http GET http://nj-npm.irisnpm.com/express/-/express-2.5.11.tgz
npm http 200 http://nj-npm.irisnpm.com/jade/0.26.3
npm http GET http://nj-npm.irisnpm.com/jade/-/jade-0.26.3.tgz
npm http 200 http://nj-npm.irisnpm.com/nib/0.5.0
npm http GET http://nj-npm.irisnpm.com/nib/-/nib-0.5.0.tgz
npm http 200 http://nj-npm.irisnpm.com/reds/0.1.4
npm http GET http://nj-npm.irisnpm.com/reds/-/reds-0.1.4.tgz
npm http 200 http://nj-npm.irisnpm.com/stylus/0.27.2
npm http GET http://nj-npm.irisnpm.com/stylus/-/stylus-0.27.2.tgz
npm http 200 http://nj-npm.irisnpm.com/qs
npm http 200 http://nj-npm.irisnpm.com/formidable
npm http GET http://nj-npm.irisnpm.com/formidable/-/formidable-1.0.11.tgz
npm http 200 http://nj-npm.irisnpm.com/sax
npm http GET http://nj-npm.irisnpm.com/sax/-/sax-0.4.2.tgz
npm http 200 http://nj-npm.irisnpm.com/addressparser
npm http GET http://nj-npm.irisnpm.com/addressparser/-/addressparser-0.1.3.tgz
npm http 200 http://nj-npm.irisnpm.com/hooks/0.1.9
npm http 200 http://nj-npm.irisnpm.com/request
npm http GET http://nj-npm.irisnpm.com/hooks/-/hooks-0.1.9.tgz
npm http GET http://nj-npm.irisnpm.com/request/-/request-2.9.203.tgz
npm http 200 http://nj-npm.irisnpm.com/policyfile/-/policyfile-0.0.4.tgz
npm http 200 http://nj-npm.irisnpm.com/socket.io-client/-/socket.io-client-0.8.7.tgz
npm http 200 http://nj-npm.irisnpm.com/mime/-/mime-1.2.7.tgz
npm http 200 http://nj-npm.irisnpm.com/colors/0.5.1
npm http GET http://nj-npm.irisnpm.com/colors/-/colors-0.5.1.tgz
npm http 200 http://nj-npm.irisnpm.com/qs/-/qs-0.5.1.tgz
npm http 200 http://nj-npm.irisnpm.com/commander/-/commander-0.2.1.tgz
npm http 200 http://nj-npm.irisnpm.com/mkdirp/-/mkdirp-0.0.7.tgz
npm http 200 http://nj-npm.irisnpm.com/mongodb/0.9.7-2-5
npm http GET http://nj-npm.irisnpm.com/mongodb/-/mongodb-0.9.7-2-5.tgz
npm http 200 http://nj-npm.irisnpm.com/redis/-/redis-0.6.7.tgz
npm http 200 http://nj-npm.irisnpm.com/mkdirp/-/mkdirp-0.3.4.tgz
npm http 200 http://nj-npm.irisnpm.com/redis/-/redis-0.7.2.tgz
npm http 200 http://nj-npm.irisnpm.com/jade/-/jade-0.26.3.tgz
npm http 200 http://nj-npm.irisnpm.com/express/-/express-2.5.11.tgz
npm http 200 http://nj-npm.irisnpm.com/reds/-/reds-0.1.4.tgz
npm http 200 http://nj-npm.irisnpm.com/nib/-/nib-0.5.0.tgz
npm WARN engine commander@0.2.1: wanted: {"node":">= 0.4.x < 0.7.0"} (current: {"node":"0.8.8","npm":"1.1.59"})
npm http 200 http://nj-npm.irisnpm.com/addressparser/-/addressparser-0.1.3.tgz
npm http 200 http://nj-npm.irisnpm.com/sax/-/sax-0.4.2.tgz
npm http 200 http://nj-npm.irisnpm.com/stylus/-/stylus-0.27.2.tgz
npm http 200 http://nj-npm.irisnpm.com/formidable/-/formidable-1.0.11.tgz
npm WARN package.json jade@0.26.3 No README.md file found!
npm http 200 http://nj-npm.irisnpm.com/hooks/-/hooks-0.1.9.tgz
npm http 200 http://nj-npm.irisnpm.com/colors/-/colors-0.5.1.tgz
npm http 200 http://nj-npm.irisnpm.com/request/-/request-2.9.203.tgz
npm http 200 http://nj-npm.irisnpm.com/mongodb/-/mongodb-0.9.7-2-5.tgz
npm WARN package.json stylus@0.27.2 No README.md file found!
npm WARN excluding symbolic link lib/socket.io-client.js -> io.js
npm http GET http://nj-npm.irisnpm.com/natural/0.0.69
npm http GET http://nj-npm.irisnpm.com/mime/1.2.4
npm http GET http://nj-npm.irisnpm.com/mkdirp/0.3.0
npm http GET http://nj-npm.irisnpm.com/qs
npm http GET http://nj-npm.irisnpm.com/hiredis
npm http GET http://nj-npm.irisnpm.com/commander/0.6.1
npm http GET http://nj-npm.irisnpm.com/cssom
npm http GET http://nj-npm.irisnpm.com/debug
npm http GET http://nj-npm.irisnpm.com/mkdirp
npm http 304 http://nj-npm.irisnpm.com/qs
npm http GET http://nj-npm.irisnpm.com/qs/-/qs-0.4.2.tgz
npm http 200 http://nj-npm.irisnpm.com/natural/0.0.69
npm http 200 http://nj-npm.irisnpm.com/mime/1.2.4
npm http 200 http://nj-npm.irisnpm.com/mkdirp/0.3.0
npm http 200 http://nj-npm.irisnpm.com/hiredis
npm http GET http://nj-npm.irisnpm.com/mime/-/mime-1.2.4.tgz
npm http GET http://nj-npm.irisnpm.com/mkdirp/-/mkdirp-0.3.0.tgz
npm http GET http://nj-npm.irisnpm.com/hiredis/-/hiredis-0.1.14.tgz
npm http GET http://nj-npm.irisnpm.com/natural/-/natural-0.0.69.tgz
npm http 304 http://nj-npm.irisnpm.com/mkdirp
npm http 200 http://nj-npm.irisnpm.com/debug
npm http GET http://nj-npm.irisnpm.com/debug/-/debug-0.7.0.tgz
npm http 200 http://nj-npm.irisnpm.com/commander/0.6.1
npm http 200 http://nj-npm.irisnpm.com/mime/-/mime-1.2.4.tgz
npm http 200 http://nj-npm.irisnpm.com/qs/-/qs-0.4.2.tgz
npm http GET http://nj-npm.irisnpm.com/commander/-/commander-0.6.1.tgz
npm http 200 http://nj-npm.irisnpm.com/mkdirp/-/mkdirp-0.3.0.tgz
npm http 200 http://nj-npm.irisnpm.com/hiredis/-/hiredis-0.1.14.tgz
npm http 200 http://nj-npm.irisnpm.com/cssom
npm http GET http://nj-npm.irisnpm.com/cssom/-/cssom-0.2.5.tgz
npm http 200 http://nj-npm.irisnpm.com/natural/-/natural-0.0.69.tgz
npm http 200 http://nj-npm.irisnpm.com/commander/-/commander-0.6.1.tgz
npm http 200 http://nj-npm.irisnpm.com/debug/-/debug-0.7.0.tgz
npm http 200 http://nj-npm.irisnpm.com/cssom/-/cssom-0.2.5.tgz
npm WARN package.json hiredis@0.1.14 No README.md file found!
> hiredis@0.1.14 preinstall /root/tmp/tmp-178717kdybuo/build/package/node_modules/kue/node_modules/redis/node_modules/hiredis
> make || gmake
cd deps/hiredis && make static
make[1]: Entering directory `/root/tmp/tmp-178717kdybuo/build/package/node_modules/kue/node_modules/redis/node_modules/hiredis/deps/hiredis'
cc -std=c99 -pedantic -c -O3 -fPIC -m64 -Wall -W -Wstrict-prototypes -Wwrite-strings -g -ggdb net.c
cc -std=c99 -pedantic -c -O3 -fPIC -m64 -Wall -W -Wstrict-prototypes -Wwrite-strings -g -ggdb hiredis.c
npm http GET http://nj-npm.irisnpm.com/sylvester
npm http GET http://nj-npm.irisnpm.com/apparatus
npm http GET http://nj-npm.irisnpm.com/underscore
npm http 200 http://nj-npm.irisnpm.com/underscore
npm http GET http://nj-npm.irisnpm.com/underscore/-/underscore-1.4.2.tgz
npm http 200 http://nj-npm.irisnpm.com/apparatus
npm http 200 http://nj-npm.irisnpm.com/sylvester
npm http GET http://nj-npm.irisnpm.com/apparatus/-/apparatus-0.0.6.tgz
npm http GET http://nj-npm.irisnpm.com/sylvester/-/sylvester-0.0.21.tgz
npm http 200 http://nj-npm.irisnpm.com/underscore/-/underscore-1.4.2.tgz
npm http 200 http://nj-npm.irisnpm.com/sylvester/-/sylvester-0.0.21.tgz
npm http 200 http://nj-npm.irisnpm.com/apparatus/-/apparatus-0.0.6.tgz
cc -std=c99 -pedantic -c -O3 -fPIC -m64 -Wall -W -Wstrict-prototypes -Wwrite-strings -g -ggdb sds.c
cc -std=c99 -pedantic -c -O3 -fPIC -m64 -Wall -W -Wstrict-prototypes -Wwrite-strings -g -ggdb async.c
async.c: In function '__redisAsyncCommand':
async.c:538:10: warning: 'cstr' may be used uninitialized in this function [-Wuninitialized]
ar rcs libhiredis.a net.o hiredis.o sds.o async.o
make[1]: Leaving directory `/root/tmp/tmp-178717kdybuo/build/package/node_modules/kue/node_modules/redis/node_modules/hiredis/deps/hiredis'
node-waf configure build
Setting srcdir to : /root/tmp/tmp-178717kdybuo/build/package/node_modules/kue/node_modules/redis/node_modules/hiredis
Setting blddir to : /root/tmp/tmp-178717kdybuo/build/package/node_modules/kue/node_modules/redis/node_modules/hiredis/build
Checking for program g++ or c++ : /opt/local/bin/g++
Checking for program cpp : /opt/local/bin/cpp
Checking for program ar : /opt/local/bin/ar
Checking for program ranlib : /opt/local/bin/ranlib
Checking for g++ : ok
Checking for node path : not found
Checking for node prefix : ok /opt/local
'configure' finished successfully (0.065s)
Waf: Entering directory `/root/tmp/tmp-178717kdybuo/build/package/node_modules/kue/node_modules/redis/node_modules/hiredis/build'
[1/3] cxx: hiredis.cc -> build/Release/hiredis_1.o
[2/3] cxx: reader.cc -> build/Release/reader_1.o
[3/3] cxx_link: build/Release/hiredis_1.o build/Release/reader_1.o -> build/Release/hiredis.node
ld: fatal: file Release/hiredis_1.o: wrong ELF class: ELFCLASS64
ld: fatal: file processing errors. No output written to /root/tmp/tmp-178717kdybuo/build/package/node_modules/kue/node_modules/redis/node_modules/hiredis/build/Release/hiredis.node
collect2: ld returned 1 exit status
Waf: Leaving directory `/root/tmp/tmp-178717kdybuo/build/package/node_modules/kue/node_modules/redis/node_modules/hiredis/build'
Build failed: -> task failed (err #1):
{task: cxx_link hiredis_1.o,reader_1.o -> hiredis.node}
make: *** [all] Error 1
cd deps/hiredis && gmake static
npm ERR! notsup Unsupported
npm ERR! notsup Not compatible with your operating system or architecture: mongodb@0.9.7-2-5
npm ERR! notsup Valid OS: linux,darwin,freebsd
npm ERR! notsup Valid Arch: any
npm ERR! notsup Actual OS: solaris
npm ERR! notsup Actual Arch: x64
npm ERR! System SunOS 5.11
npm ERR! command "/opt/local/bin/node" "/opt/local/bin/npm" "install"
npm ERR! cwd /root/tmp/tmp-178717kdybuo/build/package
npm ERR! node -v v0.8.8
npm ERR! npm -v 1.1.59
npm ERR! code EBADPLATFORM
gmake[1]: Entering directory `/root/tmp/tmp-178717kdybuo/build/package/node_modules/kue/node_modules/redis/node_modules/hiredis/deps/hiredis'
gmake[1]: Nothing to be done for `static'.
gmake[1]: Leaving directory `/root/tmp/tmp-178717kdybuo/build/package/node_modules/kue/node_modules/redis/node_modules/hiredis/deps/hiredis'
node-waf configure build
npm http GET http://nj-npm.irisnpm.com/uglify-js/1.0.6
npm http GET http://nj-npm.irisnpm.com/websocket-client/1.0.0
npm http GET http://nj-npm.irisnpm.com/xmlhttprequest/1.2.2
Setting srcdir to : /root/tmp/tmp-178717kdybuo/build/package/node_modules/kue/node_modules/redis/node_modules/hiredis
Setting blddir to : /root/tmp/tmp-178717kdybuo/build/package/node_modules/kue/node_modules/redis/node_modules/hiredis/build
Checking for program g++ or c++ : /opt/local/bin/g++
npm http 200 http://nj-npm.irisnpm.com/xmlhttprequest/1.2.2
npm http 200 http://nj-npm.irisnpm.com/websocket-client/1.0.0
npm http GET http://nj-npm.irisnpm.com/xmlhttprequest/-/xmlhttprequest-1.2.2.tgz
npm http 200 http://nj-npm.irisnpm.com/uglify-js/1.0.6
npm http GET http://nj-npm.irisnpm.com/websocket-client/-/websocket-client-1.0.0.tgz
npm http GET http://nj-npm.irisnpm.com/uglify-js/-/uglify-js-1.0.6.tgz
Checking for program cpp : /opt/local/bin/cpp
Checking for program ar : /opt/local/bin/ar
Checking for program ranlib : /opt/local/bin/ranlib
Checking for g++ : ok
Checking for node path : not found
Checking for node prefix : ok /opt/local
npm http 200 http://nj-npm.irisnpm.com/xmlhttprequest/-/xmlhttprequest-1.2.2.tgz
'configure' finished successfully (0.060s)
npm http 200 http://nj-npm.irisnpm.com/websocket-client/-/websocket-client-1.0.0.tgz
npm http 200 http://nj-npm.irisnpm.com/uglify-js/-/uglify-js-1.0.6.tgz
Waf: Entering directory `/root/tmp/tmp-178717kdybuo/build/package/node_modules/kue/node_modules/redis/node_modules/hiredis/build'
[3/3] cxx_link: build/Release/hiredis_1.o build/Release/reader_1.o -> build/Release/hiredis.node
ld: fatal: file Release/hiredis_1.o: wrong ELF class: ELFCLASS64
ld: fatal: file processing errors. No output written to /root/tmp/tmp-178717kdybuo/build/package/node_modules/kue/node_modules/redis/node_modules/hiredis/build/Release/hiredis.node
collect2: ld returned 1 exit status
Waf: Leaving directory `/root/tmp/tmp-178717kdybuo/build/package/node_modules/kue/node_modules/redis/node_modules/hiredis/build'
Build failed: -> task failed (err #1):
{task: cxx_link hiredis_1.o,reader_1.o -> hiredis.node}
gmake: *** [all] Error 1
npm WARN optional dep failed, continuing hiredis@0.1.14
npm ERR!
npm ERR! Additional logging details can be found in:
npm ERR! /root/tmp/tmp-178717kdybuo/build/package/npm-debug.log
npm ERR! not ok code 0
help: For help with this error contact Nodejitsu Support:
help: webchat: <http://webchat.nodejitsu.com/>
help: irc: <irc://chat.freenode.net/#nodejitsu>
help: email: <support@nodejitsu.com>
help:
help: Copy and paste this output to a gist (http://gist.github.com/)
info: Nodejitsu not ok
Sign up for free to join this conversation on GitHub. Already have an account? Sign in to comment
You can’t perform that action at this time.