Skip to content

Instantly share code, notes, and snippets.

Embed
What would you like to do?
$ HOMEBREW_MAKE_JOBS=1 VERBOSE=1 brew install contacts 2>&1
dyld: DYLD_ environment variables being ignored because main executable (/usr/bin/sudo) is setuid or setgid
==> Downloading https://github.com/dhess/contacts/archive/4092a3c6615d7a22852a3bafc44e4aeeb698aa8f.tar.gz
Already downloaded: /Library/Caches/Homebrew/contacts-1.1a-3.tar.gz
tar xf /Library/Caches/Homebrew/contacts-1.1a-3.tar.gz
==> make
make
xcodebuild -configuration Deployment -target contacts
=== BUILD NATIVE TARGET contacts OF PROJECT contacts WITH CONFIGURATION Deployment ===
Check dependencies
warning: The specified SDK “Current OS X” does not appear to have all of the necessary headers installed. Update your project to use a built-in SDK (“Latest OS X” is recommended) or install the system headers (included with the “Command Line Tools” package) from the “D
ownloads” pane in the Xcode preferences.
CompileC build/contacts.build/Deployment/contacts.build/Objects-normal/i386/FormatHelper.o FormatHelper.m normal i386 objective-c com.apple.compilers.llvm.clang.1_0.compiler
cd /tmp/contacts-zGQq/contacts-4092a3c6615d7a22852a3bafc44e4aeeb698aa8f
setenv LANG en_US.US-ASCII
/Applications/Xcode.app/Contents/Developer/Toolchains/XcodeDefault.xctoolchain/usr/bin/cc -x objective-c -arch i386 -fmessage-length=0 -Wno-trigraphs -fpascal-strings -Os -Wno-missing-field-initializers -Wno-missing-prototypes -Wno-return-type -Wno-implicit-atomic-p
roperties -Wno-receiver-is-weak -Wformat -Wno-missing-braces -Wparentheses -Wswitch -Wno-unused-function -Wno-unused-label -Wno-unused-parameter -Wno-unused-variable -Wunused-value -Wno-empty-body -Wno-uninitialized -Wno-unknown-pragmas -Wno-shadow -Wno-four-char-consta
nts -Wno-conversion -Wno-constant-conversion -Wno-int-conversion -Wno-enum-conversion -Wno-shorten-64-to-32 -Wpointer-sign -Wno-newline-eof -Wno-selector -Wno-strict-selector-match -Wno-undeclared-selector -Wno-deprecated-implementations -fasm-blocks -fstrict-aliasing -Wprotocol -Wdeprecated-declarations -g -fvisibility=hidden -Wno-sign-conversion -I/tmp/contacts-zGQq/contacts-4092a3c6615d7a22852a3bafc44e4aeeb698aa8f/build/contacts.build/Deployment/contacts.build/contacts.hmap -I/tmp/contacts-zGQq/contacts-4092a3c6615d7a22852a3bafc44e
4aeeb698aa8f/build/Deployment/include -I/tmp/contacts-zGQq/contacts-4092a3c6615d7a22852a3bafc44e4aeeb698aa8f/build/contacts.build/Deployment/contacts.build/DerivedSources/i386 -I/tmp/contacts-zGQq/contacts-4092a3c6615d7a22852a3bafc44e4aeeb698aa8f/build/contacts.build/De
ployment/contacts.build/DerivedSources -Wmost -Wno-four-char-constants -Wno-unknown-pragmas -F/tmp/contacts-zGQq/contacts-4092a3c6615d7a22852a3bafc44e4aeeb698aa8f/build/Deployment -MMD -MT dependencies -MF /tmp/contacts-zGQq/contacts-4092a3c6615d7a22852a3bafc44e4aeeb698
aa8f/build/contacts.build/Deployment/contacts.build/Objects-normal/i386/FormatHelper.d --serialize-diagnostics /tmp/contacts-zGQq/contacts-4092a3c6615d7a22852a3bafc44e4aeeb698aa8f/build/contacts.build/Deployment/contacts.build/Objects-normal/i386/FormatHelper.dia -c /tm
p/contacts-zGQq/contacts-4092a3c6615d7a22852a3bafc44e4aeeb698aa8f/FormatHelper.m -o /tmp/contacts-zGQq/contacts-4092a3c6615d7a22852a3bafc44e4aeeb698aa8f/build/contacts.build/Deployment/contacts.build/Objects-normal/i386/FormatHelper.o
In file included from /tmp/contacts-zGQq/contacts-4092a3c6615d7a22852a3bafc44e4aeeb698aa8f/FormatHelper.m:8:
/tmp/contacts-zGQq/contacts-4092a3c6615d7a22852a3bafc44e4aeeb698aa8f/FormatHelper.h:8:9: fatal error: 'Foundation/Foundation.h' file not found
#import <Foundation/Foundation.h>
^
1 error generated.
CompileC build/contacts.build/Deployment/contacts.build/Objects-normal/i386/contacts.o contacts.m normal i386 objective-c com.apple.compilers.llvm.clang.1_0.compiler [1/124]
cd /tmp/contacts-zGQq/contacts-4092a3c6615d7a22852a3bafc44e4aeeb698aa8f
setenv LANG en_US.US-ASCII
/Applications/Xcode.app/Contents/Developer/Toolchains/XcodeDefault.xctoolchain/usr/bin/cc -x objective-c -arch i386 -fmessage-length=0 -Wno-trigraphs -fpascal-strings -Os -Wno-missing-field-initializers -Wno-missing-prototypes -Wno-return-type -Wno-implicit-atomic-p
roperties -Wno-receiver-is-weak -Wformat -Wno-missing-braces -Wparentheses -Wswitch -Wno-unused-function -Wno-unused-label -Wno-unused-parameter -Wno-unused-variable -Wunused-value -Wno-empty-body -Wno-uninitialized -Wno-unknown-pragmas -Wno-shadow -Wno-four-char-consta
nts -Wno-conversion -Wno-constant-conversion -Wno-int-conversion -Wno-enum-conversion -Wno-shorten-64-to-32 -Wpointer-sign -Wno-newline-eof -Wno-selector -Wno-strict-selector-match -Wno-undeclared-selector -Wno-deprecated-implementations -fasm-blocks -fstrict-aliasing -
Wprotocol -Wdeprecated-declarations -g -fvisibility=hidden -Wno-sign-conversion -I/tmp/contacts-zGQq/contacts-4092a3c6615d7a22852a3bafc44e4aeeb698aa8f/build/contacts.build/Deployment/contacts.build/contacts.hmap -I/tmp/contacts-zGQq/contacts-4092a3c6615d7a22852a3bafc44e
4aeeb698aa8f/build/Deployment/include -I/tmp/contacts-zGQq/contacts-4092a3c6615d7a22852a3bafc44e4aeeb698aa8f/build/contacts.build/Deployment/contacts.build/DerivedSources/i386 -I/tmp/contacts-zGQq/contacts-4092a3c6615d7a22852a3bafc44e4aeeb698aa8f/build/contacts.build/De
ployment/contacts.build/DerivedSources -Wmost -Wno-four-char-constants -Wno-unknown-pragmas -F/tmp/contacts-zGQq/contacts-4092a3c6615d7a22852a3bafc44e4aeeb698aa8f/build/Deployment -MMD -MT dependencies -MF /tmp/contacts-zGQq/contacts-4092a3c6615d7a22852a3bafc44e4aeeb698
aa8f/build/contacts.build/Deployment/contacts.build/Objects-normal/i386/contacts.d --serialize-diagnostics /tmp/contacts-zGQq/contacts-4092a3c6615d7a22852a3bafc44e4aeeb698aa8f/build/contacts.build/Deployment/contacts.build/Objects-normal/i386/contacts.dia -c /tmp/contac
ts-zGQq/contacts-4092a3c6615d7a22852a3bafc44e4aeeb698aa8f/contacts.m -o /tmp/contacts-zGQq/contacts-4092a3c6615d7a22852a3bafc44e4aeeb698aa8f/build/contacts.build/Deployment/contacts.build/Objects-normal/i386/contacts.o
/tmp/contacts-zGQq/contacts-4092a3c6615d7a22852a3bafc44e4aeeb698aa8f/contacts.m:66:9: fatal error: 'Foundation/Foundation.h' file not found
#import <Foundation/Foundation.h>
^
1 error generated.
2013-07-23 10:46:59.458 xcodebuild[4765:3507] DVTAssertions: Warning in /SourceCache/IDEXcode3ProjectSupport/IDEXcode3ProjectSupport-2110/Xcode3Sources/XcodeIDE/Frameworks/DevToolsBase/pbxcore/SpecificationTypes/XCGccMakefileDependencies.m:87
Details: Failed to load dependencies output contents from ``/tmp/contacts-zGQq/contacts-4092a3c6615d7a22852a3bafc44e4aeeb698aa8f/build/contacts.build/Deployment/contacts.build/Objects-normal/i386/FormatHelper.d''. Error: Error Domain=NSCocoaErrorDomain Code=260 "The fi
le “FormatHelper.d” couldn’t be opened because there is no such file." UserInfo=0x400d74c60 {NSFilePath=/tmp/contacts-zGQq/contacts-4092a3c6615d7a22852a3bafc44e4aeeb698aa8f/build/contacts.build/Deployment/contacts.build/Objects-normal/i386/FormatHelper.d, NSUnderlyingEr
ror=0x400121120 "The operation couldn’t be completed. No such file or directory"}. User info: {
NSFilePath = "/tmp/contacts-zGQq/contacts-4092a3c6615d7a22852a3bafc44e4aeeb698aa8f/build/contacts.build/Deployment/contacts.build/Objects-normal/i386/FormatHelper.d";
NSUnderlyingError = "Error Domain=NSPOSIXErrorDomain Code=2 \"The operation couldn\U2019t be completed. No such file or directory\"";
}.
Function: void XCGccMakefileDependenciesParsePathsFromRuleFile(NSString *, void (^)(NSString *))
Thread: <NSThread: 0x4009edb20>{name = (null), num = 4}
Please file a bug at http://bugreport.apple.com with this warning message and any useful information you can provide.
** BUILD FAILED **
The following build commands failed:
CompileC build/contacts.build/Deployment/contacts.build/Objects-normal/i386/FormatHelper.o FormatHelper.m normal i386 objective-c com.apple.compilers.llvm.clang.1_0.compiler
CompileC build/contacts.build/Deployment/contacts.build/Objects-normal/i386/contacts.o contacts.m normal i386 objective-c com.apple.compilers.llvm.clang.1_0.compiler
(2 failures)
make: *** [contacts] Error 65
==> Configuration
HOMEBREW_VERSION: 0.9.4
HEAD: d3216ca0cef41869ed26303ac72257c58884c3a9
CPU: 8-core 64-bit ivybridge
OS X: 10.8.4-x86_64
Xcode: 4.6.3
X11: N/A
==> ENV
HOMEBREW_CC: clang
MAKEFLAGS: -j1
CMAKE_PREFIX_PATH: /usr/local:/Applications/Xcode.app/Contents/Developer/Platforms/MacOSX.platform/Developer/SDKs/MacOSX10.8.sdk/usr
CMAKE_INCLUDE_PATH: /Applications/Xcode.app/Contents/Developer/Platforms/MacOSX.platform/Developer/SDKs/MacOSX10.8.sdk/usr/include/libxml2:/Applications/Xcode.app/Contents/Developer/Platforms/MacOSX.platform/Developer/SDKs/MacOSX10.8.sdk/usr/include/apache2:/Application
s/Xcode.app/Contents/Developer/Platforms/MacOSX.platform/Developer/SDKs/MacOSX10.8.sdk/System/Library/Frameworks/OpenGL.framework/Versions/Current/Headers/
CMAKE_LIBRARY_PATH: /Applications/Xcode.app/Contents/Developer/Platforms/MacOSX.platform/Developer/SDKs/MacOSX10.8.sdk/System/Library/Frameworks/OpenGL.framework/Versions/Current/Libraries
CMAKE_FRAMEWORK_PATH: /Applications/Xcode.app/Contents/Developer/Platforms/MacOSX.platform/Developer/SDKs/MacOSX10.8.sdk/System/Library/Frameworks
PKG_CONFIG_LIBDIR: /usr/lib/pkgconfig:/usr/local/Library/ENV/pkgconfig/10.8
HOMEBREW_MAKE_JOBS: 1
HOMEBREW_SDKROOT: /Applications/Xcode.app/Contents/Developer/Platforms/MacOSX.platform/Developer/SDKs/MacOSX10.8.sdk
ACLOCAL_PATH: /usr/local/share/aclocal
OBJC: cc
PATH: /usr/local/Library/ENV/4.3:/Applications/Xcode.app/Contents/Developer/usr/bin:/Applications/Xcode.app/Contents/Developer/Toolchains/XcodeDefault.xctoolchain/usr/bin:/usr/bin:/bin:/usr/sbin:/sbin
Error: contacts did not build
----
# No files were found in the log directory
$ ls ~/Library/Logs/Homebrew/contacts/
$
----
$ brew doctor
Your system is ready to brew.
Sign up for free to join this conversation on GitHub. Already have an account? Sign in to comment