Skip to content

Instantly share code, notes, and snippets.

Embed
What would you like to do?
[INFO] Scanning for projects...
[INFO] ------------------------------------------------------------------------
[INFO] Reactor Build Order:
[INFO]
[INFO] MXNet Scala Package - Parent
[INFO] MXNet Scala Package - Initializer
[INFO] MXNet Scala Package - Initializer Native
[INFO] MXNet Scala Package - Macros
[INFO] MXNet Scala Package - Native
[INFO] MXNet Scala Package - Core
[INFO] MXNet Scala Package - Inference
[INFO] MXNet Scala Package - Examples
[INFO] MXNet Scala Package - Spark ML
[INFO] MXNet Scala Package - Full osx-x86_64-only
[INFO]
[INFO] ------------------------------------------------------------------------
[INFO] Building MXNet Scala Package - Parent 1.5.0-SNAPSHOT
[INFO] ------------------------------------------------------------------------
[INFO]
[INFO] --- maven-enforcer-plugin:1.4.1:enforce (enforce-maven-version) @ mxnet-parent ---
[INFO]
[INFO] --- directory-maven-plugin:0.1:directory-of (directories) @ mxnet-parent ---
[INFO] Directory of org.apache.mxnet:mxnet-parent set to: /Users/cmeier/workspace/deep-learning/tmp/incubator-mxnet/scala-package
[INFO]
[INFO] --- maven-remote-resources-plugin:1.5:process (process-resource-bundles) @ mxnet-parent ---
[INFO]
[INFO] --- maven-scala-plugin:2.15.2:compile (default) @ mxnet-parent ---
[INFO] Checking for multiple versions of scala
[WARNING] Expected all dependencies to require Scala version: 2.11.8
[WARNING] org.scalatest:scalatest_2.11:3.0.4 requires scala version: 2.11.11
[WARNING] Multiple versions of scala libraries detected!
[INFO] includes = [**/*.java,**/*.scala,]
[INFO] excludes = []
[WARNING] No source files found.
[INFO]
[INFO] --- maven-scala-plugin:2.15.2:testCompile (default) @ mxnet-parent ---
[INFO] Checking for multiple versions of scala
[WARNING] Expected all dependencies to require Scala version: 2.11.8
[WARNING] org.scalatest:scalatest_2.11:3.0.4 requires scala version: 2.11.11
[WARNING] Multiple versions of scala libraries detected!
[INFO] includes = [**/*.java,**/*.scala,]
[INFO] excludes = []
[WARNING] No source files found.
[INFO]
[INFO] --- maven-site-plugin:3.7:attach-descriptor (attach-descriptor) @ mxnet-parent ---
[INFO] No site descriptor found: nothing to attach.
[INFO]
[INFO] --- maven-source-plugin:2.2.1:jar-no-fork (attach-sources) @ mxnet-parent ---
[INFO]
[INFO] >>> scala-maven-plugin:3.3.2:doc-jar (attach-javadocs) > generate-sources @ mxnet-parent >>>
[INFO]
[INFO] --- maven-enforcer-plugin:1.4.1:enforce (enforce-maven-version) @ mxnet-parent ---
[INFO]
[INFO] --- directory-maven-plugin:0.1:directory-of (directories) @ mxnet-parent ---
[INFO] Directory of org.apache.mxnet:mxnet-parent set to: /Users/cmeier/workspace/deep-learning/tmp/incubator-mxnet/scala-package
[INFO]
[INFO] <<< scala-maven-plugin:3.3.2:doc-jar (attach-javadocs) < generate-sources @ mxnet-parent <<<
[INFO]
[INFO] --- scala-maven-plugin:3.3.2:doc-jar (attach-javadocs) @ mxnet-parent ---
[WARNING] Expected all dependencies to require Scala version: 2.11.8
[WARNING] org.scalatest:scalatest_2.11:3.0.4 requires scala version: 2.11.11
[WARNING] Multiple versions of scala libraries detected!
[INFO] No source files found
[INFO]
[INFO] --- scalatest-maven-plugin:1.0:test (test) @ mxnet-parent ---
Discovery starting.
Discovery completed in 38 milliseconds.
Run starting. Expected test count is: 0
DiscoverySuite:
Run completed in 76 milliseconds.
Total number of tests run: 0
Suites: completed 1, aborted 0
Tests: succeeded 0, failed 0, canceled 0, ignored 0, pending 0
No tests were executed.
[INFO]
[INFO] --- scalastyle-maven-plugin:1.0.0:check (default) @ mxnet-parent ---
[WARNING] sourceDirectory is not specified or does not exist value=/Users/cmeier/workspace/deep-learning/tmp/incubator-mxnet/scala-package/src/main/scala
[WARNING] testSourceDirectory is not specified or does not exist value=/Users/cmeier/workspace/deep-learning/tmp/incubator-mxnet/scala-package/src/test/scala
Saving to outputFile=/Users/cmeier/workspace/deep-learning/tmp/incubator-mxnet/scala-package/target/scalastyle-output.xml
Processed 0 file(s)
Found 0 errors
Found 0 warnings
Found 0 infos
Finished in 94 ms
[INFO]
[INFO] --- maven-install-plugin:2.5.2:install (default-install) @ mxnet-parent ---
[INFO] Installing /Users/cmeier/workspace/deep-learning/tmp/incubator-mxnet/scala-package/pom.xml to /Users/cmeier/.m2/repository/org/apache/mxnet/mxnet-parent/1.5.0-SNAPSHOT/mxnet-parent-1.5.0-SNAPSHOT.pom
[INFO]
[INFO] ------------------------------------------------------------------------
[INFO] Building MXNet Scala Package - Initializer 1.5.0-SNAPSHOT
[INFO] ------------------------------------------------------------------------
[INFO]
[INFO] --- maven-enforcer-plugin:1.4.1:enforce (enforce-maven-version) @ mxnet-scala-init ---
[INFO]
[INFO] --- directory-maven-plugin:0.1:directory-of (directories) @ mxnet-scala-init ---
[INFO] Directory of org.apache.mxnet:mxnet-parent set to: /Users/cmeier/workspace/deep-learning/tmp/incubator-mxnet/scala-package
[INFO]
[INFO] --- maven-remote-resources-plugin:1.5:process (process-resource-bundles) @ mxnet-scala-init ---
[INFO]
[INFO] --- maven-resources-plugin:2.7:resources (default-resources) @ mxnet-scala-init ---
[INFO] Using 'UTF-8' encoding to copy filtered resources.
[INFO] skip non existing resourceDirectory /Users/cmeier/workspace/deep-learning/tmp/incubator-mxnet/scala-package/init/src/main/resources
[INFO] Copying 3 resources
[INFO]
[INFO] --- maven-compiler-plugin:3.3:compile (default-compile) @ mxnet-scala-init ---
[INFO] No sources to compile
[INFO]
[INFO] --- maven-scala-plugin:2.15.2:compile (default) @ mxnet-scala-init ---
[INFO] Checking for multiple versions of scala
[WARNING] Expected all dependencies to require Scala version: 2.11.8
[WARNING] org.scalatest:scalatest_2.11:3.0.4 requires scala version: 2.11.11
[WARNING] Multiple versions of scala libraries detected!
[INFO] includes = [**/*.java,**/*.scala,]
[INFO] excludes = []
[INFO] Nothing to compile - all classes are up to date
[INFO]
[INFO] --- maven-resources-plugin:2.7:testResources (default-testResources) @ mxnet-scala-init ---
[INFO] Using 'UTF-8' encoding to copy filtered resources.
[INFO] skip non existing resourceDirectory /Users/cmeier/workspace/deep-learning/tmp/incubator-mxnet/scala-package/init/src/test/resources
[INFO] Copying 3 resources
[INFO]
[INFO] --- maven-compiler-plugin:3.3:testCompile (default-testCompile) @ mxnet-scala-init ---
[INFO] No sources to compile
[INFO]
[INFO] --- maven-scala-plugin:2.15.2:testCompile (default) @ mxnet-scala-init ---
[INFO] Checking for multiple versions of scala
[WARNING] Expected all dependencies to require Scala version: 2.11.8
[WARNING] org.scalatest:scalatest_2.11:3.0.4 requires scala version: 2.11.11
[WARNING] Multiple versions of scala libraries detected!
[INFO] includes = [**/*.java,**/*.scala,]
[INFO] excludes = []
[WARNING] No source files found.
[INFO]
[INFO] --- maven-surefire-plugin:2.19:test (default-test) @ mxnet-scala-init ---
[INFO]
[INFO] --- maven-jar-plugin:3.0.2:jar (default-jar) @ mxnet-scala-init ---
[INFO] Building jar: /Users/cmeier/workspace/deep-learning/tmp/incubator-mxnet/scala-package/init/target/mxnet-scala-init-1.5.0-SNAPSHOT.jar
[INFO]
[INFO] --- maven-site-plugin:3.7:attach-descriptor (attach-descriptor) @ mxnet-scala-init ---
[INFO] Skipping because packaging 'jar' is not pom.
[INFO]
[INFO] --- maven-source-plugin:2.2.1:jar-no-fork (attach-sources) @ mxnet-scala-init ---
[INFO] Building jar: /Users/cmeier/workspace/deep-learning/tmp/incubator-mxnet/scala-package/init/target/mxnet-scala-init-1.5.0-SNAPSHOT-sources.jar
[INFO]
[INFO] >>> scala-maven-plugin:3.3.2:doc-jar (attach-javadocs) > generate-sources @ mxnet-scala-init >>>
[INFO]
[INFO] --- maven-enforcer-plugin:1.4.1:enforce (enforce-maven-version) @ mxnet-scala-init ---
[INFO]
[INFO] --- directory-maven-plugin:0.1:directory-of (directories) @ mxnet-scala-init ---
[INFO] Directory of org.apache.mxnet:mxnet-parent set to: /Users/cmeier/workspace/deep-learning/tmp/incubator-mxnet/scala-package
[INFO]
[INFO] <<< scala-maven-plugin:3.3.2:doc-jar (attach-javadocs) < generate-sources @ mxnet-scala-init <<<
[INFO]
[INFO] --- scala-maven-plugin:3.3.2:doc-jar (attach-javadocs) @ mxnet-scala-init ---
[WARNING] Expected all dependencies to require Scala version: 2.11.8
[WARNING] org.scalatest:scalatest_2.11:3.0.4 requires scala version: 2.11.11
[WARNING] Multiple versions of scala libraries detected!
[WARNING] Expected all dependencies to require Scala version: 2.11.8
[WARNING] org.scalatest:scalatest_2.11:3.0.4 requires scala version: 2.11.11
[WARNING] Multiple versions of scala libraries detected!
model contains 11 documentable templates
[INFO] Building jar: /Users/cmeier/workspace/deep-learning/tmp/incubator-mxnet/scala-package/init/target/mxnet-scala-init-1.5.0-SNAPSHOT-javadoc.jar
[INFO] already added, skipping
[INFO]
[INFO] --- scalatest-maven-plugin:1.0:test (test) @ mxnet-scala-init ---
Discovery starting.
Discovery completed in 56 milliseconds.
Run starting. Expected test count is: 0
DiscoverySuite:
Run completed in 86 milliseconds.
Total number of tests run: 0
Suites: completed 1, aborted 0
Tests: succeeded 0, failed 0, canceled 0, ignored 0, pending 0
No tests were executed.
[INFO]
[INFO] --- native-maven-plugin:1.0-alpha-7:javah (javah) @ mxnet-scala-init ---
[INFO] /bin/sh -c cd /Users/cmeier/workspace/deep-learning/tmp/incubator-mxnet/scala-package/init && javah -o /Users/cmeier/workspace/deep-learning/tmp/incubator-mxnet/scala-package/init/target/custom-javah/org_apache_mxnet_init_native_c_api.h -classpath /Users/cmeier/workspace/deep-learning/tmp/incubator-mxnet/scala-package/init/target/classes:/Users/cmeier/.m2/repository/commons-codec/commons-codec/1.10/commons-codec-1.10.jar:/Users/cmeier/.m2/repository/org/slf4j/slf4j-api/1.7.5/slf4j-api-1.7.5.jar:/Users/cmeier/.m2/repository/org/scala-lang/modules/scala-xml_2.11/1.0.5/scala-xml_2.11-1.0.5.jar:/Users/cmeier/.m2/repository/args4j/args4j/2.0.29/args4j-2.0.29.jar:/Users/cmeier/.m2/repository/org/scala-lang/scala-library/2.11.8/scala-library-2.11.8.jar:/Users/cmeier/.m2/repository/org/scala-lang/scala-reflect/2.11.8/scala-reflect-2.11.8.jar:/Users/cmeier/.m2/repository/org/scala-lang/modules/scala-parser-combinators_2.11/1.0.4/scala-parser-combinators_2.11-1.0.4.jar:/Users/cmeier/.m2/repository/org/scala-lang/scala-compiler/2.11.8/scala-compiler-2.11.8.jar org.apache.mxnet.init.LibInfo
[INFO]
[INFO] --- scalastyle-maven-plugin:1.0.0:check (default) @ mxnet-scala-init ---
[WARNING] testSourceDirectory is not specified or does not exist value=/Users/cmeier/workspace/deep-learning/tmp/incubator-mxnet/scala-package/init/src/test/scala
Saving to outputFile=/Users/cmeier/workspace/deep-learning/tmp/incubator-mxnet/scala-package/init/target/scalastyle-output.xml
Processed 2 file(s)
Found 0 errors
Found 0 warnings
Found 0 infos
Finished in 349 ms
[INFO]
[INFO] --- exec-maven-plugin:1.6.0:exec (verify-javah) @ mxnet-scala-init ---
[INFO] ------------------------------------------------------------------------
[INFO] Reactor Summary:
[INFO]
[INFO] MXNet Scala Package - Parent ....................... SUCCESS [ 2.951 s]
[INFO] MXNet Scala Package - Initializer .................. FAILURE [ 5.459 s]
[INFO] MXNet Scala Package - Initializer Native ........... SKIPPED
[INFO] MXNet Scala Package - Macros ....................... SKIPPED
[INFO] MXNet Scala Package - Native ....................... SKIPPED
[INFO] MXNet Scala Package - Core ......................... SKIPPED
[INFO] MXNet Scala Package - Inference .................... SKIPPED
[INFO] MXNet Scala Package - Examples ..................... SKIPPED
[INFO] MXNet Scala Package - Spark ML ..................... SKIPPED
[INFO] MXNet Scala Package - Full osx-x86_64-only ......... SKIPPED
[INFO] ------------------------------------------------------------------------
[INFO] BUILD FAILURE
[INFO] ------------------------------------------------------------------------
[INFO] Total time: 8.860 s
[INFO] Finished at: 2018-12-16T09:46:50-05:00
[INFO] Final Memory: 44M/573M
[INFO] ------------------------------------------------------------------------
[ERROR] Failed to execute goal org.codehaus.mojo:exec-maven-plugin:1.6.0:exec (verify-javah) on project mxnet-scala-init: Unable to parse configuration of mojo org.codehaus.mojo:exec-maven-plugin:1.6.0:exec for parameter successCodes: Cannot assign configuration entry 'successCodes' with value '0' of type java.lang.String to property of type java.lang.Integer[] -> [Help 1]
[ERROR]
[ERROR] To see the full stack trace of the errors, re-run Maven with the -e switch.
[ERROR] Re-run Maven using the -X switch to enable full debug logging.
[ERROR]
[ERROR] For more information about the errors and possible solutions, please read the following articles:
[ERROR] [Help 1] http://cwiki.apache.org/confluence/display/MAVEN/PluginConfigurationException
[ERROR]
[ERROR] After correcting the problems, you can resume the build with the command
[ERROR] mvn <goals> -rf :mxnet-scala-init
Sign up for free to join this conversation on GitHub. Already have an account? Sign in to comment