Skip to content

Instantly share code, notes, and snippets.

@hsbt
Created September 8, 2020 10:00
  • Star 0 You must be signed in to star a gist
  • Fork 0 You must be signed in to fork a gist
Star You must be signed in to star a gist
Save hsbt/c4a6cf7dfaf3839998378e9d55faa330 to your computer and use it in GitHub Desktop.
linking shared-object io/nonblock.bundle
../../../../ext/fiddle/libffi-3.2.1/src/arm/trampoline.S:34:17: error: vector register expected
stmfd sp!, {r0-r3}
^
../../../../ext/fiddle/libffi-3.2.1/src/arm/trampoline.S:39:9: error: invalid operand for instruction
ldr r0, [pc, #-4092]
^
../../../../ext/fiddle/libffi-3.2.1/src/arm/trampoline.S:42:9: error: invalid operand for instruction
ldr pc, [pc, #-4092]
^
../../../../ext/fiddle/libffi-3.2.1/src/arm/trampoline.S:47:17: error: vector register expected
stmfd sp!, {r0-r3}
^
../../../../ext/fiddle/libffi-3.2.1/src/arm/trampoline.S:52:9: error: invalid operand for instruction
ldr r0, [pc, #-4092]
^
../../../../ext/fiddle/libffi-3.2.1/src/arm/trampoline.S:55:9: error: invalid operand for instruction
ldr pc, [pc, #-4092]
^
../../../../ext/fiddle/libffi-3.2.1/src/arm/trampoline.S:60:17: error: vector register expected
stmfd sp!, {r0-r3}
^
../../../../ext/fiddle/libffi-3.2.1/src/arm/trampoline.S:65:9: error: invalid operand for instruction
ldr r0, [pc, #-4092]
^
../../../../ext/fiddle/libffi-3.2.1/src/arm/trampoline.S:68:9: error: invalid operand for instruction
ldr pc, [pc, #-4092]
^
../../../../ext/fiddle/libffi-3.2.1/src/arm/trampoline.S:73:17: error: vector register expected
stmfd sp!, {r0-r3}
^
../../../../ext/fiddle/libffi-3.2.1/src/arm/trampoline.S:78:9: error: invalid operand for instruction
ldr r0, [pc, #-4092]
^
../../../../ext/fiddle/libffi-3.2.1/src/arm/trampoline.S:81:9: error: invalid operand for instruction
ldr pc, [pc, #-4092]
^
../../../../ext/fiddle/libffi-3.2.1/src/arm/trampoline.S:86:17: error: vector register expected
stmfd sp!, {r0-r3}
^
../../../../ext/fiddle/libffi-3.2.1/src/arm/trampoline.S:91:9: error: invalid operand for instruction
ldr r0, [pc, #-4092]
^
../../../../ext/fiddle/libffi-3.2.1/src/arm/trampoline.S:94:9: error: invalid operand for instruction
ldr pc, [pc, #-4092]
^
../../../../ext/fiddle/libffi-3.2.1/src/arm/trampoline.S:99:17: error: vector register expected
stmfd sp!, {r0-r3}
linking shared-object -test-/num2int.bundle
^
../../../../ext/fiddle/libffi-3.2.1/src/arm/trampoline.S:104:9: error: invalid operand for instruction
ldr r0, [pc, #-4092]
^
../../../../ext/fiddle/libffi-3.2.1/src/arm/trampoline.S:107:9: error: invalid operand for instruction
ldr pc, [pc, #-4092]
^
../../../../ext/fiddle/libffi-3.2.1/src/arm/trampoline.S:112:17: error: vector register expected
stmfd sp!, {r0-r3}
^
../../../../ext/fiddle/libffi-3.2.1/src/arm/trampoline.S:117:9: error: invalid operand for instruction
ldr r0, [pc, #-4092]
^
../../../../ext/fiddle/libffi-3.2.1/src/arm/trampoline.S:120:9: error: invalid operand for instruction
ldr pc, [pc, #-4092]
^
../../../../ext/fiddle/libffi-3.2.1/src/arm/trampoline.S:125:17: error: vector register expected
stmfd sp!, {r0-r3}
^
../../../../ext/fiddle/libffi-3.2.1/src/arm/trampoline.S:130:9: error: invalid operand for instruction
ldr r0, [pc, #-4092]
^
../../../../ext/fiddle/libffi-3.2.1/src/arm/trampoline.S:133:9: error: invalid operand for instruction
ldr pc, [pc, #-4092]
^
../../../../ext/fiddle/libffi-3.2.1/src/arm/trampoline.S:138:17: error: vector register expected
stmfd sp!, {r0-r3}
^
../../../../ext/fiddle/libffi-3.2.1/src/arm/trampoline.S:143:9: error: invalid operand for instruction
ldr r0, [pc, #-4092]
^
../../../../ext/fiddle/libffi-3.2.1/src/arm/trampoline.S:146:9: error: compiling ../../../ext/openssl/ossl_x509crl.c
compiling ../../../ext/openssl/ossl_x509ext.c
../../../../ext/fiddle/libffi-3.2.1/src/arm/sysv.S:64:1: error: unexpected token at start of statement
@ This selects the minimum architecture level required.
^
../../../../ext/fiddle/libffi-3.2.1/src/arm/sysv.S:112:1: error: unknown directive
.syntax unified
^
compiling ../../../ext/openssl/ossl_x509name.c
../../../../ext/fiddle/libffi-3.2.1/src/arm/sysv.S:145:2: error: unexpected token at start of statement
@ r0: ffi_prep_args
^
../../../../ext/fiddle/libffi-3.2.1/src/arm/sysv.S:146:2: error: unexpected token at start of statement
@ r1: &ecif
^
../../../../ext/fiddle/libffi-3.2.1/src/arm/sysv.S:147:2: error: unexpected token at start of statement
@ r2: cif->bytes
^
../../../../ext/fiddle/libffi-3.2.1/src/arm/sysv.S:148:2: error: unexpected token at start of statement
@ r3: fig->flags
^
../../../../ext/fiddle/libffi-3.2.1/src/arm/sysv.S:149:2: error: unexpected token at start of statement
@ sp+0: ecif.rvalue
^
../../../../ext/fiddle/libffi-3.2.1/src/arm/sysv.S:151:2: error: unexpected token at start of statement
@ This assumes we are using gas.
^
../../../../ext/fiddle/libffi-3.2.1/src/arm/sysv.S:153:2: error: unexpected token at start of statement
@ Save registers
^
../../../../ext/fiddle/libffi-3.2.1/src/arm/sysv.S:154:21: error: vector register expected
stmfd sp!, {r0-r3, fp, lr}
^
../../../../ext/fiddle/libffi-3.2.1/src/arm/sysv.S:155:2: error: unexpected token at start of statement
@ .save {r0-r3, fp, lr}
^
compiling ../../../ext/openssl/ossl_x509req.c
compiling ../../../ext/openssl/ossl_x509revoked.c
../../../../ext/fiddle/libffi-3.2.1/src/arm/sysv.S:158:2: error: unexpected token at start of statement
@ .setfp fp, sp
^
../../../../ext/fiddle/libffi-3.2.1/src/arm/sysv.S:160:2: error: unexpected token at start of statement
@ Make room for all of the new args.
^
../../../../ext/fiddle/libffi-3.2.1/src/arm/sysv.S:161:14: error: expected compatible register, symbol or integer in range [0, 4095]
invalid operand for instruction
ldr pc, [pc, #-4092]
^
../../../../ext/fiddle/libffi-3.2.1/src/arm/trampoline.S:151:17: error: vector register expected
stmfd sp!, {r0-r3}
^
../../../../ext/fiddle/libffi-3.2.1/src/arm/trampoline.S:156:9: error: invalid operand for instruction
ldr r0, [pc, #-4092]
^
../../../../ext/fiddle/libffi-3.2.1/src/arm/trampoline.S:159:9: error: invalid operand for instruction
ldr pc, [pc, #-4092]
^
../../../../ext/fiddle/libffi-3.2.1/src/arm/trampoline.S:164:17: error: vector register expected
stmfd sp!, {r0-r3}
^
../../../../ext/fiddle/libffi-3.2.1/src/arm/trampoline.S:169:9: error: invalid operand for instruction
ldr r0, [pc, #-4092]
^
../../../../ext/fiddle/libffi-3.2.1/src/arm/trampoline.S:172:9: error: invalid operand for instruction
ldr pc, [pc, #-4092]
^
../../../../ext/fiddle/libffi-3.2.1/src/arm/trampoline.S:177:17: error: vector register expected
stmfd sp!, {r0-r3}
^
../../../../ext/fiddle/libffi-3.2.1/src/arm/trampoline.S:182:9: error: invalid operand for instruction
ldr r0, [pc, #-4092]
^
../../../../ext/fiddle/libffi-3.2.1/src/arm/trampoline.S:185:9: error: invalid operand for instruction
ldr pc, [pc, #-4092]
^
../../../../ext/fiddle/libffi-3.2.1/src/arm/trampoline.S:190:17: error: vector register expected
stmfd sp!, {r0-r3}
^
../../../../ext/fiddle/libffi-3.2.1/src/arm/trampoline.S:195:9: error: invalid operand for instruction
ldr r0, [pc, #-4092]
^
../../../../ext/fiddle/libffi-3.2.1/src/arm/trampoline.S:198:9: error: invalid operand for instruction
ldr pc, [pc, #-4092]
^
../../../../ext/fiddle/libffi-3.2.1/src/arm/trampoline.S:203:17: error: vector register expected
stmfd sp!, {r0-r3}
^
../../../../ext/fiddle/libffi-3.2.1/src/arm/trampoline.S:208:9: error: invalid operand for instruction
ldr r0, [pc, #-4092]
^
../../../../ext/fiddle/libffi-3.2.1/src/arm/trampoline.S:211:9: error: invalid operand for instruction
ldr pc, [pc, #-4092]
^
../../../../ext/fiddle/libffi-3.2.1/src/arm/trampoline.S:216:17: error: vector register expected
stmfd sp!, {r0-r3}
^
../../../../ext/fiddle/libffi-3.2.1/src/arm/trampoline.S:221:9: error: invalid operand for instruction
ldr r0, [pc, #-4092]
^
../../../../ext/fiddle/libffi-3.2.1/src/arm/trampoline.S:224:9: error: invalid operand for instruction
ldr pc, [pc, #-4092]
^
../../../../ext/fiddle/libffi-3.2.1/src/arm/trampoline.S:229:17: error: vector register expected
stmfd sp!, {r0-r3}
^
../../../../ext/fiddle/libffi-3.2.1/src/arm/trampoline.S:234:9: error: invalid operand for instruction
ldr r0, [pc, #-4092]
^
../../../../ext/fiddle/libffi-3.2.1/src/arm/trampoline.S:237:9: error: invalid operand for instruction
ldr pc, [pc, #-4092]
^
../../../../ext/fiddle/libffi-3.2.1/src/arm/trampoline.S:242:17: error: vector regis sub sp, fp, r2
^
../../../../ext/fiddle/libffi-3.2.1/src/arm/sysv.S:163:2: error: unexpected token at start of statement
@ Place all of the ffi_prep_args in position
^
../../../../ext/fiddle/libffi-3.2.1/src/arm/sysv.S:164:6: error: invalid operand for instruction
mov r0, sp
^
../../../../ext/fiddle/libffi-3.2.1/src/arm/sysv.S:165:2: error: unexpected token at start of statement
@ r1 already set
^
../../../../ext/fiddle/libffi-3.2.1/src/arm/sysv.S:167:2: error: unexpected token at start of statement
@ Call ffi_prep_args(stack, &ecif)
^
../../../../ext/fiddle/libffi-3.2.1/src/arm/sysv.S:170:2: error: unexpected token at start of statement
@ move first 4 parameters in registers
^
../../../../ext/fiddle/libffi-3.2.1/src/arm/sysv.S:171:13: ompiling ../../../ext/openssl/ossl_x509store.c
0merror: vector register expected
ldmia sp, {r0-r3}
^
../../../../ext/fiddle/libffi-3.2.1/src/arm/sysv.S:173:2: error: unexpected token at start of statement
@ and adjust stack
^
../../../../ext/fiddle/libffi-3.2.1/src/arm/sysv.S:174:17: error: unexpected token in argument list
sub lr, fp, sp @ cif->bytes == fp - sp
^
../../../../ext/fiddle/libffi-3.2.1/src/arm/sysv.S:175:15: error: unexpected token in argument list
ldr ip, [fp] @ load fn() in advance
^
../../../../ext/fiddle/libffi-3.2.1/src/arm/sysv.S:177:2: error: unrecognized instruction mnemonic, did you mean: mov?
movhs lr, #16
^
../../../../ext/fiddle/libffi-3.2.1/src/arm/sysv.S:180:2: error: unexpected token at start of statement
@ call (fn) (...)
^
^[[?1;2c../../../../ext/fiddle/libffi-3.2.1/src/arm/sysv.S:181:10: error: expected compatible register or logical immediate
mov lr, pc ; mov pc, ip
^
../../../../ext/fiddle/libffi-3.2.1/src/arm/sysv.S:183:2: error: unexpected token at start of statement
@ Remove the space we pushed for the args
^
../../../../ext/fiddle/libffi-3.2.1/src/arm/sysv.S:186:2: error: unexpected token at start of statement
@ Load r2 with the pointer to storage for the return value
^
../../../../ext/fiddle/libffi-3.2.1/src/arm/sysv.S:187:6: error: invalid operand for instruction
ldr r2, [sp, #24]
^
../../../../ext/fiddle/libffi-3.2.1/src/arm/sysv.S:189:2: error: unexpected token at start of statement
@ Load r3 with the return type code
^
../../../../ext/fiddle/libffi-3.2.1/src/arm/sysv.S:190:6: error: invalid operand for instruction
ldr r3, [sp, #12]
^
../../../../ext/fiddle/libffi-3.2.1/src/arm/sysv.S:192:2: error: unexpected token at start of statement
@ If the return value pointer is NULL, assume no return value.
^
../../../../ext/fiddle/libffi-3.2.1/src/arm/sysv.S:193:6: error: invalid operand for instruction
cmp r2, #0
^
../../../../ext/fiddle/libffi-3.2.1/src/arm/sysv.S:196:1: error: unexpected token at start of statement
@ return INT
^
../../../../ext/fiddle/libffi-3.2.1/src/arm/sysv.S:197:6: error: invalid operand for instruction
cmp r3, #1
^
../../../../ext/fiddle/libffi-3.2.1/src/arm/sysv.S:199:8: error: invalid operand for instruction
cmpne r3, #2
^
../../../../ext/fiddle/libffi-3.2.1/src/arm/sysv.S:201:2: error: unrecognized instruction mnemonic, did you mean: str?
streq r0, [r2]
^
../../../../ext/fiddle/libffi-3.2.1/src/arm/sysv.S:204:2: error: unexpected token at start of statement
@ return INT64
^
../../../../ext/fiddle/libffi-3.2.1/src/arm/sysv.S:205:6: error: invalid operand for instruction
cmp r3, #12
^
../../../../ext/fiddle/libffi-3.2.1/src/arm/sysv.S:207:8: error: invalid operand for instruction
cmpne r3, #3
^
../../../../ext/fiddle/libffi-3.2.1/src/arm/sysv.S:209:15: error: vector register expected
stmiaeq r2, {r0, r1}
^
../../../../ext/fiddle/libffi-3.2.1/src/arm/sysv.S:236:14: error: vector register expected
ldmia sp!, {r0-r3,fp, pc}
^
../../../../ext/fiddle/libffi-3.2.1/src/arm/sysv.S:240:2: error: unexpected token at start of statement
@ .fnend
^
../../../../ext/fiddle/libffi-3.2.1/src/arm/sysv.S:255:2: error: unexpected token at start of statement
@ .pad #16
^
../../../../ext/fiddle/libffi-3.2.1/src/arm/sysv.S:256:6: error: invalid operand for instruction
add ip, sp, #16
^
../../../../ext/fiddle/libffi-3.2.1/src/arm/sysv.S:257:14: error: vector register expected
stmfd sp!, {ip, lr}
^
../../../../ext/fiddle/libffi-3.2.1/src/arm/sysv.S:258:2: error: unexpected token at start of statement
@ .save {r0, lr}
^
../../../../ext/fiddle/libffi-3.2.1/src/arm/sysv.S:259:6: error: invalid operand for instruction
add r2, sp, #8
^
../../../../ext/fiddle/libffi-3.2.1/src/arm/sysv.S:260:2: linking shared-object -test-/printf.bundle
ter expected
stmfd sp!, {r0-r3}
^
../../../../ext/fiddle/libffi-3.2.1/src/arm/trampoline.S:247:9: error: invalid operand for instruction
ldr r0, [pc, #-4092]
^
../../../../ext/fiddle/libffi-3.2.1/src/arm/trampoline.S:250:9: error: invalid operand for instruction
ldr pc, [pc, #-4092]
^
../../../../ext/fiddle/libffi-3.2.1/src/arm/trampoline.S:255:17: error: vector register expected
stmfd sp!, {r0-r3}
^
../../../../ext/fiddle/libffi-3.2.1/src/arm/trampoline.S:260:9: error: invalid operand for instruction
ldr r0, [pc, #-4092]
^
../../../../ext/fiddle/libffi-3.2.1/src/arm/trampoline.S:263:9: error: invalid operand for instruction
ldr pc, [pc, #-4092]
^
../../../../ext/fiddle/libffi-3.2.1/src/arm/trampoline.S:268:17: error: vector register expected
stmfd sp!, {r0-r3}
^
../../../../ext/fiddle/libffi-3.2.1/src/arm/trampoline.S:273:9: error: invalid operand for instruction
ldr r0, [pc, #-4092]
^
../../../../ext/fiddle/libffi-3.2.1/src/arm/trampoline.S:276:9: error: invalid operand for instruction
ldr pc, [pc, #-4092]
^
../../../../ext/fiddle/libffi-3.2.1/src/arm/trampoline.S:281:17: error: vector register expected
stmfd sp!, {r0-r3}
^
../../../../ext/fiddle/libffi-3.2.1/src/arm/trampoline.S:286:9: error: invalid operand for instruction
ldr r0, [pc, #-4092]
^
../../../../ext/fiddle/libffi-3.2.1/src/arm/trampoline.S:289:9: error: invalid operand for instruction
ldr pc, [pc, #-4092]
^
../../../../ext/fiddle/libffi-3.2.1/src/arm/trampoline.S:294:17: error: vector register expected
stmfd sp!, {r0-r3}
^
../../../../ext/fiddle/libffi-3.2.1/src/arm/trampoline.S:299:9: error: invalid operand for instruction
ldr r0, [pc, #-4092]
^
../../../../ext/fiddle/libffi-3.2.1/src/arm/trampoline.S:302:9: error: linking shared-object monitor.bundle
invalid operand for instruction
ldr pc, [pc, #-4092]
^
../../../../ext/fiddle/libffi-3.2.1/src/arm/trampoline.S:307:17: error: vector register expected
stmfd sp!, {r0-r3}
^
../../../../ext/fiddle/libffi-3.2.1/src/arm/trampoline.S:312:9: error: invalid operand for instruction
ldr r0, [pc, #-4092]
^
../../../../ext/fiddle/libffi-3.2.1/src/arm/trampoline.S:315:9: error: invalid operand for instruction
ldr pc, [pc, #-4092]
^
../../../../ext/fiddle/libffi-3.2.1/src/arm/trampoline.S:320:17: error: vector register expected
stmfd sp!, {r0-r3}
^
../../../../ext/fiddle/libffi-3.2.1/src/arm/trampoline.S:325:9: error: invalid operand for instruction
ldr r0, [pc, #-4092]
^
../../../../ext/fiddle/libffi-3.2.1/src/arm/trampoline.S:328:9: error: invalid operand for instruction
ldr pc, [pc, #-4092]
^
../../../../ext/fiddle/libffi-3.2.1/src/arm/trampoline.S:333:17: error: vector register expected
stmfd sp!, {r0-r3}
^
../../../../ext/fiddle/libffi-3.2.1/src/arm/trampoline.S:338:9: error: invalid operand for instruction
ldr r0, [pc, #-4092]
^
../../../../ext/fiddle/libffi-3.2.1/src/arm/trampoline.S:341:9: error: invalid operand for instruction
ldr pc, [pc, #-4092]
^
../../../../ext/fiddle/libffi-3.2.1/src/arm/trampoline.S:346:17: error: vector register expected
stmfd sp!, {r0-r3}
^
../../../../ext/fiddle/libffi-3.2.1/src/arm/trampoline.S:351:9: error: invalid operand for instruction
ldr r0, [pc, #-4092]
^
../../../../ext/fiddle/libffi-3.2.1/src/arm/trampoline.S:354:9: error: invalid operand for instruction
ldr pc, [pc, #-4092]
^
../../../../ext/fiddle/libffi-3.2.1/src/arm/trampoline.S:359:17: error: vector register expected
stmfd sp!, {r0-r3}
^
../../../../ext/fiddle/libffi-3.2.1/src/arm/trampoline.S:364:9: error: invalid operand for instruction
ldr r0, [pc, #-4092]
^
../../../../ext/fiddle/libffi-3.2.1/src/arm/trampoline.S:367:9: error: invalid operand for instruction
ldr pc, [pc, #-4092]
^
../../../../ext/fiddle/libffi-3.2.1/src/arm/trampoline.S:372:17: error: vector register expected
stmfd sp!, {r0-r3}
^
../../../../ext/fiddle/libffi-3.2.1/src/arm/trampoline.S:377:9: error: invalid operand for instruction
ldr r0, [pc, #-4092]
^
../../../../ext/fiddle/libffi-3.2.1/src/arm/trampoline.S:380:9: error: invalid operand for instruction
ldr pc, [pc, #-4092]
^
../../../../ext/fiddle/libffi-3.2.1/src/arm/trampoline.S:385:17: error: vector register expected
stmfd sp!, {r0-r3}
^
../../../../ext/fiddle/libffi-3.2.1/src/arm/trampoline.S:390:9: error: invalid operand for instruction
ldr r0, [pc, #-4092]
^
../../../../ext/fiddle/libffi-3.2.1/src/arm/trampoline.S:393:9: error: invalid operand for instruction
ldr pc, [pc, #-4092]
^
../../../../ext/fiddle/libffi-3.2.1/src/arm/trampoline.S:398:17: error: vector register expected
stmfd sp!, {r0-r3}
^
../../../../ext/fiddle/libffi-3.2.1/src/arm/trampoline.S:403:9: error: invalid operand for instruction
ldr r0, [pc, #-4092]
^
../../../../ext/fiddle/libffi-3.2.1/src/arm/trampoline.S:406:9: error: invalid operand for instruction
ldr pc, [pc, #-4092]
^
../../../../ext/fiddle/libffi-3.2.1/src/arm/trampoline.S:411:17: error: vector register expected
stmfd sp!, {r0-r3}
^
../../../../ext/fiddle/libffi-3.2.1/src/arm/trampoline.S:416:9: error: invalid operand for instruction
ldr r0, [pc, #-4092]
^
../../../../ext/fiddle/libffi-3.2.1/src/arm/trampoline.S:419:9: error: invalid operand for instruction
ldr pc, [pc, #-4092]
^
../../../../ext/fiddle/libffi-3.2.1/src/arm/trampoline.S:424:17: error: vector register expected
stmfd sp!, {r0-r3}
^
../../../../ext/fiddle/libffi-3.2.1/src/arm/trampoline.S:429:9: error: invalid operand for instruction
ldr r0, [pc, #-4092]
^
../../../../ext/fiddle/libffi-3.2.1/src/arm/trampoline.S:432:9: error: invalid operand for instruction
ldr pc, [pc, #-4092]
^
../../../../ext/fiddle/libffi-3.2.1/src/arm/trampoline.S:437:17: error: vector register expected
stmfd sp!, {r0-r3}
^
../../../../ext/fiddle/libffi-3.2.1/src/arm/trampoline.S:442:9: error: invalid operand for instruction
ldr r0, [pc, #-4092]
^
../../../../ext/fiddle/libffi-3.2.1/src/arm/trampoline.S:445:9: error: invalid operand for instruction
ldr pc, [pc, #-4092]
^
../../../../ext/fiddle/libffi-3.2.1/src/arm/trampoline.S:450:17: error: vector register expected
stmfd sp!, {r0-r3}
^
../../../../ext/fiddle/libffi-3.2.1/src/arm/trampoline.S:455:9: error: invalid operand for instruction
ldr r0, [pc, #-4092]
^
../../../../ext/fiddle/libffi-3.2.1/src/arm/trampoline.S:458:9: error: invalid operand for instruction
ldr pc, [pc, #-4092]
^
../../../../ext/fiddle/libffi-3.2.1/src/arm/trampoline.S:463:17: error: vector register expected
stmfd sp!, {r0-r3}
^
../../../../ext/fiddle/libffi-3.2.1/src/arm/trampoline.S:468:9: error: invalid operand for instruction
ldr r0, [pc, #-4092]
^
../../../../ext/fiddle/libffi-3.2.1/src/arm/trampoline.S:471:9: error: invalid operand for instruction
ldr pc, [pc, #-4092]
^
../../../../ext/fiddle/libffi-3.2.1/src/arm/trampoline.S:476:17: error: vector register expected
stmfd sp!, {r0-r3}
^
../../../../ext/fiddle/libffi-3.2.1/src/arm/trampoline.S:481:9: error: invalid operand for instruction
ldr r0, [pc, #-4092]
^
../../../../ext/fiddle/libffi-3.2.1/src/arm/trampoline.S:484:9: error: invalid operand for instruction
ldr pc, [pc, #-4092]
^
../../../../ext/fiddle/libffi-3.2.1/src/arm/trampoline.S:489:17: error: vector register expected
stmfd sp!, {r0-r3}
^
../../../../ext/fiddle/libffi-3.2.1/src/arm/trampoline.S:494:9: error: invalid operand for instruction
ldr r0, [pc, #-4092]
^
../../../../ext/fiddle/libffi-3.2.1/src/arm/trampoline.S:497:9: error: invalid operand for instruction
ldr pc, [pc, #-4092]
^
../../../../ext/fiddle/libffi-3.2.1/src/arm/trampoline.S:502:17: error: vector register expected
stmfd sp!, {r0-r3}
^
../../../../ext/fiddle/libffi-3.2.1/src/arm/trampoline.S:507:9: error: invalid operand for instruction
ldr r0, [pc, #-4092]
^
../../../../ext/fiddle/libffi-3.2.1/src/arm/trampoline.S:510:9: error: invalid operand for instruction
ldr pc, [pc, #-4092]
^
../../../../ext/fiddle/libffi-3.2.1/src/arm/trampoline.S:515:17: error: vector register expected
stmfd sp!, {r0-r3}
^
../../../../ext/fiddle/libffi-3.2.1/src/arm/trampoline.S:520:9: error: invalid operand for instruction
ldr r0, [pc, #-4092]
^
../../../../ext/fiddle/libffi-3.2.1/src/arm/trampoline.S:523:9: error: invalid operand for instruction
ldr pc, [pc, #-4092]
^
../../../../ext/fiddle/libffi-3.2.1/src/arm/trampoline.S:528:17: error: vector register expected
stmfd sp!, {r0-r3}
^
../../../../ext/fiddle/libffi-3.2.1/src/arm/trampoline.S:533:9: error: invalid operand for instruction
ldr r0, [pc, #-4092]
^
../../../../ext/fiddle/libffi-3.2.1/src/arm/trampoline.S:536:9: error: invalid operand for instruction
ldr pc, [pc, #-4092]
^
../../../../ext/fiddle/libffi-3.2.1/src/arm/trampoline.S:541:17: error: vector register expected
stmfd sp!, {r0-r3}
^
../../../../ext/fiddle/libffi-3.2.1/src/arm/trampoline.S:546:9: error: invalid operand for instruction
ldr r0, [pc, #-4092]
^
../../../../ext/fiddle/libffi-3.2.1/src/arm/trampoline.S:549:9: error: invalid operand for instruction
ldr pc, [pc, #-4092]
^
../../../../ext/fiddle/libffi-3.2.1/src/arm/trampoline.S:554:17: error: vector register expected
stmfd sp!, {r0-r3}
^
../../../../ext/fiddle/libffi-3.2.1/src/arm/trampoline.S:559:9: error: invalid operand for instruction
ldr r0, [pc, #-4092]
^
../../../../ext/fiddle/libffi-3.2.1/src/arm/trampoline.S:562:9: error: invalid operand for instruction
ldr pc, [pc, #-4092]
^
../../../../ext/fiddle/libffi-3.2.1/src/arm/trampoline.S:567:17: error: vector register expected
stmfd sp!, {r0-r3}
^
../../../../ext/fiddle/libffi-3.2.1/src/arm/trampoline.S:572:9: error: invalid operand for instruction
ldr r0, [pc, #-4092]
^
../../../../ext/fiddle/libffi-3.2.1/src/arm/trampoline.S:575:9: error: invalid operand for instruction
ldr pc, [pc, #-4092]
^
../../../../ext/fiddle/libffi-3.2.1/src/arm/trampoline.S:580:17: error: vector register expected
stmfd sp!, {r0-r3}
^
../../../../ext/fiddle/libffi-3.2.1/src/arm/trampoline.S:585:9: error: invalid operand for instruction
ldr r0, [pc, #-4092]
^
../../../../ext/fiddle/libffi-3.2.1/src/arm/trampoline.S:588:9: error: invalid operand for instruction
ldr pc, [pc, #-4092]
^
../../../../ext/fiddle/libffi-3.2.1/src/arm/trampoline.S:593:17: error: vector register expected
stmfd sp!, {r0-r3}
^
../../../../ext/fiddle/libffi-3.2.1/src/arm/trampoline.S:598:9: error: invalid operand for instruction
ldr r0, [pc, #-4092]
^
../../../../ext/fiddle/libffi-3.2.1/src/arm/trampoline.S:601:9: error: invalid operand for instruction
ldr pc, [pc, #-4092]
^
../../../../ext/fiddle/libffi-3.2.1/src/arm/trampoline.S:606:17: error: vector register expected
stmfd sp!, {r0-r3}
^
../../../../ext/fiddle/libffi-3.2.1/src/arm/trampoline.S:611:9: error: invalid operand for instruction
ldr r0, [pc, #-4092]
^
../../../../ext/fiddle/libffi-3.2.1/src/arm/trampoline.S:614:9: error: invalid operand for instruction
ldr pc, [pc, #-4092]
^
../../../../ext/fiddle/libffi-3.2.1/src/arm/trampoline.S:619:17: error: vector register expected
stmfd sp!, {r0-r3}
^
../../../../ext/fiddle/libffi-3.2.1/src/arm/trampoline.S:624:9: error: invalid operand for instruction
ldr r0, [pc, #-4092]
^
error: unexpected token at start of statement
@ .pad #16
^
../../../../ext/fiddle/libffi-3.2.1/src/arm/sysv.S:262:6: error: invalid operand for instruction
str sp, [sp, #8]
^
../../../../ext/fiddle/libffi-3.2.1/src/arm/sysv.S:263:6: error: invalid operand for instruction
add r1, sp, #8
^
../../../../ext/fiddle/libffi-3.2.1/src/arm/sysv.S:265:6: error: invalid operand for instruction
cmp r0, #1
^
../../../../ext/fiddle/libffi-3.2.1/src/arm/sysv.S:268:6: error: invalid operand for instruction
cmp r0, #2
^
../../../../ext/fiddle/libffi-3.2.1/src/arm/sysv.S:275:6: error: invalid operand for instruction
cmp r0, #3
^
../../../../ext/fiddle/libffi-3.2.1/src/arm/sysv.S:282:6: error: invalid operand flinking shared-object io/wait.bundle
or instruction
cmp r0, #3
^
../../../../ext/fiddle/libffi-3.2.1/src/arm/sysv.S:289:6: error: invalid operand for instruction
cmp r0, #12
^
../../../../ext/fiddle/libffi-3.2.1/src/arm/sysv.S:293:13: error: vector register expected
ldmfd sp, {sp, pc}
^
../../../../ext/fiddle/libffi-3.2.1/src/arm/sysv.S:295:6: error: invalid operand for instruction
ldr r0, [sp]
^
../../../../ext/fiddle/libffi-3.2.1/src/arm/sysv.S:298:6: error: invalid operand for instruction
ldr r0, [sp]
^
../../../../ext/fiddle/libffi-3.2.1/src/arm/sysv.S:299:6: error: invalid operand for instruction
ldr r1, [sp, #4]
^
../../../../ext/fiddle/libffi-3.2.1/src/arm/sysv.S:315:2: error: unexpected token at start of statement
@ .fnend
^
../../../../ext/fiddle/libffi-3.2.1/src/arm/sysv.S:485:14: error: vector register expected
stmfd sp!, {r0-r3}
^
../../../../ext/fiddle/libffi-3.2.1/src/arm/sysv.S:486:6: error: invalid operand for instruction
ldr r0, [pc]
^
../../../../ext/fiddle/libffi-3.2.1/src/arm/sysv.S:487:6: error: invalid operand for instruction
ldr pc, [pc]
^
make[5]: *** [src/arm/sysv.lo] Error 1
make[5]: *** Waiting for unfinished jobs....
linking shared-object rbconfig/sizeof.bundle
../../../../ext/fiddle/libffi-3.2.1/src/arm/trampoline.S:627:9: error: invalid operand for instruction
ldr pc, [pc, #-4092]
^
../../../../ext/fiddle/libffi-3.2.1/src/arm/trampoline.S:632:17: error: vector register expected
stmfd sp!, {r0-r3}
^
../../../../ext/fiddle/libffi-3.2.1/src/arm/trampoline.S:637:9: error: invalid operand for instruction
ldr r0, [pc, #-4092]
^
../../../../ext/fiddle/libffi-3.2.1/src/arm/trampoline.S:640:9: error: invalid operand for instruction
ldr pc, [pc, #-4092]
^
../../../../ext/fiddle/libffi-3.2.1/src/arm/trampoline.S:645:17: error: vector register expected
stmfd sp!, {r0-r3}
^
../../../../ext/fiddle/libffi-3.2.1/src/arm/trampoline.S:650:9: error: invalid operand for instruction
ldr r0, [pc, #-4092]
^
../../../../ext/fiddle/libffi-3.2.1/src/arm/trampoline.S:653:9: error: invalid operand for instruction
ldr pc, [pc, #-4092]
^
../../../../ext/fiddle/libffi-3.2.1/src/arm/trampoline.S:658:17: error: vector register expected
stmfd sp!, {r0-r3}
^
../../../../ext/fiddle/libffi-3.2.1/src/arm/trampoline.S:663:9: error: invalid operand for instruction
ldr r0, [pc, #-4092]
^
../../../../ext/fiddle/libffi-3.2.1/src/arm/trampoline.S:666:9: error: invalid operand for instruction
ldr pc, [pc, #-4092]
^
../../../../ext/fiddle/libffi-3.2.1/src/arm/trampoline.S:671:17: error: vector register expected
stmfd sp!, {r0-r3}
^
../../../../ext/fiddle/libffi-3.2.1/src/arm/trampoline.S:676:9: error: invalid operand for instruction
ldr r0, [pc, #-4092]
^
../../../../ext/fiddle/libffi-3.2.1/src/arm/trampoline.S:679:9: error: invalid operand for instruction
ldr pc, [pc, #-4092]
^
../../../../ext/fiddle/libffi-3.2.1/src/arm/trampoline.S:684:17: error: vector register expected
stmfd sp!, {r0-r3}
^
../../../../ext/fiddle/libffi-3.2.1/src/arm/trampoline.S:689:9: error: invalid operand for instruction
ldr r0, [pc, #-4092]
^
../../../../ext/fiddle/libffi-3.2.1/src/arm/trampoline.S:692:9: error: invalid operand for instruction
ldr pc, [pc, #-4092]
^
../../../../ext/fiddle/libffi-3.2.1/src/arm/trampoline.S:697:17: error: vector register expected
stmfd sp!, {r0-r3}
^
../../../../ext/fiddle/libffi-3.2.1/src/arm/trampoline.S:702:9: error: invalid operand for instruction
ldr r0, [pc, #-4092]
^
../../../../ext/fiddle/libffi-3.2.1/src/arm/trampoline.S:705:9: error: invalid operand for instruction
ldr pc, [pc, #-4092]
^
linking shared-object cgi/escape.bundle
linking shared-object pty.bundle
linking shared-object -test-/string.bundle
linking shared-object coverage.bundle
../../../../ext/fiddle/libffi-3.2.1/src/arm/trampoline.S:710:17: error: vector register expected
stmfd sp!, {r0-r3}
^
../../../../ext/fiddle/libffi-3.2.1/src/arm/trampoline.S:715:9: error: invalid operand for instruction
ldr r0, [pc, #-4092]
^
../../../../ext/fiddle/libffi-3.2.1/src/arm/trampoline.S:718:9: error: invalid operand for instruction
ldr pc, [pc, #-4092]
^
../../../../ext/fiddle/libffi-3.2.1/src/arm/trampoline.S:723:17: error: vector register expected
stmfd sp!, {r0-r3}
^
../../../../ext/fiddle/libffi-3.2.1/src/arm/trampoline.S:728:9: error: invalid operand for instruction
ldr r0, [pc, #-4092]
^
../../../../ext/fiddle/libffi-3.2.1/src/arm/trampoline.S:731:9: error: invalid operand for instruction
ldr pc, [pc, #-4092]
^
../../../../ext/fiddle/libffi-3.2.1/src/arm/trampoline.S:736:17: error: vector register expected
stmfd sp!, {r0-r3}
^
../../../../ext/fiddle/libffi-3.2.1/src/arm/trampoline.S:741:9: error: invalid operand for instruction
ldr r0, [pc, #-4092]
^
../../../../ext/fiddle/libffi-3.2.1/src/arm/trampoline.S:744:9: error: invalid operand for instruction
ldr pc, [pc, #-4092]
^
../../../../ext/fiddle/libffi-3.2.1/src/arm/trampoline.S:749:17: error: vector register expected
stmfd sp!, {r0-r3}
^
../../../../ext/fiddle/libffi-3.2.1/src/arm/trampoline.S:754:9: error: invalid operand for instruction
ldr r0, [pc, #-4092]
^
../../../../ext/fiddle/libffi-3.2.1/src/arm/trampoline.S:757:9: error: invalid operand for instruction
ldr pc, [pc, #-4092]
^
../../../../ext/fiddle/libffi-3.2.1/src/arm/trampoline.S:762:17: error: vector register expected
stmfd sp!, {r0-r3}
^
../../../../ext/fiddle/libffi-3.2.1/src/arm/trampoline.S:767:9: error: invalid operand for instruction
ldr r0, [pc, #-4092]
^
../../../../ext/fiddle/libffi-3.2.1/src/arm/trampoline.S:770:9: error: invalid operand for instruction
ldr pc, [pc, #-4092]
^
../../../../ext/fiddle/libffi-3.2.1/src/arm/trampoline.S:775:17: error: vector register expected
stmfd sp!, {r0-r3}
^
../../../../ext/fiddle/libffi-3.2.1/src/arm/trampoline.S:780:9: error: invalid operand for instruction
ldr r0, [pc, #-4092]
^
../../../../ext/fiddle/libffi-3.2.1/src/arm/trampoline.S:783:9: error: invalid operand for instruction
ldr pc, [pc, #-4092]
^
../../../../ext/fiddle/libffi-3.2.1/src/arm/trampoline.S:788:17: error: vector register expected
stmfd sp!, {r0-r3}
^
../../../../ext/fiddle/libffi-3.2.1/src/arm/trampoline.S:793:9: error: invalid operand for instruction
ldr r0, [pc, #-4092]
^
../../../../ext/fiddle/libffi-3.2.1/src/arm/trampoline.S:796:9: error: invalid operand for instruction
ldr pc, [pc, #-4092]
^
../../../../ext/fiddle/libffi-3.2.1/src/arm/trampoline.S:801:17: error: vector register expected
stmfd sp!, {r0-r3}
^
../../../../ext/fiddle/libffi-3.2.1/src/arm/trampoline.S:806:9: error: invalid operand for instruction
ldr r0, [pc, #-4092]
^
../../../../ext/fiddle/libffi-3.2.1/src/arm/trampoline.S:809:9: error: invalid operand for instruction
ldr pc, [pc, #-4092]
^
../../../../ext/fiddle/libffi-3.2.1/src/arm/trampoline.S:814:17: error: vector register expected
stmfd sp!, {r0-r3}
^
../../../../ext/fiddle/libffi-3.2.1/src/arm/trampoline.S:819:9: error: invalid operand for instruction
ldr r0, [pc, #-4092]
^
../../../../ext/fiddle/libffi-3.2.1/src/arm/trampoline.S:822:9: error: invalid operand for instruction
ldr pc, [pc, #-4092]
^
../../../../ext/fiddle/libffi-3.2.1/src/arm/trampoline.S:827:17: error: vector register expected
stmfd sp!, {r0-r3}
^
../../../../ext/fiddle/libffi-3.2.1/src/arm/trampoline.S:832:9: error: invalid operand for instruction
ldr r0, [pc, #-4092]
^
../../../../ext/fiddle/libffi-3.2.1/src/arm/trampoline.S:835:9: error: invalid operand for instruction
ldr pc, [pc, #-4092]
^
../../../../ext/fiddle/libffi-3.2.1/src/arm/trampoline.S:840:17: error: vector register expected
stmfd sp!, {r0-r3}
^
../../../../ext/fiddle/libffi-3.2.1/src/arm/trampoline.S:845:9: error: invalid operand for instruction
ldr r0, [pc, #-4092]
^
../../../../ext/fiddle/libffi-3.2.1/src/arm/trampoline.S:848:9: error: invalid operand for instruction
ldr pc, [pc, #-4092]
^
../../../../ext/fiddle/libffi-3.2.1/src/arm/trampoline.S:853:17: error: vector register expected
stmfd sp!, {r0-r3}
^
../../../../ext/fiddle/libffi-3.2.1/src/arm/trampoline.S:858:9: error: invalid operand for instruction
ldr r0, [pc, #-4092]
^
../../../../ext/fiddle/libffi-3.2.1/src/arm/trampoline.S:861:9: error: invalid operand for instruction
ldr pc, [pc, #-4092]
^
../../../../ext/fiddle/libffi-3.2.1/src/arm/trampoline.S:866:17: error: vector register expected
stmfd sp!, {r0-r3}
^
../../../../ext/fiddle/libffi-3.2.1/src/arm/trampoline.S:871:9: error: invalid operand for instruction
ldr r0, [pc, #-4092]
^
../../../../ext/fiddle/libffi-3.2.1/src/arm/trampoline.S:874:9: error: invalid operand for instruction
ldr pc, [pc, #-4092]
^
../../../../ext/fiddle/libffi-3.2.1/src/arm/trampoline.S:879:17: error: vector register expected
stmfd sp!, {r0-r3}
^
../../../../ext/fiddle/libffi-3.2.1/src/arm/trampoline.S:884:9: error: invalid operand for instruction
ldr r0, [pc, #-4092]
^
../../../../ext/fiddle/libffi-3.2.1/src/arm/trampoline.S:887:9: error: invalid operand for instruction
ldr pc, [pc, #-4092]
^
../../../../ext/fiddle/libffi-3.2.1/src/arm/trampoline.S:892:17: error: vector register expected
stmfd sp!, {r0-r3}
^
../../../../ext/fiddle/libffi-3.2.1/src/arm/trampoline.S:897:9: error: invalid operand for instruction
ldr r0, [pc, #-4092]
^
../../../../ext/fiddle/libffi-3.2.1/src/arm/trampoline.S:900:9: error: invalid operand for instruction
ldr pc, [pc, #-4092]
^
../../../../ext/fiddle/libffi-3.2.1/src/arm/trampoline.S:905:17: error: vector register expected
stmfd sp!, {r0-r3}
^
../../../../ext/fiddle/libffi-3.2.1/src/arm/trampoline.S:910:9: error: invalid operand for instruction
ldr r0, [pc, #-4092]
^
../../../../ext/fiddle/libffi-3.2.1/src/arm/trampoline.S:913:9: error: invalid operand for instruction
ldr pc, [pc, #-4092]
^
../../../../ext/fiddle/libffi-3.2.1/src/arm/trampoline.S:918:17: error: vector register expected
stmfd sp!, {r0-r3}
^
../../../../ext/fiddle/libffi-3.2.1/src/arm/trampoline.S:923:9: error: invalid operand for instruction
ldr r0, [pc, #-4092]
^
../../../../ext/fiddle/libffi-3.2.1/src/arm/trampoline.S:926:9: error: invalid operand for instruction
ldr pc, [pc, #-4092]
^
../../../../ext/fiddle/libffi-3.2.1/src/arm/trampoline.S:931:17: error: vector register expected
stmfd sp!, {r0-r3}
^
../../../../ext/fiddle/libffi-3.2.1/src/arm/trampoline.S:936:9: error: invalid operand for instruction
ldr r0, [pc, #-4092]
^
../../../../ext/fiddle/libffi-3.2.1/src/arm/trampoline.S:939:9: error: invalid operand for instruction
ldr pc, [pc, #-4092]
^
../../../../ext/fiddle/libffi-3.2.1/src/arm/trampoline.S:944:17: error: vector register expected
stmfd sp!, {r0-r3}
^
../../../../ext/fiddle/libffi-3.2.1/src/arm/trampoline.S:949:9: error: invalid operand for instruction
ldr r0, [pc, #-4092]
^
../../../../ext/fiddle/libffi-3.2.1/src/arm/trampoline.S:952:9: error: invalid operand for instruction
ldr pc, [pc, #-4092]
^
../../../../ext/fiddle/libffi-3.2.1/src/arm/trampoline.S:957:17: error: vector register expected
stmfd sp!, {r0-r3}
^
../../../../ext/fiddle/libffi-3.2.1/src/arm/trampoline.S:962:9: error: invalid operand for instruction
ldr r0, [pc, #-4092]
^
../../../../ext/fiddle/libffi-3.2.1/src/arm/trampoline.S:965:9: error: invalid operand for instruction
ldr pc, [pc, #-4092]
^
../../../../ext/fiddle/libffi-3.2.1/src/arm/trampoline.S:970:17: error: vector register expected
stmfd sp!, {r0-r3}
^
../../../../ext/fiddle/libffi-3.2.1/src/arm/trampoline.S:975:9: error: invalid operand for instruction
ldr r0, [pc, #-4092]
^
../../../../ext/fiddle/libffi-3.2.1/src/arm/trampoline.S:978:9: error: invalid operand for instruction
ldr pc, [pc, #-4092]
^
../../../../ext/fiddle/libffi-3.2.1/src/arm/trampoline.S:983:17: error: vector register expected
stmfd sp!, {r0-r3}
^
../../../../ext/fiddle/libffi-3.2.1/src/arm/trampoline.S:988:9: error: invalid operand for instruction
ldr r0, [pc, #-4092]
^
../../../../ext/fiddle/libffi-3.2.1/src/arm/trampoline.S:991:9: error: invalid operand for instruction
ldr pc, [pc, #-4092]
^
../../../../ext/fiddle/libffi-3.2.1/src/arm/trampoline.S:996:17: error: vector register expected
stmfd sp!, {r0-r3}
^
../../../../ext/fiddle/libffi-3.2.1/src/arm/trampoline.S:1001:9: error: invalid operand for instruction
ldr r0, [pc, #-4092]
^
../../../../ext/fiddle/libffi-3.2.1/src/arm/trampoline.S:1004:9: error: invalid operand for instruction
ldr pc, [pc, #-4092]
^
../../../../ext/fiddle/libffi-3.2.1/src/arm/trampoline.S:1009:17: linking shared-object digest.bundle
error: vector register expected
stmfd sp!, {r0-r3}
^
../../../../ext/fiddle/libffi-3.2.1/src/arm/trampoline.S:1014:9: error: invalid operand for instruction
ldr r0, [pc, #-4092]
^
../../../../ext/fiddle/libffi-3.2.1/src/arm/trampoline.S:1017:9: error: invalid operand for instruction
ldr pc, [pc, #-4092]
^
../../../../ext/fiddle/libffi-3.2.1/src/arm/trampoline.S:1022:17: error: vector register expected
stmfd sp!, {r0-r3}
^
../../../../ext/fiddle/libffi-3.2.1/src/arm/trampoline.S:1027:9: error: invalid operand for instruction
ldr r0, [pc, #-4092]
^
../../../../ext/fiddle/libffi-3.2.1/src/arm/trampoline.S:1030:9: error: invalid operand for instruction
ldr pc, [pc, #-4092]
^
../../../../ext/fiddle/libffi-3.2.1/src/arm/trampoline.S:1035:17: error: vector register expected
stmfd sp!, {r0-r3}
^
../../../../ext/fiddle/libffi-3.2.1/src/arm/trampoline.S:1040:9: error: invalid operand for instruction
ldr r0, [pc, #-4092]
^
../../../../ext/fiddle/libffi-3.2.1/src/arm/trampoline.S:1043:9: error: invalid operand for instruction
ldr pc, [pc, #-4092]
^
../../../../ext/fiddle/libffi-3.2.1/src/arm/trampoline.S:1048:17: error: vector register expected
stmfd sp!, {r0-r3}
^
../../../../ext/fiddle/libffi-3.2.1/src/arm/trampoline.S:1053:9: error: invalid operand for instruction
ldr r0, [pc, #-4092]
^
../../../../ext/fiddle/libffi-3.2.1/src/arm/trampoline.S:1056:9: error: invalid operand for instruction
ldr pc, [pc, #-4092]
^
../../../../ext/fiddle/libffi-3.2.1/src/arm/trampoline.S:1061:17: error: vector register expected
stmfd sp!, {r0-r3}
^
../../../../ext/fiddle/libffi-3.2.1/src/arm/trampoline.S:1066:9: error: invalid operand for instruction
ldr r0, [pc, #-4092]
^
../../../../ext/fiddle/libffi-3.2.1/src/arm/trampoline.S:1069:9: error: invalid operand for instruction
ldr pc, [pc, #-4092]
^
../../../../ext/fiddle/libffi-3.2.1/src/arm/trampoline.S:1074:17: error: vector register expected
stmfd sp!, {r0-r3}
^
../../../../ext/fiddle/libffi-3.2.1/src/arm/trampoline.S:1079:9: error: invalid operand for instruction
ldr r0, [pc, #-4092]
^
../../../../ext/fiddle/libffi-3.2.1/src/arm/trampoline.S:1082:9: error: invalid operand for instruction
ldr pc, [pc, #-4092]
^
../../../../ext/fiddle/libffi-3.2.1/src/arm/trampoline.S:1087:17: error: vector register expected
stmfd sp!, {r0-r3}
^
../../../../ext/fiddle/libffi-3.2.1/src/arm/trampoline.S:1092:9: error: invalid operand for instruction
ldr r0, [pc, #-4092]
^
../../../../ext/fiddle/libffi-3.2.1/src/arm/trampoline.S:1095:9: error: invalid operand for instruction
ldr pc, [pc, #-4092]
^
../../../../ext/fiddle/libffi-3.2.1/src/arm/trampoline.S:1100:17: error: vector register expected
stmfd sp!, {r0-r3}
^
../../../../ext/fiddle/libffi-3.2.1/src/arm/trampoline.S:1105:9: error: invalid operand for instruction
ldr r0, [pc, #-4092]
^
../../../../ext/fiddle/libffi-3.2.1/src/arm/trampoline.S:1108:9: error: invalid operand for instruction
ldr pc, [pc, #-4092]
^
../../../../ext/fiddle/libffi-3.2.1/src/arm/trampoline.S:1113:17: error: vector register expected
stmfd sp!, {r0-r3}
^
../../../../ext/fiddle/libffi-3.2.1/src/arm/trampoline.S:1118:9: error: invalid operand for instruction
ldr r0, [pc, #-4092]
^
../../../../ext/fiddle/libffi-3.2.1/src/arm/trampoline.S:1121:9: error: invalid operand for instruction
ldr pc, [pc, #-4092]
^
../../../../ext/fiddle/libffi-3.2.1/src/arm/trampoline.S:1126:17: error: vector register expected
stmfd sp!, {r0-r3}
^
../../../../ext/fiddle/libffi-3.2.1/src/arm/trampoline.S:1131:9: error: invalid operand for instruction
ldr r0, [pc, #-4092]
^
../../../../ext/fiddle/libffi-3.2.1/src/arm/trampoline.S:1134:9: error: invalid operand for instruction
ldr pc, [pc, #-4092]
^
../../../../ext/fiddle/libffi-3.2.1/src/arm/trampoline.S:1139:17: error: vector register expected
stmfd sp!, {r0-r3}
^
../../../../ext/fiddle/libffi-3.2.1/src/arm/trampoline.S:1144:9: error: invalid operand for instruction
ldr r0, [pc, #-4092]
^
../../../../ext/fiddle/libffi-3.2.1/src/arm/trampoline.S:1147:9: error: invalid operand for instruction
ldr pc, [pc, #-4092]
^
../../../../ext/fiddle/libffi-3.2.1/src/arm/trampoline.S:1152:17: error: vector register expected
stmfd sp!, {r0-r3}
^
../../../../ext/fiddle/libffi-3.2.1/src/arm/trampoline.S:1157:9: error: invalid operand for instruction
ldr r0, [pc, #-4092]
^
../../../../ext/fiddle/libffi-3.2.1/src/arm/trampoline.S:1160:9: error: invalid operand for instruction
ldr pc, [pc, #-4092]
^
../../../../ext/fiddle/libffi-3.2.1/src/arm/trampoline.S:1165:17: error: vector register expected
stmfd sp!, {r0-r3}
^
../../../../ext/fiddle/libffi-3.2.1/src/arm/trampoline.S:1170:9: error: invalid operand for instruction
ldr r0, [pc, #-4092]
^
../../../../ext/fiddle/libffi-3.2.1/src/arm/trampoline.S:1173:9: error: invalid operand for instruction
ldr pc, [pc, #-4092]
^
../../../../ext/fiddle/libffi-3.2.1/src/arm/trampoline.S:1178:17: error: vector register expected
compiling ../../../../ext/digest/bubblebabble/bubblebabble.c
compiling ../../../../ext/digest/sha1/sha1init.c
compiling ../../../../ext/digest/rmd160/rmd160init.c
compiling ../../../../ext/digest/md5/md5init.c
compiling ../../../../ext/digest/sha2/sha2init.c
stmfd sp!, {r0-r3}
^
../../../../ext/fiddle/libffi-3.2.1/src/arm/trampoline.S:1183:9: error: invalid operand for instruction
ldr r0, [pc, #-4092]
^
../../../../ext/fiddle/libffi-3.2.1/src/arm/trampoline.S:1186:9: error: invalid operand for instruction
ldr pc, [pc, #-4092]
^
../../../../ext/fiddle/libffi-3.2.1/src/arm/trampoline.S:1191:17: error: vector register expected
stmfd sp!, {r0-r3}
^
../../../../ext/fiddle/libffi-3.2.1/src/arm/trampoline.S:1196:9: error: invalid operand for instruction
ldr r0, [pc, #-4092]
^
../../../../ext/fiddle/libffi-3.2.1/src/arm/trampoline.S:1199:9: error: invalid operand for instruction
ldr pc, [pc, #-4092]
^
../../../../ext/fiddle/libffi-3.2.1/src/arm/trampoline.S:1204:17: error: vector register expected
stmfd sp!, {r0-r3}
^
../../../../ext/fiddle/libffi-3.2.1/src/arm/trampoline.S:1209:9: error: invalid operand for instruction
ldr r0, [pc, #-4092]
^
../../../../ext/fiddle/libffi-3.2.1/src/arm/trampoline.S:1212:9: error: invalid operand for instruction
ldr pc, [pc, #-4092]
^
../../../../ext/fiddle/libffi-3.2.1/src/arm/trampoline.S:1217:17: error: vector register expected
stmfd sp!, {r0-r3}
^
../../../../ext/fiddle/libffi-3.2.1/src/arm/trampoline.S:1222:9: error: invalid operand for instruction
ldr r0, [pc, #-4092]
^
../../../../ext/fiddle/libffi-3.2.1/src/arm/trampoline.S:1225:9: error: invalid operand for instruction
ldr pc, [pc, #-4092]
^
../../../../ext/fiddle/libffi-3.2.1/src/arm/trampoline.S:1230:17: error: vector register expected
stmfd sp!, {r0-r3}
^
../../../../ext/fiddle/libffi-3.2.1/src/arm/trampoline.S:1235:9: error: invalid operand for instruction
ldr r0, [pc, #-4092]
^
../../../../ext/fiddle/libffi-3.2.1/src/arm/trampoline.S:1238:9: error: invalid operand for instruction
ldr pc, [pc, #-4092]
^
../../../../ext/fiddle/libffi-3.2.1/src/arm/trampoline.S:1243:17: error: vector register expected
stmfd sp!, {r0-r3}
^
../../../../ext/fiddle/libffi-3.2.1/src/arm/trampoline.S:1248:9: error: invalid operand for instruction
ldr r0, [pc, #-4092]
^
../../../../ext/fiddle/libffi-3.2.1/src/arm/trampoline.S:1251:9: error: invalid operand for instruction
ldr pc, [pc, #-4092]
^
../../../../ext/fiddle/libffi-3.2.1/src/arm/trampoline.S:1256:17: error: vector register expected
stmfd sp!, {r0-r3}
^
../../../../ext/fiddle/libffi-3.2.1/src/arm/trampoline.S:1261:9: error: invalid operand for instruction
ldr r0, [pc, #-4092]
^
../../../../ext/fiddle/libffi-3.2.1/src/arm/trampoline.S:1264:9: error: invalid operand for instruction
ldr pc, [pc, #-4092]
^
../../../../ext/fiddle/libffi-3.2.1/src/arm/trampoline.S:1269:17: error: vector register expected
stmfd sp!, {r0-r3}
^
../../../../ext/fiddle/libffi-3.2.1/src/arm/trampoline.S:1274:9: error: invalid operand for instruction
ldr r0, [pc, #-4092]
^
../../../../ext/fiddle/libffi-3.2.1/src/arm/trampoline.S:1277:9: error: invalid operand for instruction
ldr pc, [pc, #-4092]
^
../../../../ext/fiddle/libffi-3.2.1/src/arm/trampoline.S:1282:17: error: vector register expected
stmfd sp!, {r0-r3}
^
../../../../ext/fiddle/libffi-3.2.1/src/arm/trampoline.S:1287:9: error: invalid operand for instruction
ldr r0, [pc, #-4092]
^
../../../../ext/fiddle/libffi-3.2.1/src/arm/trampoline.S:1290:9: error: invalid operand for instruction
ldr pc, [pc, #-4092]
^
../../../../ext/fiddle/libffi-3.2.1/src/arm/trampoline.S:1295:17: error: vector register expected
stmfd sp!, {r0-r3}
^
../../../../ext/fiddle/libffi-3.2.1/src/arm/trampoline.S:1300:9: error: invalid operand for instruction
ldr r0, [pc, #-4092]
^
../../../../ext/fiddle/libffi-3.2.1/src/arm/trampoline.S:1303:9: error: invalid operand for instruction
ldr pc, [pc, #-4092]
^
../../../../ext/fiddle/libffi-3.2.1/src/arm/trampoline.S:1308:17: error: vector register expected
stmfd sp!, {r0-r3}
^
../../../../ext/fiddle/libffi-3.2.1/src/arm/trampoline.S:1313:9: error: invalid operand for instruction
ldr r0, [pc, #-4092]
^
../../../../ext/fiddle/libffi-3.2.1/src/arm/trampoline.S:1316:9: error: invalid operand for instruction
ldr pc, [pc, #-4092]
^
../../../../ext/fiddle/libffi-3.2.1/src/arm/trampoline.S:1321:17: error: vector register expected
stmfd sp!, {r0-r3}
^
../../../../ext/fiddle/libffi-3.2.1/src/arm/trampoline.S:1326:9: error: invalid operand for instruction
ldr r0, [pc, #-4092]
^
../../../../ext/fiddle/libffi-3.2.1/src/arm/trampoline.S:1329:9: error: invalid operand for instruction
ldr pc, [pc, #-4092]
^
../../../../ext/fiddle/libffi-3.2.1/src/arm/trampoline.S:1334:17: error: vector register expected
stmfd sp!, {r0-r3}
^
../../../../ext/fiddle/libffi-3.2.1/src/arm/trampoline.S:1339:9: error: invalid operand for instruction
ldr r0, [pc, #-4092]
^
../../../../ext/fiddle/libffi-3.2.1/src/arm/trampoline.S:1342:9: error: invalid operand for instruction
ldr pc, [pc, #-4092]
^
../../../../ext/fiddle/libffi-3.2.1/src/arm/trampoline.S:1347:17: error: vector register expected
stmfd sp!, {r0-r3}
^
../../../../ext/fiddle/libffi-3.2.1/src/arm/trampoline.S:1352:9: error: invalid operand for instruction
ldr r0, [pc, #-4092]
^
../../../../ext/fiddle/libffi-3.2.1/src/arm/trampoline.S:1355:9: linking shared-object etc.bundle
error: invalid operand for instruction
ldr pc, [pc, #-4092]
^
../../../../ext/fiddle/libffi-3.2.1/src/arm/trampoline.S:1360:17: error: vector register expected
stmfd sp!, {r0-r3}
^
../../../../ext/fiddle/libffi-3.2.1/src/arm/trampoline.S:1365:9: error: invalid operand for instruction
ldr r0, [pc, #-4092]
^
../../../../ext/fiddle/libffi-3.2.1/src/arm/trampoline.S:1368:9: error: invalid operand for instruction
ldr pc, [pc, #-4092]
^
../../../../ext/fiddle/libffi-3.2.1/src/arm/trampoline.S:1373:17: error: vector register expected
stmfd sp!, {r0-r3}
^
../../../../ext/fiddle/libffi-3.2.1/src/arm/trampoline.S:1378:9: error: invalid operand for instruction
ldr r0, [pc, #-4092]
^
../../../../ext/fiddle/libffi-3.2.1/src/arm/trampoline.S:1381:9: error: invalid operand for instruction
ldr pc, [pc, #-4092]
^
../../../../ext/fiddle/libffi-3.2.1/src/arm/trampoline.S:1386:17: error: vector register expected
stmfd sp!, {r0-r3}
^
../../../../ext/fiddle/libffi-3.2.1/src/arm/trampoline.S:1391:9: error: invalid operand for instruction
ldr r0, [pc, #-4092]
^
../../../../ext/fiddle/libffi-3.2.1/src/arm/trampoline.S:1394:9: error: invalid operand for instruction
ldr pc, [pc, #-4092]
^
../../../../ext/fiddle/libffi-3.2.1/src/arm/trampoline.S:1399:17: error: vector register expected
stmfd sp!, {r0-r3}
^
../../../../ext/fiddle/libffi-3.2.1/src/arm/trampoline.S:1404:9: error: invalid operand for instruction
ldr r0, [pc, #-4092]
^
../../../../ext/fiddle/libffi-3.2.1/src/arm/trampoline.S:1407:9: error: invalid operand for instruction
ldr pc, [pc, #-4092]
^
../../../../ext/fiddle/libffi-3.2.1/src/arm/trampoline.S:1412:17: error: vector register expected
stmfd sp!, {r0-r3}
^
../../../../ext/fiddle/libffi-3.2.1/src/arm/trampoline.S:1417:9: error: invalid operand for instruction
ldr r0, [pc, #-4092]
^
../../../../ext/fiddle/libffi-3.2.1/src/arm/trampoline.S:1420:9: error: invalid operand for instruction
ldr pc, [pc, #-4092]
^
../../../../ext/fiddle/libffi-3.2.1/src/arm/trampoline.S:1425:17: error: vector register expected
stmfd sp!, {r0-r3}
^
../../../../ext/fiddle/libffi-3.2.1/src/arm/trampoline.S:1430:9: error: invalid operand for instruction
ldr r0, [pc, #-4092]
^
../../../../ext/fiddle/libffi-3.2.1/src/arm/trampoline.S:1433:9: error: invalid operand for instruction
ldr pc, [pc, #-4092]
^
../../../../ext/fiddle/libffi-3.2.1/src/arm/trampoline.S:1438:17: error: vector register expected
stmfd sp!, {r0-r3}
^
../../../../ext/fiddle/libffi-3.2.1/src/arm/trampoline.S:1443:9: error: invalid operand for instruction
ldr r0, [pc, #-4092]
^
../../../../ext/fiddle/libffi-3.2.1/src/arm/trampoline.S:1446:9: error: invalid operand for instruction
ldr pc, [pc, #-4092]
^
../../../../ext/fiddle/libffi-3.2.1/src/arm/trampoline.S:1451:17: error: vector register expected
stmfd sp!, {r0-r3}
^
../../../../ext/fiddle/libffi-3.2.1/src/arm/trampoline.S:1456:9: error: invalid operand for instruction
ldr r0, [pc, #-4092]
^
../../../../ext/fiddle/libffi-3.2.1/src/arm/trampoline.S:1459:9: error: invalid operand for instruction
ldr pc, [pc, #-4092]
^
../../../../ext/fiddle/libffi-3.2.1/src/arm/trampoline.S:1464:17: error: vector register expected
stmfd sp!, {r0-r3}
^
../../../../ext/fiddle/libffi-3.2.1/src/arm/trampoline.S:1469:9: error: invalid operand for instruction
ldr r0, [pc, #-4092]
^
../../../../ext/fiddle/libffi-3.2.1/src/arm/trampoline.S:1472:9: error: invalid operand for instruction
ldr pc, [pc, #-4092]
^
../../../../ext/fiddle/libffi-3.2.1/src/arm/trampoline.S:1477:17: error: vector register expected
stmfd sp!, {r0-r3}
^
../../../../ext/fiddle/libffi-3.2.1/src/arm/trampoline.S:1482:9: error: invalid operand for instruction
ldr r0, [pc, #-4092]
^
../../../../ext/fiddle/libffi-3.2.1/src/arm/trampoline.S:1485:9: error: invalid operand for instruction
ldr pc, [pc, #-4092]
^
../../../../ext/fiddle/libffi-3.2.1/src/arm/trampoline.S:1490:17: error: vector register expected
stmfd sp!, {r0-r3}
^
../../../../ext/fiddle/libffi-3.2.1/src/arm/trampoline.S:1495:9: error: invalid operand for instruction
ldr r0, [pc, #-4092]
^
../../../../ext/fiddle/libffi-3.2.1/src/arm/trampoline.S:1498:9: error: invalid operand for instruction
ldr pc, [pc, #-4092]
^
../../../../ext/fiddle/libffi-3.2.1/src/arm/trampoline.S:1503:17: error: vector register expected
stmfd sp!, {r0-r3}
^
../../../../ext/fiddle/libffi-3.2.1/src/arm/trampoline.S:1508:9: error: invalid operand for instruction
ldr r0, [pc, #-4092]
^
../../../../ext/fiddle/libffi-3.2.1/src/arm/trampoline.S:1511:9: error: invalid operand for instruction
ldr pc, [pc, #-4092]
^
../../../../ext/fiddle/libffi-3.2.1/src/arm/trampoline.S:1516:17: error: vector register expected
stmfd sp!, {r0-r3}
^
../../../../ext/fiddle/libffi-3.2.1/src/arm/trampoline.S:1521:9: error: invalid operand for instruction
ldr r0, [pc, #-4092]
^
../../../../ext/fiddle/libffi-3.2.1/src/arm/trampoline.S:1524:9: error: invalid operand for instruction
ldr pc, [pc, #-4092]
^
../../../../ext/fiddle/libffi-3.2.1/src/arm/trampoline.S:1529:17: error: vector register expected
stmfd sp!, {r0-r3}
^
../../../../ext/fiddle/libffi-3.2.1/src/arm/trampoline.S:1534:9: error: invalid operand for instruction
ldr r0, [pc, #-4092]
^
../../../../ext/fiddle/libffi-3.2.1/src/arm/trampoline.S:1537:9: error: invalid operand for instruction
ldr pc, [pc, #-4092]
^
../../../../ext/fiddle/libffi-3.2.1/src/arm/trampoline.S:1542:17: error: vector register expected
stmfd sp!, {r0-r3}
^
../../../../ext/fiddle/libffi-3.2.1/src/arm/trampoline.S:1547:9: error: invalid operand for instruction
ldr r0, [pc, #-4092]
^
../../../../ext/fiddle/libffi-3.2.1/src/arm/trampoline.S:1550:9: error: invalid operand for instruction
ldr pc, [pc, #-4092]
^
../../../../ext/fiddle/libffi-3.2.1/src/arm/trampoline.S:1555:17: error: vector register expected
stmfd sp!, {r0-r3}
^
../../../../ext/fiddle/libffi-3.2.1/src/arm/trampoline.S:1560:9: error: invalid operand for instruction
ldr r0, [pc, #-4092]
^
../../../../ext/fiddle/libffi-3.2.1/src/arm/trampoline.S:1563:9: error: invalid operand for instruction
ldr pc, [pc, #-4092]
^
../../../../ext/fiddle/libffi-3.2.1/src/arm/trampoline.S:1568:17: error: vector register expected
stmfd sp!, {r0-r3}
^
../../../../ext/fiddle/libffi-3.2.1/src/arm/trampoline.S:1573:9: error: invalid operand for instruction
ldr r0, [pc, #-4092]
^
../../../../ext/fiddle/libffi-3.2.1/src/arm/trampoline.S:1576:9: error: invalid operand for instruction
ldr pc, [pc, #-4092]
^
../../../../ext/fiddle/libffi-3.2.1/src/arm/trampoline.S:1581:17: error: vector register expected
stmfd sp!, {r0-r3}
^
../../../../ext/fiddle/libffi-3.2.1/src/arm/trampoline.S:1586:9: error: invalid operand for instruction
ldr r0, [pc, #-4092]
^
../../../../ext/fiddle/libffi-3.2.1/src/arm/trampoline.S:1589:9: error: invalid operand for instruction
ldr pc, [pc, #-4092]
^
../../../../ext/fiddle/libffi-3.2.1/src/arm/trampoline.S:1594:17: error: vector register expected
stmfd sp!, {r0-r3}
^
../../../../ext/fiddle/libffi-3.2.1/src/arm/trampoline.S:1599:9: error: invalid operand for instruction
ldr r0, [pc, #-4092]
^
../../../../ext/fiddle/libffi-3.2.1/src/arm/trampoline.S:1602:9: error: linking shared-object syslog.bundle
invalid operand for instruction
ldr pc, [pc, #-4092]
^
../../../../ext/fiddle/libffi-3.2.1/src/arm/trampoline.S:1607:17: error: vector register expected
stmfd sp!, {r0-r3}
^
../../../../ext/fiddle/libffi-3.2.1/src/arm/trampoline.S:1612:9: error: invalid operand for instruction
ldr r0, [pc, #-4092]
^
../../../../ext/fiddle/libffi-3.2.1/src/arm/trampoline.S:1615:9: error: invalid operand for instruction
ldr pc, [pc, #-4092]
^
../../../../ext/fiddle/libffi-3.2.1/src/arm/trampoline.S:1620:17: error: vector register expected
stmfd sp!, {r0-r3}
^
../../../../ext/fiddle/libffi-3.2.1/src/arm/trampoline.S:1625:9: error: invalid operand for instruction
ldr r0, [pc, #-4092]
^
../../../../ext/fiddle/libffi-3.2.1/src/arm/trampoline.S:1628:9: error: invalid operand for instruction
ldr pc, [pc, #-4092]
^
../../../../ext/fiddle/libffi-3.2.1/src/arm/trampoline.S:1633:17: error: vector register expected
stmfd sp!, {r0-r3}
^
../../../../ext/fiddle/libffi-3.2.1/src/arm/trampoline.S:1638:9: error: invalid operand for instruction
ldr r0, [pc, #-4092]
^
../../../../ext/fiddle/libffi-3.2.1/src/arm/trampoline.S:1641:9: error: invalid operand for instruction
ldr pc, [pc, #-4092]
^
../../../../ext/fiddle/libffi-3.2.1/src/arm/trampoline.S:1646:17: error: vector register expected
stmfd sp!, {r0-r3}
^
../../../../ext/fiddle/libffi-3.2.1/src/arm/trampoline.S:1651:9: error: invalid operand for instruction
ldr r0, [pc, #-4092]
^
../../../../ext/fiddle/libffi-3.2.1/src/arm/trampoline.S:1654:9: error: invalid operand for instruction
ldr pc, [pc, #-4092]
^
../../../../ext/fiddle/libffi-3.2.1/src/arm/trampoline.S:1659:17: error: vector register expected
stmfd sp!, {r0-r3}
^
../../../../ext/fiddle/libffi-3.2.1/src/arm/trampoline.S:1664:9: error: invalid operand for instruction
ldr r0, [pc, #-4092]
^
../../../../ext/fiddle/libffi-3.2.1/src/arm/trampoline.S:1667:9: error: invalid operand for instruction
ldr pc, [pc, #-4092]
^
../../../../ext/fiddle/libffi-3.2.1/src/arm/trampoline.S:1672:17: error: vector register expected
stmfd sp!, {r0-r3}
^
../../../../ext/fiddle/libffi-3.2.1/src/arm/trampoline.S:1677:9: error: invalid operand for instruction
ldr r0, [pc, #-4092]
^
../../../../ext/fiddle/libffi-3.2.1/src/arm/trampoline.S:1680:9: error: invalid operand for instruction
ldr pc, [pc, #-4092]
^
../../../../ext/fiddle/libffi-3.2.1/src/arm/trampoline.S:1685:17: error: vector register expected
stmfd sp!, {r0-r3}
^
../../../../ext/fiddle/libffi-3.2.1/src/arm/trampoline.S:1690:9: error: invalid operand for instruction
ldr r0, [pc, #-4092]
^
../../../../ext/fiddle/libffi-3.2.1/src/arm/trampoline.S:1693:9: error: invalid operand for instruction
ldr pc, [pc, #-4092]
^
../../../../ext/fiddle/libffi-3.2.1/src/arm/trampoline.S:1698:17: error: vector register expected
stmfd sp!, {r0-r3}
^
../../../../ext/fiddle/libffi-3.2.1/src/arm/trampoline.S:1703:9: error: invalid operand for instruction
ldr r0, [pc, #-4092]
^
../../../../ext/fiddle/libffi-3.2.1/src/arm/trampoline.S:1706:9: error: invalid operand for instruction
ldr pc, [pc, #-4092]
^
../../../../ext/fiddle/libffi-3.2.1/src/arm/trampoline.S:1711:17: error: vector register expected
stmfd sp!, {r0-r3}
^
../../../../ext/fiddle/libffi-3.2.1/src/arm/trampoline.S:1716:9: error: invalid operand for instruction
ldr r0, [pc, #-4092]
^
../../../../ext/fiddle/libffi-3.2.1/src/arm/trampoline.S:1719:9: error: invalid operand for instruction
ldr pc, [pc, #-4092]
^
../../../../ext/fiddle/libffi-3.2.1/src/arm/trampoline.S:1724:17: error: vector register expected
stmfd sp!, {r0-r3}
^
../../../../ext/fiddle/libffi-3.2.1/src/arm/trampoline.S:1729:9: error: invalid operand for instruction
ldr r0, [pc, #-4092]
^
../../../../ext/fiddle/libffi-3.2.1/src/arm/trampoline.S:1732:9: error: invalid operand for instruction
ldr pc, [pc, #-4092]
^
../../../../ext/fiddle/libffi-3.2.1/src/arm/trampoline.S:1737:17: error: vector register expected
stmfd sp!, {r0-r3}
^
../../../../ext/fiddle/libffi-3.2.1/src/arm/trampoline.S:1742:9: error: linking shared-object digest/rmd160.bundle
linking shared-object digest/md5.bundle
linking shared-object digest/sha2.bundle
linking shared-object racc/cparse.bundle
invalid operand for instruction
ldr r0, [pc, #-4092]
^
../../../../ext/fiddle/libffi-3.2.1/src/arm/trampoline.S:1745:9: error: invalid operand for instruction
ldr pc, [pc, #-4092]
^
../../../../ext/fiddle/libffi-3.2.1/src/arm/trampoline.S:1750:17: error: linking shared-object digest/sha1.bundle
vector register expected
stmfd sp!, {r0-r3}
^
../../../../ext/fiddle/libffi-3.2.1/src/arm/trampoline.S:1755:9: error: invalid operand for instruction
ldr r0, [pc, #-4092]
^
../../../../ext/fiddle/libffi-3.2.1/src/arm/trampoline.S:1758:9: error: invalid operand for instruction
ldr pc, [pc, #-4092]
^
../../../../ext/fiddle/libffi-3.2.1/src/arm/trampoline.S:1763:17: error: vector register expected
stmfd sp!, {r0-r3}
^
../../../../ext/fiddle/libffi-3.2.1/src/arm/trampoline.S:1768:9: error: invalid operand for instruction
ldr r0, [pc, #-4092]
^
../../../../ext/fiddle/libffi-3.2.1/src/arm/trampoline.S:1771:9: error: invalid operand for instruction
ldr pc, [pc, #-4092]
^
../../../../ext/fiddle/libffi-3.2.1/src/arm/trampoline.S:1776:17: error: vector register expected
stmfd sp!, {r0-r3}
^
../../../../ext/fiddle/libffi-3.2.1/src/arm/trampoline.S:1781:9: error: invalid operand for instruction
ldr r0, [pc, #-4092]
^
../../../../ext/fiddle/libffi-3.2.1/src/arm/trampoline.S:1784:9: error: invalid operand for instruction
ldr pc, [pc, #-4092]
^
../../../../ext/fiddle/libffi-3.2.1/src/arm/trampoline.S:1789:17: error: vector register expected
stmfd sp!, {r0-r3}
^
../../../../ext/fiddle/libffi-3.2.1/src/arm/trampoline.S:1794:9: error: invalid operand for instruction
ldr r0, [pc, #-4092]
^
../../../../ext/fiddle/libffi-3.2.1/src/arm/trampoline.S:1797:9: error: invalid operand for instruction
ldr pc, [pc, #-4092]
^
../../../../ext/fiddle/libffi-3.2.1/src/arm/trampoline.S:1802:17: error: vector register expected
stmfd sp!, {r0-r3}
^
../../../../ext/fiddle/libffi-3.2.1/src/arm/trampoline.S:1807:9: error: invalid operand for instruction
ldr r0, [pc, #-4092]
^
../../../../ext/fiddle/libffi-3.2.1/src/arm/trampoline.S:1810:9: error: invalid operand for instruction
ldr pc, [pc, #-4092]
^
../../../../ext/fiddle/libffi-3.2.1/src/arm/trampoline.S:1815:17: error: vector register expected
stmfd sp!, {r0-r3}
^
../../../../ext/fiddle/libffi-3.2.1/src/arm/trampoline.S:1820:9: error: invalid operand for instruction
ldr r0, [pc, #-4092]
^
../../../../ext/fiddle/libffi-3.2.1/src/arm/trampoline.S:1823:9: error: invalid operand for instruction
ldr pc, [pc, #-4092]
^
../../../../ext/fiddle/libffi-3.2.1/src/arm/trampoline.S:1828:17: error: vector register expected
stmfd sp!, {r0-r3}
^
../../../../ext/fiddle/libffi-3.2.1/src/arm/trampoline.S:1833:9: error: invalid operand for instruction
ldr r0, [pc, #-4092]
^
../../../../ext/fiddle/libffi-3.2.1/src/arm/trampoline.S:1836:9: error: invalid operand for instruction
ldr pc, [pc, #-4092]
^
../../../../ext/fiddle/libffi-3.2.1/src/arm/trampoline.S:1841:17: error: vector register expected
stmfd sp!, {r0-r3}
^
../../../../ext/fiddle/libffi-3.2.1/src/arm/trampoline.S:1846:9: error: invalid operand for instruction
ldr r0, [pc, #-4092]
^
../../../../ext/fiddle/libffi-3.2.1/src/arm/trampoline.S:1849:9: error: invalid operand for instruction
ldr pc, [pc, #-4092]
^
../../../../ext/fiddle/libffi-3.2.1/src/arm/trampoline.S:1854:17: error: vector register expected
stmfd sp!, {r0-r3}
^
../../../../ext/fiddle/libffi-3.2.1/src/arm/trampoline.S:1859:9: error: invalid operand for instruction
ldr r0, [pc, #-4092]
^
../../../../ext/fiddle/libffi-3.2.1/src/arm/trampoline.S:1862:9: error: invalid operand for instruction
ldr pc, [pc, #-4092]
^
../../../../ext/fiddle/libffi-3.2.1/src/arm/trampoline.S:1867:17: error: vector register expected
stmfd sp!, {r0-r3}
^
../../../../ext/fiddle/libffi-3.2.1/src/arm/trampoline.S:1872:9: error: invalid operand for instruction
ldr r0, [pc, #-4092]
^
../../../../ext/fiddle/libffi-3.2.1/src/arm/trampoline.S:1875:9: error: invalid operand for instruction
ldr pc, [pc, #-4092]
^
../../../../ext/fiddle/libffi-3.2.1/src/arm/trampoline.S:1880:17: error: vector register expected
stmfd sp!, {r0-r3}
^
../../../../ext/fiddle/libffi-3.2.1/src/arm/trampoline.S:1885:9: error: invalid operand for instruction
ldr r0, [pc, #-4092]
^
../../../../ext/fiddle/libffi-3.2.1/src/arm/trampoline.S:1888:9: error: invalid operand for instruction
ldr pc, [pc, #-4092]
^
../../../../ext/fiddle/libffi-3.2.1/src/arm/trampoline.S:1893:17: error: vector register expected
stmfd sp!, {r0-r3}
^
../../../../ext/fiddle/libffi-3.2.1/src/arm/trampoline.S:1898:9: error: invalid operand for instruction
ldr r0, [pc, #-4092]
^
../../../../ext/fiddle/libffi-3.2.1/src/arm/trampoline.S:1901:9: error: invalid operand for instruction
ldr pc, [pc, #-4092]
^
../../../../ext/fiddle/libffi-3.2.1/src/arm/trampoline.S:1906:17: error: vector register expected
stmfd sp!, {r0-r3}
^
../../../../ext/fiddle/libffi-3.2.1/src/arm/trampoline.S:1911:9: error: invalid operand for instruction
ldr r0, [pc, #-4092]
^
../../../../ext/fiddle/libffi-3.2.1/src/arm/trampoline.S:1914:9: error: invalid operand for instruction
ldr pc, [pc, #-4092]
^
../../../../ext/fiddle/libffi-3.2.1/src/arm/trampoline.S:1919:17: error: vector register expected
stmfd sp!, {r0-r3}
^
../../../../ext/fiddle/libffi-3.2.1/src/arm/trampoline.S:1924:9: error: invalid operand for instruction
ldr r0, [pc, #-4092]
^
../../../../ext/fiddle/libffi-3.2.1/src/arm/trampoline.S:1927:9: error: invalid operand for instruction
ldr pc, [pc, #-4092]
^
../../../../ext/fiddle/libffi-3.2.1/src/arm/trampoline.S:1932:17: error: vector register expected
stmfd sp!, {r0-r3}
^
linking shared-object digest/bubblebabble.bundle
../../../../ext/fiddle/libffi-3.2.1/src/arm/trampoline.S:1937:9: error: invalid operand for instruction
ldr r0, [pc, #-4092]
^
../../../../ext/fiddle/libffi-3.2.1/src/arm/trampoline.S:1940:9: error: invalid operand for instruction
ldr pc, [pc, #-4092]
^
../../../../ext/fiddle/libffi-3.2.1/src/arm/trampoline.S:1945:17: error: vector register expected
stmfd sp!, {r0-r3}
^
../../../../ext/fiddle/libffi-3.2.1/src/arm/trampoline.S:1950:9: error: invalid operand for instruction
ldr r0, [pc, #-4092]
^
../../../../ext/fiddle/libffi-3.2.1/src/arm/trampoline.S:1953:9: error: invalid operand for instruction
ldr pc, [pc, #-4092]
^
../../../../ext/fiddle/libffi-3.2.1/src/arm/trampoline.S:1958:17: error: vector register expected
stmfd sp!, {r0-r3}
^
../../../../ext/fiddle/libffi-3.2.1/src/arm/trampoline.S:1963:9: error: invalid operand for instruction
ldr r0, [pc, #-4092]
^
../../../../ext/fiddle/libffi-3.2.1/src/arm/trampoline.S:1966:9: error: invalid operand for instruction
ldr pc, [pc, #-4092]
^
../../../../ext/fiddle/libffi-3.2.1/src/arm/trampoline.S:1971:17: error: vector register expected
stmfd sp!, {r0-r3}
^
../../../../ext/fiddle/libffi-3.2.1/src/arm/trampoline.S:1976:9: error: invalid operand for instruction
ldr r0, [pc, #-4092]
^
../../../../ext/fiddle/libffi-3.2.1/src/arm/trampoline.S:1979:9: error: invalid operand for instruction
ldr pc, [pc, #-4092]
^
../../../../ext/fiddle/libffi-3.2.1/src/arm/trampoline.S:1984:17: error: vector register expected
stmfd sp!, {r0-r3}
^
../../../../ext/fiddle/libffi-3.2.1/src/arm/trampoline.S:1989:9: error: invalid operand for instruction
ldr r0, [pc, #-4092]
^
../../../../ext/fiddle/libffi-3.2.1/src/arm/trampoline.S:1992:9: error: invalid operand for instruction
ldr pc, [pc, #-4092]
^
../../../../ext/fiddle/libffi-3.2.1/src/arm/trampoline.S:1997:17: error: vector register expected
stmfd sp!, {r0-r3}
^
../../../../ext/fiddle/libffi-3.2.1/src/arm/trampoline.S:2002:9: error: invlinking shared-object -test-/scan_args.bundle
alid operand for instructionlinking shared-object dbm.bundle
ldr r0, [pc, #-4092]
^
../../../../ext/fiddle/libffi-3.2.1/src/arm/trampoline.S:2005:9: error: invalid operand for instruction
ldr pc, [pc, #-4092]
^
../../../../ext/fiddle/libffi-3.2.1/src/arm/trampoline.S:2010:17: error: vector register expected
stmfd sp!, {r0-r3}
^
../../../../ext/fiddle/libffi-3.2.1/src/arm/trampoline.S:2015:9: error: invalid operand for instruction
ldr r0, [pc, #-4092]
^
../../../../ext/fiddle/libffi-3.2.1/src/arm/trampoline.S:2018:9: error: invalid operand for instruction
ldr pc, [pc, #-4092]
^
../../../../ext/fiddle/libffi-3.2.1/src/arm/trampoline.S:2023:17: error: vector register expected
stmfd sp!, {r0-r3}
^
../../../../ext/fiddle/libffi-3.2.1/src/arm/trampoline.S:2028:9: error: invalid operand for instruction
ldr r0, [pc, #-4092]
^
../../../../ext/fiddle/libffi-3.2.1/src/arm/trampoline.S:2031:9: error: invalid operand for instruction
ldr pc, [pc, #-4092]
^
../../../../ext/fiddle/libffi-3.2.1/src/arm/trampoline.S:2036:17: error: vector register expected
stmfd sp!, {r0-r3}
^
../../../../ext/fiddle/libffi-3.2.1/src/arm/trampoline.S:2041:9: error: invalid operand for instruction
ldr r0, [pc, #-4092]
^
../../../../ext/fiddle/libffi-3.2.1/src/arm/trampoline.S:2044:9: error: invalid operand for instruction
ldr pc, [pc, #-4092]
^
../../../../ext/fiddle/libffi-3.2.1/src/arm/trampoline.S:2049:17: error: vector register expected
stmfd sp!, {r0-r3}
^
../../../../ext/fiddle/libffi-3.2.1/src/arm/trampoline.S:2054:9: error: invalid operand for instruction
ldr r0, [pc, #-4092]
^
../../../../ext/fiddle/libffi-3.2.1/src/arm/trampoline.S:2057:9: error: invalid operand for instruction
ldr pc, [pc, #-4092]
^
../../../../ext/fiddle/libffi-3.2.1/src/arm/trampoline.S:2062:17: error: vector register expected
stmfd sp!, {r0-r3}
^
../../../../ext/fiddle/libffi-3.2.1/src/arm/trampoline.S:2067:9: error: invalid operand for instruction
ldr r0, [pc, #-4092]
^
../../../../ext/fiddle/libffi-3.2.1/src/arm/trampoline.S:2070:9: error: invalid operand for instruction
ldr pc, [pc, #-4092]
^
../../../../ext/fiddle/libffi-3.2.1/src/arm/trampoline.S:2075:17: error: vector register expected
stmfd sp!, {r0-r3}
^
../../../../ext/fiddle/libffi-3.2.1/src/arm/trampoline.S:2080:9: error: invalid operand for instruction
ldr r0, [pc, #-4092]
^
../../../../ext/fiddle/libffi-3.2.1/src/arm/trampoline.S:2083:9: error: invalid operand for instruction
ldr pc, [pc, #-4092]
^
../../../../ext/fiddle/libffi-3.2.1/src/arm/trampoline.S:2088:17: error: vector register expected
stmfd sp!, {r0-r3}
^
../../../../ext/fiddle/libffi-3.2.1/src/arm/trampoline.S:2093:9: error: invalid operand for instruction
ldr r0, [pc, #-4092]
^
../../../../ext/fiddle/libffi-3.2.1/src/arm/trampoline.S:2096:9: error: invalid operand for instruction
ldr pc, [pc, #-4092]
^
../../../../ext/fiddle/libffi-3.2.1/src/arm/trampoline.S:2101:17: error: vector register expected
stmfd sp!, {r0-r3}
^
../../../../ext/fiddle/libffi-3.2.1/src/arm/trampoline.S:2106:9: error: invalid operand for instruction
ldr r0, [pc, #-4092]
^
../../../../ext/fiddle/libffi-3.2.1/src/arm/trampoline.S:2109:9: error: invalid operand for instruction
ldr pc, [pc, #-4092]
^
../../../../ext/fiddle/libffi-3.2.1/src/arm/trampoline.S:2114:17: error: vector register expected
stmfd sp!, {r0-r3}
^
../../../../ext/fiddle/libffi-3.2.1/src/arm/trampoline.S:2119:9: error: invalid operand for instruction
ldr r0, [pc, #-4092]
^
../../../../ext/fiddle/libffi-3.2.1/src/arm/trampoline.S:2122:9: error: invalid operand for instruction
ldr pc, [pc, #-4092]
^
../../../../ext/fiddle/libffi-3.2.1/src/arm/trampoline.S:2127:17: error: vector register expected
stmfd sp!, {r0-r3}
^
../../../../ext/fiddle/libffi-3.2.1/src/arm/trampoline.S:2132:9: error: invalid operand for instruction
ldr r0, [pc, #-4092]
^
../../../../ext/fiddle/libffi-3.2.1/src/arm/trampoline.S:2135:9: error: invalid operand for instruction
ldr pc, [pc, #-4092]
^
../../../../ext/fiddle/libffi-3.2.1/src/arm/trampoline.S:2140:17: error: vector register expected
stmfd sp!, {r0-r3}
^
../../../../ext/fiddle/libffi-3.2.1/src/arm/trampoline.S:2145:9: error: invalid operand for instruction
ldr r0, [pc, #-4092]
^
../../../../ext/fiddle/libffi-3.2.1/src/arm/trampoline.S:2148:9: error: invalid operand for instruction
ldr pc, [pc, #-4092]
^
../../../../ext/fiddle/libffi-3.2.1/src/arm/trampoline.S:2153:17: error: vector register expected
stmfd sp!, {r0-r3}
^
../../../../ext/fiddle/libffi-3.2.1/src/arm/trampoline.S:2158:9: error: invalid operand for instruction
ldr r0, [pc, #-4092]
^
../../../../ext/fiddle/libffi-3.2.1/src/arm/trampoline.S:2161:9: error: invalid operand for instruction
ldr pc, [pc, #-4092]
^
../../../../ext/fiddle/libffi-3.2.1/src/arm/trampoline.S:2166:17: error: vector register expected
stmfd sp!, {r0-r3}
^
../../../../ext/fiddle/libffi-3.2.1/src/arm/trampoline.S:2171:9: error: invalid operand for instruction
ldr r0, [pc, #-4092]
^
../../../../ext/fiddle/libffi-3.2.1/src/arm/trampoline.S:2174:9: error: invalid operand for instruction
ldr pc, [pc, #-4092]
^
../../../../ext/fiddle/libffi-3.2.1/src/arm/trampoline.S:2179:17: error: vector register expected
stmfd sp!, {r0-r3}
^
../../../../ext/fiddle/libffi-3.2.1/src/arm/trampoline.S:2184:9: error: invalid operand for instruction
ldr r0, [pc, #-4092]
^
../../../../ext/fiddle/libffi-3.2.1/src/arm/trampoline.S:2187:9: error: invalid operand for instruction
ldr pc, [pc, #-4092]
^
../../../../ext/fiddle/libffi-3.2.1/src/arm/trampoline.S:2192:17: error: vector register expected
stmfd sp!, {r0-r3}
^
../../../../ext/fiddle/libffi-3.2.1/src/arm/trampoline.S:2197:9: error: invalid operand for instruction
ldr r0, [pc, #-4092]
^
../../../../ext/fiddle/libffi-3.2.1/src/arm/trampoline.S:2200:9: error: invalid operand for instruction
ldr pc, [pc, #-4092]
^
../../../../ext/fiddle/libffi-3.2.1/src/arm/trampoline.S:2205:17: error: vector register expected
stmfd sp!, {r0-r3}
^
../../../../ext/fiddle/libffi-3.2.1/src/arm/trampoline.S:2210:9: error: invalid operand for instruction
ldr r0, [pc, #-4092]
^
../../../../ext/fiddle/libffi-3.2.1/src/arm/trampoline.S:2213:9: error: invalid operand for instruction
ldr pc, [pc, #-4092]
^
../../../../ext/fiddle/libffi-3.2.1/src/arm/trampoline.S:2218:17: error: vector register expected
stmfd sp!, {r0-r3}
^
../../../../ext/fiddle/libffi-3.2.1/src/arm/trampoline.S:2223:9: error: invalid operand for instruction
ldr r0, [pc, #-4092]
^
../../../../ext/fiddle/libffi-3.2.1/src/arm/trampoline.S:2226:9: error: invalid operand for instruction
ldr pc, [pc, #-4092]
^
../../../../ext/fiddle/libffi-3.2.1/src/arm/trampoline.S:2231:17: error: vector register expected
stmfd sp!, {r0-r3}
^
../../../../ext/fiddle/libffi-3.2.1/src/arm/trampoline.S:2236:9: error: invalid operand for instruction
ldr r0, [pc, #-4092]
^
../../../../ext/fiddle/libffi-3.2.1/src/arm/trampoline.S:2239:9: error: invalid operand for instruction
ldr pc, [pc, #-4092]
^
../../../../ext/fiddle/libffi-3.2.1/src/arm/trampoline.S:2244:17: error: vector register expected
stmfd sp!, {r0-r3}
^
../../../../ext/fiddle/libffi-3.2.1/src/arm/trampoline.S:2249:9: error: invalid operand for instruction
ldr r0, [pc, #-4092]
^
../../../../ext/fiddle/libffi-3.2.1/src/arm/trampoline.S:2252:9: error: invalid operand for instruction
ldr pc, [pc, #-4092]
^
../../../../ext/fiddle/libffi-3.2.1/src/arm/trampoline.S:2257:17: error: vector register expected
stmfd sp!, {r0-r3}
^
../../../../ext/fiddle/libffi-3.2.1/src/arm/trampoline.S:2262:9: error: invalid operand for instruction
ldr r0, [pc, #-4092]
^
../../../../ext/fiddle/libffi-3.2.1/src/arm/trampoline.S:2265:9: error: invalid operand for instruction
ldr pc, [pc, #-4092]
^
../../../../ext/fiddle/libffi-3.2.1/src/arm/trampoline.S:2270:17: error: vector register expected
stmfd sp!, {r0-r3}
^
../../../../ext/fiddle/libffi-3.2.1/src/arm/trampoline.S:2275:9: error: invalid operand for instruction
ldr r0, [pc, #-4092]
^
../../../../ext/fiddle/libffi-3.2.1/src/arm/trampoline.S:2278:9: error: invalid operand for instruction
ldr pc, [pc, #-4092]
^
../../../../ext/fiddle/libffi-3.2.1/src/arm/trampoline.S:2283:17: error: vector register expected
stmfd sp!, {r0-r3}
^
../../../../ext/fiddle/libffi-3.2.1/src/arm/trampoline.S:2288:9: error: invalid operand for instruction
ldr r0, [pc, #-4092]
^
../../../../ext/fiddle/libffi-3.2.1/src/arm/trampoline.S:2291:9: error: invalid operand for instruction
ldr pc, [pc, #-4092]
^
../../../../ext/fiddle/libffi-3.2.1/src/arm/trampoline.S:2296:17: error: vector register expected
stmfd sp!, {r0-r3}
^
../../../../ext/fiddle/libffi-3.2.1/src/arm/trampoline.S:2301:9: error: invalid operand for instruction
ldr r0, [pc, #-4092]
^
../../../../ext/fiddle/libffi-3.2.1/src/arm/trampoline.S:2304:9: error: invalid operand for instruction
ldr pc, [pc, #-4092]
^
../../../../ext/fiddle/libffi-3.2.1/src/arm/trampoline.S:2309:17: error: vector register expected
stmfd sp!, {r0-r3}
^
../../../../ext/fiddle/libffi-3.2.1/src/arm/trampoline.S:2314:9: error: invalid operand for instruction
ldr r0, [pc, #-4092]
^
../../../../ext/fiddle/libffi-3.2.1/src/arm/trampoline.S:2317:9: error: invalid operand for instruction
ldr pc, [pc, #-4092]
^
../../../../ext/fiddle/libffi-3.2.1/src/arm/trampoline.S:2322:17: error: vector register expected
stmfd sp!, {r0-r3}
^
../../../../ext/fiddle/libffi-3.2.1/src/arm/trampoline.S:2327:9: error: invalid operand for instruction
ldr r0, [pc, #-4092]
^
../../../../ext/fiddle/libffi-3.2.1/src/arm/trampoline.S:2330:9: error: invalid operand for instruction
ldr pc, [pc, #-4092]
^
../../../../ext/fiddle/libffi-3.2.1/src/arm/trampoline.S:2335:17: error: vector register expected
stmfd sp!, {r0-r3}
^
../../../../ext/fiddle/libffi-3.2.1/src/arm/trampoline.S:2340:9: error: invalid operand for instruction
ldr r0, [pc, #-4092]
^
../../../../ext/fiddle/libffi-3.2.1/src/arm/trampoline.S:2343:9: error: invalid operand for instruction
ldr pc, [pc, #-4092]
^
../../../../ext/fiddle/libffi-3.2.1/src/arm/trampoline.S:2348:17: error: vector register expected
stmfd sp!, {r0-r3}
^
../../../../ext/fiddle/libffi-3.2.1/src/arm/trampoline.S:2353:9: error: invalid operand for instruction
ldr r0, [pc, #-4092]
^
../../../../ext/fiddle/libffi-3.2.1/src/arm/trampoline.S:2356:9: error: invalid operand for instruction
ldr pc, [pc, #-4092]
^
../../../../ext/fiddle/libffi-3.2.1/src/arm/trampoline.S:2361:17: error: vector register expected
stmfd sp!, {r0-r3}
^
../../../../ext/fiddle/libffi-3.2.1/src/arm/trampoline.S:2366:9: error: invalid operand for instruction
ldr r0, [pc, #-4092]
^
../../../../ext/fiddle/libffi-3.2.1/src/arm/trampoline.S:2369:9: linking shared-object io/console.bundle
error: invalid operand for instruction
ldr pc, [pc, #-4092]
^
../../../../ext/fiddle/libffi-3.2.1/src/arm/trampoline.S:2374:17: error: vector register expected
stmfd sp!, {r0-r3}
^
../../../../ext/fiddle/libffi-3.2.1/src/arm/trampoline.S:2379:9: error: invalid operand for instruction
ldr r0, [pc, #-4092]
^
../../../../ext/fiddle/libffi-3.2.1/src/arm/trampoline.S:2382:9: error: invalid operand for instruction
ldr pc, [pc, #-4092]
^
../../../../ext/fiddle/libffi-3.2.1/src/arm/trampoline.S:2387:17: error: vector register expected
stmfd sp!, {r0-r3}
^
../../../../ext/fiddle/libffi-3.2.1/src/arm/trampoline.S:2392:9: error: invalid operand for instruction
ldr r0, [pc, #-4092]
^
../../../../ext/fiddle/libffi-3.2.1/src/arm/trampoline.S:2395:9: error: invalid operand for instruction
ldr pc, [pc, #-4092]
^
../../../../ext/fiddle/libffi-3.2.1/src/arm/trampoline.S:2400:17: error: vector register expected
stmfd sp!, {r0-r3}
^
../../../../ext/fiddle/libffi-3.2.1/src/arm/trampoline.S:2405:9: error: invalid operand for instruction
ldr r0, [pc, #-4092]
^
../../../../ext/fiddle/libffi-3.2.1/src/arm/trampoline.S:2408:9: error: invalid operand for instruction
ldr pc, [pc, #-4092]
^
../../../../ext/fiddle/libffi-3.2.1/src/arm/trampoline.S:2413:17: error: vector register expected
stmfd sp!, {r0-r3}
^
../../../../ext/fiddle/libffi-3.2.1/src/arm/trampoline.S:2418:9: error: invalid operand for instruction
ldr r0, [pc, #-4092]
^
../../../../ext/fiddle/libffi-3.2.1/src/arm/trampoline.S:2421:9: error: invalid operand for instruction
ldr pc, [pc, #-4092]
^
../../../../ext/fiddle/libffi-3.2.1/src/arm/trampoline.S:2426:17: error: vector register expected
stmfd sp!, {r0-r3}
^
../../../../ext/fiddle/libffi-3.2.1/src/arm/trampoline.S:2431:9: error: invalid operand for instruction
ldr r0, [pc, #-4092]
^
../../../../ext/fiddle/libffi-3.2.1/src/arm/trampoline.S:2434:9: error: invalid operand for instruction
ldr pc, [pc, #-4092]
^
../../../../ext/fiddle/libffi-3.2.1/src/arm/trampoline.S:2439:17: error: vector register expected
stmfd sp!, {r0-r3}
^
../../../../ext/fiddle/libffi-3.2.1/src/arm/trampoline.S:2444:9: error: invalid operand for instruction
ldr r0, [pc, #-4092]
^
linking shared-object readline.bundle
../../../../ext/fiddle/libffi-3.2.1/src/arm/trampoline.S:2447:9: error: invalid operand for instruction
ldr pc, [pc, #-4092]
^
../../../../ext/fiddle/libffi-3.2.1/src/arm/trampoline.S:2452:17: error: vector register expected
stmfd sp!, {r0-r3}
^
../../../../ext/fiddle/libffi-3.2.1/src/arm/trampoline.S:2457:9: error: invalid operand for instruction
ldr r0, [pc, #-4092]
^
../../../../ext/fiddle/libffi-3.2.1/src/arm/trampoline.S:2460:9: error: invalid operand for instruction
ldr pc, [pc, #-4092]
^
../../../../ext/fiddle/libffi-3.2.1/src/arm/trampoline.S:2465:17: error: vector register expected
stmfd sp!, {r0-r3}
^
../../../../ext/fiddle/libffi-3.2.1/src/arm/trampoline.S:2470:9: error: invalid operand for instruction
ldr r0, [pc, #-4092]
^
../../../../ext/fiddle/libffi-3.2.1/src/arm/trampoline.S:2473:9: error: invalid operand for instruction
ldr pc, [pc, #-4092]
^
../../../../ext/fiddle/libffi-3.2.1/src/arm/trampoline.S:2478:17: error: vector register expected
stmfd sp!, {r0-r3}
^
../../../../ext/fiddle/libffi-3.2.1/src/arm/trampoline.S:2483:9: error: invalid operand for instruction
ldr r0, [pc, #-4092]
^
../../../../ext/fiddle/libffi-3.2.1/src/arm/trampoline.S:2486:9: error: invalid operand for instruction
ldr pc, [pc, #-4092]
^
../../../../ext/fiddle/libffi-3.2.1/src/arm/trampoline.S:2491:17: error: vector register expected
stmfd sp!, {r0-r3}
^
../../../../ext/fiddle/libffi-3.2.1/src/arm/trampoline.S:2496:9: error: invalid operand for instruction
ldr r0, [pc, #-4092]
^
../../../../ext/fiddle/libffi-3.2.1/src/arm/trampoline.S:2499:9: error: invalid operand for instruction
ldr pc, [pc, #-4092]
^
../../../../ext/fiddle/libffi-3.2.1/src/arm/trampoline.S:2504:17: error: vector register expected
stmfd sp!, {r0-r3}
^
../../../../ext/fiddle/libffi-3.2.1/src/arm/trampoline.S:2509:9: error: invalid operand for instruction
ldr r0, [pc, #-4092]
^
../../../../ext/fiddle/libffi-3.2.1/src/arm/trampoline.S:2512:9: error: invalid operand for instruction
ldr pc, [pc, #-4092]
^
../../../../ext/fiddle/libffi-3.2.1/src/arm/trampoline.S:2517:17: error: vector register expected
stmfd sp!, {r0-r3}
^
../../../../ext/fiddle/libffi-3.2.1/src/arm/trampoline.S:2522:9: error: invalid operand for instruction
ldr r0, [pc, #-4092]
^
../../../../ext/fiddle/libffi-3.2.1/src/arm/trampoline.S:2525:9: error: invalid operand for instruction
ldr pc, [pc, #-4092]
^
../../../../ext/fiddle/libffi-3.2.1/src/arm/trampoline.S:2530:17: error: vector register expected
stmfd sp!, {r0-r3}
^
../../../../ext/fiddle/libffi-3.2.1/src/arm/trampoline.S:2535:9: error: invalid operand for instruction
ldr r0, [pc, #-4092]
^
ld: warning: directory not found for option '-L/usr/local/opt/readline/lib'
../../../../ext/fiddle/libffi-3.2.1/src/arm/trampoline.S:2538:9: error: invalid operand for instruction
ldr pc, [pc, #-4092]
^
../../../../ext/fiddle/libffi-3.2.1/src/arm/trampoline.S:2543:17: error: vector register expected
stmfd sp!, {r0-r3}
^
../../../../ext/fiddle/libffi-3.2.1/src/arm/trampoline.S:2548:9: error: invalid operand for instruction
ldr r0, [pc, #-4092]
^
../../../../ext/fiddle/libffi-3.2.1/src/arm/trampoline.S:2551:9: error: invalid operand for instruction
ldr pc, [pc, #-4092]
^
../../../../ext/fiddle/libffi-3.2.1/src/arm/trampoline.S:2556:17: error: vector register expected
stmfd sp!, {r0-r3}
^
../../../../ext/fiddle/libffi-3.2.1/src/arm/trampoline.S:2561:9: error: invalid operand for instruction
ldr r0, [pc, #-4092]
^
../../../../ext/fiddle/libffi-3.2.1/src/arm/trampoline.S:2564:9: error: invalid operand for instruction
ldr pc, [pc, #-4092]
^
../../../../ext/fiddle/libffi-3.2.1/src/arm/trampoline.S:2569:17: error: vector register expected
stmfd sp!, {r0-r3}
^
../../../../ext/fiddle/libffi-3.2.1/src/arm/trampoline.S:2574:9: error: invalid operand for instruction
ldr r0, [pc, #-4092]
^
../../../../ext/fiddle/libffi-3.2.1/src/arm/trampoline.S:2577:9: error: invalid operand for instruction
ldr pc, [pc, #-4092]
^
../../../../ext/fiddle/libffi-3.2.1/src/arm/trampoline.S:2582:17: error: vector register expected
stmfd sp!, {r0-r3}
^
../../../../ext/fiddle/libffi-3.2.1/src/arm/trampoline.S:2587:9: error: invalid operand for instruction
ldr r0, [pc, #-4092]
^
../../../../ext/fiddle/libffi-3.2.1/src/arm/trampoline.S:2590:9: error: invalid operand for instruction
ldr pc, [pc, #-4092]
^
../../../../ext/fiddle/libffi-3.2.1/src/arm/trampoline.S:2595:17: error: vector register expected
stmfd sp!, {r0-r3}
^
../../../../ext/fiddle/libffi-3.2.1/src/arm/trampoline.S:2600:9: error: invalid operand for instruction
ldr r0, [pc, #-4092]
^
../../../../ext/fiddle/libffi-3.2.1/src/arm/trampoline.S:2603:9: error: invalid operand for instruction
ldr pc, [pc, #-4092]
^
../../../../ext/fiddle/libffi-3.2.1/src/arm/trampoline.S:2608:17: error: vector register expected
stmfd sp!, {r0-r3}
^
../../../../ext/fiddle/libffi-3.2.1/src/arm/trampoline.S:2613:9: error: invalid operand for instruction
ldr r0, [pc, #-4092]
^
../../../../ext/fiddle/libffi-3.2.1/src/arm/trampoline.S:2616:9: error: invalid operand for instruction
ldr pc, [pc, #-4092]
^
../../../../ext/fiddle/libffi-3.2.1/src/arm/trampoline.S:2621:17: error: vector register expected
stmfd sp!, {r0-r3}
^
../../../../ext/fiddle/libffi-3.2.1/src/arm/trampoline.S:2626:9: error: invalid operand for instruction
ldr r0, [pc, #-4092]
^
../../../../ext/fiddle/libffi-3.2.1/src/arm/trampoline.S:2629:9: error: invalid operand for instruction
ldr pc, [pc, #-4092]
^
../../../../ext/fiddle/libffi-3.2.1/src/arm/trampoline.S:2634:17: error: vector register expected
stmfd sp!, {r0-r3}
^
../../../../ext/fiddle/libffi-3.2.1/src/arm/trampoline.S:2639:9: error: invalid operand for instruction
ldr r0, [pc, #-4092]
^
../../../../ext/fiddle/libffi-3.2.1/src/arm/trampoline.S:2642:9: error: invalid operand for instruction
ldr pc, [pc, #-4092]
^
../../../../ext/fiddle/libffi-3.2.1/src/arm/trampoline.S:2647:17: error: vector register expected
stmfd sp!, {r0-r3}
^
../../../../ext/fiddle/libffi-3.2.1/src/arm/trampoline.S:2652:9: error: invalid operand for instruction
ldr r0, [pc, #-4092]
^
../../../../ext/fiddle/libffi-3.2.1/src/arm/trampoline.S:2655:9: error: invalid operand for instruction
ldr pc, [pc, #-4092]
^
../../../../ext/fiddle/libffi-3.2.1/src/arm/trampoline.S:2660:17: error: vector register expected
stmfd sp!, {r0-r3}
^
../../../../ext/fiddle/libffi-3.2.1/src/arm/trampoline.S:2665:9: error: invalid operand for instruction
ldr r0, [pc, #-4092]
^
../../../../ext/fiddle/libffi-3.2.1/src/arm/trampoline.S:2668:9: error: invalid operand for instruction
ldr pc, [pc, #-4092]
^
../../../../ext/fiddle/libffi-3.2.1/src/arm/trampoline.S:2673:17: error: vector register expected
stmfd sp!, {r0-r3}
^
../../../../ext/fiddle/libffi-3.2.1/src/arm/trampoline.S:2678:9: error: invalid operand for instruction
ldr r0, [pc, #-4092]
^
../../../../ext/fiddle/libffi-3.2.1/src/arm/trampoline.S:2681:9: error: invalid operand for instruction
ldr pc, [pc, #-4092]
^
../../../../ext/fiddle/libffi-3.2.1/src/arm/trampoline.S:2686:17: error: vector register expected
stmfd sp!, {r0-r3}
^
../../../../ext/fiddle/libffi-3.2.1/src/arm/trampoline.S:2691:9: error: invalid operand for instruction
ldr r0, [pc, #-4092]
^
../../../../ext/fiddle/libffi-3.2.1/src/arm/trampoline.S:2694:9: error: invalid operand for instruction
ldr pc, [pc, #-4092]
^
../../../../ext/fiddle/libffi-3.2.1/src/arm/trampoline.S:2699:17: error: vector register expected
stmfd sp!, {r0-r3}
^
../../../../ext/fiddle/libffi-3.2.1/src/arm/trampoline.S:2704:9: error: invalid operand for instruction
ldr r0, [pc, #-4092]
^
../../../../ext/fiddle/libffi-3.2.1/src/arm/trampoline.S:2707:9: error: invalid operand for instruction
ldr pc, [pc, #-4092]
^
../../../../ext/fiddle/libffi-3.2.1/src/arm/trampoline.S:2712:17: error: vector register expected
stmfd sp!, {r0-r3}
^
../../../../ext/fiddle/libffi-3.2.1/src/arm/trampoline.S:2717:9: error: invalid operand for instruction
ldr r0, [pc, #-4092]
^
../../../../ext/fiddle/libffi-3.2.1/src/arm/trampoline.S:2720:9: error: invalid operand for instruction
ldr pc, [pc, #-4092]
^
../../../../ext/fiddle/libffi-3.2.1/src/arm/trampoline.S:2725:17: error: vector register expected
stmfd sp!, {r0-r3}
^
../../../../ext/fiddle/libffi-3.2.1/src/arm/trampoline.S:2730:9: error: invalid operand for instruction
ldr r0, [pc, #-4092]
^
../../../../ext/fiddle/libffi-3.2.1/src/arm/trampoline.S:2733:9: error: invalid operand for instruction
ldr pc, [pc, #-4092]
^
../../../../ext/fiddle/libffi-3.2.1/src/arm/trampoline.S:2738:17: error: vector register expected
stmfd sp!, {r0-r3}
^
../../../../ext/fiddle/libffi-3.2.1/src/arm/trampoline.S:2743:9: error: invalid operand for instruction
ldr r0, [pc, #-4092]
^
../../../../ext/fiddle/libffi-3.2.1/src/arm/trampoline.S:2746:9: error: invalid operand for instruction
ldr pc, [pc, #-4092]
^
../../../../ext/fiddle/libffi-3.2.1/src/arm/trampoline.S:2751:17: error: vector register expected
stmfd sp!, {r0-r3}
^
../../../../ext/fiddle/libffi-3.2.1/src/arm/trampoline.S:2756:9: error: invalid operand for instruction
ldr r0, [pc, #-4092]
^
../../../../ext/fiddle/libffi-3.2.1/src/arm/trampoline.S:2759:9: error: invalid operand for instruction
ldr pc, [pc, #-4092]
^
../../../../ext/fiddle/libffi-3.2.1/src/arm/trampoline.S:2764:17: error: vector register expected
stmfd sp!, {r0-r3}
^
../../../../ext/fiddle/libffi-3.2.1/src/arm/trampoline.S:2769:9: error: invalid operand for instruction
ldr r0, [pc, #-4092]
^
../../../../ext/fiddle/libffi-3.2.1/src/arm/trampoline.S:2772:9: error: invalid operand for instruction
ldr pc, [pc, #-4092]
^
../../../../ext/fiddle/libffi-3.2.1/src/arm/trampoline.S:2777:17: error: vector register expected
stmfd sp!, {r0-r3}
^
../../../../ext/fiddle/libffi-3.2.1/src/arm/trampoline.S:2782:9: error: invalid operand for instruction
ldr r0, [pc, #-4092]
^
../../../../ext/fiddle/libffi-3.2.1/src/arm/trampoline.S:2785:9: error: invalid operand for instruction
ldr pc, [pc, #-4092]
^
../../../../ext/fiddle/libffi-3.2.1/src/arm/trampoline.S:2790:17: error: vector register expected
stmfd sp!, {r0-r3}
^
../../../../ext/fiddle/libffi-3.2.1/src/arm/trampoline.S:2795:9: error: invalid operand for instruction
ldr r0, [pc, #-4092]
^
../../../../ext/fiddle/libffi-3.2.1/src/arm/trampoline.S:2798:9: error: invalid operand for instruction
ldr pc, [pc, #-4092]
^
../../../../ext/fiddle/libffi-3.2.1/src/arm/trampoline.S:2803:17: error: vector register expected
stmfd sp!, {r0-r3}
^
../../../../ext/fiddle/libffi-3.2.1/src/arm/trampoline.S:2808:9: error: invalid operand for instruction
ldr r0, [pc, #-4092]
^
../../../../ext/fiddle/libffi-3.2.1/src/arm/trampoline.S:2811:9: error: invalid operand for instruction
ldr pc, [pc, #-4092]
^
../../../../ext/fiddle/libffi-3.2.1/src/arm/trampoline.S:2816:17: error: vector register expected
stmfd sp!, {r0-r3}
^
../../../../ext/fiddle/libffi-3.2.1/src/arm/trampoline.S:2821:9: error: invalid operand for instruction
ldr r0, [pc, #-4092]
^
../../../../ext/fiddle/libffi-3.2.1/src/arm/trampoline.S:2824:9: error: linking shared-object objspace.bundle
invalid operand for instruction
ldr pc, [pc, #-4092]
^
../../../../ext/fiddle/libffi-3.2.1/src/arm/trampoline.S:2829:17: error: vector register expected
stmfd sp!, {r0-r3}
^
../../../../ext/fiddle/libffi-3.2.1/src/arm/trampoline.S:2834:9: error: invalid operand for instruction
ldr r0, [pc, #-4092]
^
../../../../ext/fiddle/libffi-3.2.1/src/arm/trampoline.S:2837:9: error: invalid operand for instruction
ldr pc, [pc, #-4092]
^
../../../../ext/fiddle/libffi-3.2.1/src/arm/trampoline.S:2842:17: error: vector register expected
stmfd sp!, {r0-r3}
^
linking shared-object strscan.bundle
../../../../ext/fiddle/libffi-3.2.1/src/arm/trampoline.S:2847:9: error: invalid operand for instruction
ldr r0, [pc, #-4092]
^
../../../../ext/fiddle/libffi-3.2.1/src/arm/trampoline.S:2850:9: error: invalid operand for instruction
ldr pc, [pc, #-4092]
^
../../../../ext/fiddle/libffi-3.2.1/src/arm/trampoline.S:2855:17: error: vector register expected
stmfd sp!, {r0-r3}
^
../../../../ext/fiddle/libffi-3.2.1/src/arm/trampoline.S:2860:9: error: invalid operand for instruction
ldr r0, [pc, #-4092]
^
../../../../ext/fiddle/libffi-3.2.1/src/arm/trampoline.S:2863:9: error: invalid operand for instruction
ldr pc, [pc, #-4092]
^
../../../../ext/fiddle/libffi-3.2.1/src/arm/trampoline.S:2868:17: error: vector register expected
stmfd sp!, {r0-r3}
^
../../../../ext/fiddle/libffi-3.2.1/src/arm/trampoline.S:2873:9: error: invalid operand for instruction
ldr r0, [pc, #-4092]
^
../../../../ext/fiddle/libffi-3.2.1/src/arm/trampoline.S:2876:9: error: invalid operand for instruction
ldr pc, [pc, #-4092]
^
../../../../ext/fiddle/libffi-3.2.1/src/arm/trampoline.S:2881:17: error: vector register expected
stmfd sp!, {r0-r3}
^
../../../../ext/fiddle/libffi-3.2.1/src/arm/trampoline.S:2886:9: error: invalid operand for instruction
ldr r0, [pc, #-4092]
^
../../../../ext/fiddle/libffi-3.2.1/src/arm/trampoline.S:2889:9: error: invalid operand for instruction
ldr pc, [pc, #-4092]
^
../../../../ext/fiddle/libffi-3.2.1/src/arm/trampoline.S:2894:17: error: vector register expected
stmfd sp!, {r0-r3}
^
../../../../ext/fiddle/libffi-3.2.1/src/arm/trampoline.S:2899:9: error: invalid operand for instruction
ldr r0, [pc, #-4092]
^
../../../../ext/fiddle/libffi-3.2.1/src/arm/trampoline.S:2902:9: error: invalid operand for instruction
ldr pc, [pc, #-4092]
^
../../../../ext/fiddle/libffi-3.2.1/src/arm/trampoline.S:2907:17: error: vector register expected
stmfd sp!, {r0-r3}
^
../../../../ext/fiddle/libffi-3.2.1/src/arm/trampoline.S:2912:9: error: invalid operand for instruction
ldr r0, [pc, #-4092]
^
../../../../ext/fiddle/libffi-3.2.1/src/arm/trampoline.S:2915:9: error: invalid operand for instruction
ldr pc, [pc, #-4092]
^
../../../../ext/fiddle/libffi-3.2.1/src/arm/trampoline.S:2920:17: error: vector register expected
stmfd sp!, {r0-r3}
^
../../../../ext/fiddle/libffi-3.2.1/src/arm/trampoline.S:2925:9: error: invalid operand for instruction
ldr r0, [pc, #-4092]
^
../../../../ext/fiddle/libffi-3.2.1/src/arm/trampoline.S:2928:9: error: invalid operand for instruction
ldr pc, [pc, #-4092]
^
../../../../ext/fiddle/libffi-3.2.1/src/arm/trampoline.S:2933:17: error: vector register expected
stmfd sp!, {r0-r3}
^
../../../../ext/fiddle/libffi-3.2.1/src/arm/trampoline.S:2938:9: error: invalid operand for instruction
ldr r0, [pc, #-4092]
^
../../../../ext/fiddle/libffi-3.2.1/src/arm/trampoline.S:2941:9: error: invalid operand for instruction
ldr pc, [pc, #-4092]
^
../../../../ext/fiddle/libffi-3.2.1/src/arm/trampoline.S:2946:17: error: vector register expected
stmfd sp!, {r0-r3}
^
../../../../ext/fiddle/libffi-3.2.1/src/arm/trampoline.S:2951:9: error: invalid operand for instruction
ldr r0, [pc, #-4092]
^
../../../../ext/fiddle/libffi-3.2.1/src/arm/trampoline.S:2954:9: error: invalid operand for instruction
ldr pc, [pc, #-4092]
^
../../../../ext/fiddle/libffi-3.2.1/src/arm/trampoline.S:2959:17: error: vector register expected
stmfd sp!, {r0-r3}
^
../../../../ext/fiddle/libffi-3.2.1/src/arm/trampoline.S:2964:9: error: invalid operand for instruction
ldr r0, [pc, #-4092]
^
../../../../ext/fiddle/libffi-3.2.1/src/arm/trampoline.S:2967:9: error: invalid operand for instruction
ldr pc, [pc, #-4092]
^
../../../../ext/fiddle/libffi-3.2.1/src/arm/trampoline.S:2972:17: error: vector register expected
stmfd sp!, {r0-r3}
^
../../../../ext/fiddle/libffi-3.2.1/src/arm/trampoline.S:2977:9: error: invalid operand for instruction
ldr r0, [pc, #-4092]
^
../../../../ext/fiddle/libffi-3.2.1/src/arm/trampoline.S:2980:9: error: invalid operand for instruction
ldr pc, [pc, #-4092]
^
../../../../ext/fiddle/libffi-3.2.1/src/arm/trampoline.S:2985:17: error: vector register expected
stmfd sp!, {r0-r3}
^
../../../../ext/fiddle/libffi-3.2.1/src/arm/trampoline.S:2990:9: error: invalid operand for instruction
ldr r0, [pc, #-4092]
^
../../../../ext/fiddle/libffi-3.2.1/src/arm/trampoline.S:2993:9: error: invalid operand for instruction
ldr pc, [pc, #-4092]
^
../../../../ext/fiddle/libffi-3.2.1/src/arm/trampoline.S:2998:17: error: vector register expected
stmfd sp!, {r0-r3}
^
../../../../ext/fiddle/libffi-3.2.1/src/arm/trampoline.S:3003:9: error: invalid operand for instruction
ldr r0, [pc, #-4092]
^
../../../../ext/fiddle/libffi-3.2.1/src/arm/trampoline.S:3006:9: error: invalid operand for instruction
ldr pc, [pc, #-4092]
^
../../../../ext/fiddle/libffi-3.2.1/src/arm/trampoline.S:3011:17: error: vector register expected
stmfd sp!, {r0-r3}
^
../../../../ext/fiddle/libffi-3.2.1/src/arm/trampoline.S:3016:9: error: invalid operand for instruction
ldr r0, [pc, #-4092]
^
../../../../ext/fiddle/libffi-3.2.1/src/arm/trampoline.S:3019:9: error: invalid operand for instruction
ldr pc, [pc, #-4092]
^
../../../../ext/fiddle/libffi-3.2.1/src/arm/trampoline.S:3024:17: error: vector register expected
stmfd sp!, {r0-r3}
^
../../../../ext/fiddle/libffi-3.2.1/src/arm/trampoline.S:3029:9: error: invalid operand for instruction
ldr r0, [pc, #-4092]
^
../../../../ext/fiddle/libffi-3.2.1/src/arm/trampoline.S:3032:9: error: invalid operand for instruction
ldr pc, [pc, #-4092]
^
../../../../ext/fiddle/libffi-3.2.1/src/arm/trampoline.S:3037:17: error: vector register expected
stmfd sp!, {r0-r3}
^
../../../../ext/fiddle/libffi-3.2.1/src/arm/trampoline.S:3042:9: error: invalid operand for instruction
ldr r0, [pc, #-4092]
^
../../../../ext/fiddle/libffi-3.2.1/src/arm/trampoline.S:3045:9: error: invalid operand for instruction
ldr pc, [pc, #-4092]
^
../../../../ext/fiddle/libffi-3.2.1/src/arm/trampoline.S:3050:17: error: vector register expected
stmfd sp!, {r0-r3}
^
../../../../ext/fiddle/libffi-3.2.1/src/arm/trampoline.S:3055:9: error: invalid operand for instruction
ldr r0, [pc, #-4092]
^
../../../../ext/fiddle/libffi-3.2.1/src/arm/trampoline.S:3058:9: error: invalid operand for instruction
ldr pc, [pc, #-4092]
^
../../../../ext/fiddle/libffi-3.2.1/src/arm/trampoline.S:3063:17: error: vector register expected
stmfd sp!, {r0-r3}
^
../../../../ext/fiddle/libffi-3.2.1/src/arm/trampoline.S:3068:9: error: invalid operand for instruction
ldr r0, [pc, #-4092]
^
../../../../ext/fiddle/libffi-3.2.1/src/arm/trampoline.S:3071:9: error: invalid operand for instruction
ldr pc, [pc, #-4092]
^
../../../../ext/fiddle/libffi-3.2.1/src/arm/trampoline.S:3076:17: error: vector register expected
stmfd sp!, {r0-r3}
^
../../../../ext/fiddle/libffi-3.2.1/src/arm/trampoline.S:3081:9: error: invalid operand for instruction
ldr r0, [pc, #-4092]
^
../../../../ext/fiddle/libffi-3.2.1/src/arm/trampoline.S:3084:9: error: invalid operand for instruction
ldr pc, [pc, #-4092]
^
../../../../ext/fiddle/libffi-3.2.1/src/arm/trampoline.S:3089:17: error: vector register expected
stmfd sp!, {r0-r3}
^
../../../../ext/fiddle/libffi-3.2.1/src/arm/trampoline.S:3094:9: error: invalid operand for instruction
ldr r0, [pc, #-4092]
^
../../../../ext/fiddle/libffi-3.2.1/src/arm/trampoline.S:3097:9: error: invalid operand for instruction
ldr pc, [pc, #-4092]
^
../../../../ext/fiddle/libffi-3.2.1/src/arm/trampoline.S:3102:17: error: vector register expected
stmfd sp!, {r0-r3}
^
../../../../ext/fiddle/libffi-3.2.1/src/arm/trampoline.S:3107:9: error: invalid operand for instruction
ldr r0, [pc, #-4092]
^
../../../../ext/fiddle/libffi-3.2.1/src/arm/trampoline.S:3110:9: error: invalid operand for instruction
ldr pc, [pc, #-4092]
^
../../../../ext/fiddle/libffi-3.2.1/src/arm/trampoline.S:3115:17: error: vector register expected
stmfd sp!, {r0-r3}
^
../../../../ext/fiddle/libffi-3.2.1/src/arm/trampoline.S:3120:9: error: invalid operand for instruction
ldr r0, [pc, #-4092]
^
../../../../ext/fiddle/libffi-3.2.1/src/arm/trampoline.S:3123:9: error: invalid operand for instruction
ldr pc, [pc, #-4092]
^
../../../../ext/fiddle/libffi-3.2.1/src/arm/trampoline.S:3128:17: error: vector register expected
stmfd sp!, {r0-r3}
^
../../../../ext/fiddle/libffi-3.2.1/src/arm/trampoline.S:3133:9: error: invalid operand for instruction
ldr r0, [pc, #-4092]
^
../../../../ext/fiddle/libffi-3.2.1/src/arm/trampoline.S:3136:9: error: invalid operand for instruction
ldr pc, [pc, #-4092]
^
../../../../ext/fiddle/libffi-3.2.1/src/arm/trampoline.S:3141:17: error: vector register expected
stmfd sp!, {r0-r3}
^
../../../../ext/fiddle/libffi-3.2.1/src/arm/trampoline.S:3146:9: error: invalid operand for instruction
ldr r0, [pc, #-4092]
^
../../../../ext/fiddle/libffi-3.2.1/src/arm/trampoline.S:3149:9: error: invalid operand for instruction
ldr pc, [pc, #-4092]
^
../../../../ext/fiddle/libffi-3.2.1/src/arm/trampoline.S:3154:17: error: vector register expected
stmfd sp!, {r0-r3}
^
../../../../ext/fiddle/libffi-3.2.1/src/arm/trampoline.S:3159:9: error: invalid operand for instruction
ldr r0, [pc, #-4092]
^
../../../../ext/fiddle/libffi-3.2.1/src/arm/trampoline.S:3162:9: error: invalid operand for instruction
ldr pc, [pc, #-4092]
^
../../../../ext/fiddle/libffi-3.2.1/src/arm/trampoline.S:3167:17: error: vector register expected
stmfd sp!, {r0-r3}
^
../../../../ext/fiddle/libffi-3.2.1/src/arm/trampoline.S:3172:9: error: invalid operand for instruction
ldr r0, [pc, #-4092]
^
../../../../ext/fiddle/libffi-3.2.1/src/arm/trampoline.S:3175:9: error: invalid operand for instruction
ldr pc, [pc, #-4092]
^
../../../../ext/fiddle/libffi-3.2.1/src/arm/trampoline.S:3180:17: error: vector register expected
stmfd sp!, {r0-r3}
^
../../../../ext/fiddle/libffi-3.2.1/src/arm/trampoline.S:3185:9: error: invalid operand for instruction
ldr r0, [pc, #-4092]
^
../../../../ext/fiddle/libffi-3.2.1/src/arm/trampoline.S:3188:9: error: invalid operand for instruction
ldr pc, [pc, #-4092]
^
../../../../ext/fiddle/libffi-3.2.1/src/arm/trampoline.S:3193:17: error: vector register expected
stmfd sp!, {r0-r3}
^
../../../../ext/fiddle/libffi-3.2.1/src/arm/trampoline.S:3198:9: error: invalid operand for instruction
ldr r0, [pc, #-4092]
^
../../../../ext/fiddle/libffi-3.2.1/src/arm/trampoline.S:3201:9: error: invalid operand for instruction
ldr pc, [pc, #-4092]
^
../../../../ext/fiddle/libffi-3.2.1/src/arm/trampoline.S:3206:17: error: vector register expected
stmfd sp!, {r0-r3}
^
../../../../ext/fiddle/libffi-3.2.1/src/arm/trampoline.S:3211:9: error: invalid operand for instruction
ldr r0, [pc, #-4092]
^
../../../../ext/fiddle/libffi-3.2.1/src/arm/trampoline.S:3214:9: error: invalid operand for instruction
ldr pc, [pc, #-4092]
^
../../../../ext/fiddle/libffi-3.2.1/src/arm/trampoline.S:3219:17: error: vector register expected
stmfd sp!, {r0-r3}
^
../../../../ext/fiddle/libffi-3.2.1/src/arm/trampoline.S:3224:9: error: invalid operand for instruction
ldr r0, [pc, #-4092]
^
../../../../ext/fiddle/libffi-3.2.1/src/arm/trampoline.S:3227:9: error: invalid operand for instruction
ldr pc, [pc, #-4092]
^
../../../../ext/fiddle/libffi-3.2.1/src/arm/trampoline.S:3232:17: error: vector register expected
stmfd sp!, {r0-r3}
^
../../../../ext/fiddle/libffi-3.2.1/src/arm/trampoline.S:3237:9: error: invalid operand for instruction
ldr r0, [pc, #-4092]
^
../../../../ext/fiddle/libffi-3.2.1/src/arm/trampoline.S:3240:9: error: invalid operand for instruction
ldr pc, [pc, #-4092]
^
../../../../ext/fiddle/libffi-3.2.1/src/arm/trampoline.S:3245:17: error: vector register expected
stmfd sp!, {r0-r3}
^
../../../../ext/fiddle/libffi-3.2.1/src/arm/trampoline.S:3250:9: error: invalid operand for instruction
ldr r0, [pc, #-4092]
^
../../../../ext/fiddle/libffi-3.2.1/src/arm/trampoline.S:3253:9: error: invalid operand for instruction
ldr pc, [pc, #-4092]
^
../../../../ext/fiddle/libffi-3.2.1/src/arm/trampoline.S:3258:17: error: vector register expected
stmfd sp!, {r0-r3}
^
../../../../ext/fiddle/libffi-3.2.1/src/arm/trampoline.S:3263:9: error: invalid operand for instruction
ldr r0, [pc, #-4092]
^
../../../../ext/fiddle/libffi-3.2.1/src/arm/trampoline.S:3266:9: error: invalid operand for instruction
ldr pc, [pc, #-4092]
^
../../../../ext/fiddle/libffi-3.2.1/src/arm/trampoline.S:3271:17: error: vector register expected
stmfd sp!, {r0-r3}
^
../../../../ext/fiddle/libffi-3.2.1/src/arm/trampoline.S:3276:9: error: invalid operand for instruction
ldr r0, [pc, #-4092]
^
../../../../ext/fiddle/libffi-3.2.1/src/arm/trampoline.S:3279:9: error: invalid operand for instruction
ldr pc, [pc, #-4092]
^
../../../../ext/fiddle/libffi-3.2.1/src/arm/trampoline.S:3284:17: error: vector register expected
stmfd sp!, {r0-r3}
^
../../../../ext/fiddle/libffi-3.2.1/src/arm/trampoline.S:3289:9: error: invalid operand for instruction
ldr r0, [pc, #-4092]
^
../../../../ext/fiddle/libffi-3.2.1/src/arm/trampoline.S:3292:9: error: invalid operand for instruction
ldr pc, [pc, #-4092]
^
../../../../ext/fiddle/libffi-3.2.1/src/arm/trampoline.S:3297:17: error: vector register expected
stmfd sp!, {r0-r3}
^
../../../../ext/fiddle/libffi-3.2.1/src/arm/trampoline.S:3302:9: error: invalid operand for instruction
ldr r0, [pc, #-4092]
^
../../../../ext/fiddle/libffi-3.2.1/src/arm/trampoline.S:3305:9: error: invalid operand for instruction
ldr pc, [pc, #-4092]
^
../../../../ext/fiddle/libffi-3.2.1/src/arm/trampoline.S:3310:17: error: vector register expected
stmfd sp!, {r0-r3}
^
../../../../ext/fiddle/libffi-3.2.1/src/arm/trampoline.S:3315:9: error: invalid operand for instruction
ldr r0, [pc, #-4092]
^
../../../../ext/fiddle/libffi-3.2.1/src/arm/trampoline.S:3318:9: error: invalid operand for instruction
ldr pc, [pc, #-4092]
^
../../../../ext/fiddle/libffi-3.2.1/src/arm/trampoline.S:3323:17: error: vector register expected
stmfd sp!, {r0-r3}
^
../../../../ext/fiddle/libffi-3.2.1/src/arm/trampoline.S:3328:9: error: invalid operand for instruction
ldr r0, [pc, #-4092]
^
../../../../ext/fiddle/libffi-3.2.1/src/arm/trampoline.S:3331:9: error: invalid operand for instruction
ldr pc, [pc, #-4092]
^
../../../../ext/fiddle/libffi-3.2.1/src/arm/trampoline.S:3336:17: error: vector register expected
stmfd sp!, {r0-r3}
^
../../../../ext/fiddle/libffi-3.2.1/src/arm/trampoline.S:3341:9: error: invalid operand for instruction
ldr r0, [pc, #-4092]
^
../../../../ext/fiddle/libffi-3.2.1/src/arm/trampoline.S:3344:9: error: invalid operand for instruction
ldr pc, [pc, #-4092]
^
../../../../ext/fiddle/libffi-3.2.1/src/arm/trampoline.S:3349:17: error: vector register expected
stmfd sp!, {r0-r3}
^
../../../../ext/fiddle/libffi-3.2.1/src/arm/trampoline.S:3354:9: error: invalid operand for instruction
ldr r0, [pc, #-4092]
^
../../../../ext/fiddle/libffi-3.2.1/src/arm/trampoline.S:3357:9: error: invalid operand for instruction
ldr pc, [pc, #-4092]
^
../../../../ext/fiddle/libffi-3.2.1/src/arm/trampoline.S:3362:17: error: vector register expected
stmfd sp!, {r0-r3}
^
../../../../ext/fiddle/libffi-3.2.1/src/arm/trampoline.S:3367:9: error: invalid operand for instruction
ldr r0, [pc, #-4092]
^
../../../../ext/fiddle/libffi-3.2.1/src/arm/trampoline.S:3370:9: error: invalid operand for instruction
ldr pc, [pc, #-4092]
^
../../../../ext/fiddle/libffi-3.2.1/src/arm/trampoline.S:3375:17: error: vector register expected
stmfd sp!, {r0-r3}
^
../../../../ext/fiddle/libffi-3.2.1/src/arm/trampoline.S:3380:9: error: invalid operand for instruction
ldr r0, [pc, #-4092]
^
../../../../ext/fiddle/libffi-3.2.1/src/arm/trampoline.S:3383:9: error: invalid operand for instruction
ldr pc, [pc, #-4092]
^
../../../../ext/fiddle/libffi-3.2.1/src/arm/trampoline.S:3388:17: error: vector register expected
stmfd sp!, {r0-r3}
^
../../../../ext/fiddle/libffi-3.2.1/src/arm/trampoline.S:3393:9: error: invalid operand for instruction
ldr r0, [pc, #-4092]
^
../../../../ext/fiddle/libffi-3.2.1/src/arm/trampoline.S:3396:9: error: invalid operand for instruction
ldr pc, [pc, #-4092]
^
../../../../ext/fiddle/libffi-3.2.1/src/arm/trampoline.S:3401:17: error: vector register expected
linking shared-object gdbm.bundle
stmfd sp!, {r0-r3}
^
../../../../ext/fiddle/libffi-3.2.1/src/arm/trampoline.S:3406:9: error: invalid operand for instruction
ldr r0, [pc, #-4092]
^
../../../../ext/fiddle/libffi-3.2.1/src/arm/trampoline.S:3409:9: error: invalid operand for instruction
ldr pc, [pc, #-4092]
^
../../../../ext/fiddle/libffi-3.2.1/src/arm/trampoline.S:3414:17: error: vector register expected
stmfd sp!, {r0-r3}
^
../../../../ext/fiddle/libffi-3.2.1/src/arm/trampoline.S:3419:9: error: invalid operand for instruction
ldr r0, [pc, #-4092]
^
../../../../ext/fiddle/libffi-3.2.1/src/arm/trampoline.S:3422:9: error: invalid operand for instruction
ldr pc, [pc, #-4092]
^
../../../../ext/fiddle/libffi-3.2.1/src/arm/trampoline.S:3427:17: error: vector register expected
stmfd sp!, {r0-r3}
^
../../../../ext/fiddle/libffi-3.2.1/src/arm/trampoline.S:3432:9: error: invalid operand for instruction
ldr r0, [pc, #-4092]
^
../../../../ext/fiddle/libffi-3.2.1/src/arm/trampoline.S:3435:9: error: invalid operand for instruction
ldr pc, [pc, #-4092]
^
../../../../ext/fiddle/libffi-3.2.1/src/arm/trampoline.S:3440:17: error: vector register expected
stmfd sp!, {r0-r3}
^
../../../../ext/fiddle/libffi-3.2.1/src/arm/trampoline.S:3445:9: error: invalid operand for instruction
ldr r0, [pc, #-4092]
^
../../../../ext/fiddle/libffi-3.2.1/src/arm/trampoline.S:3448:9: error: invalid operand for instruction
ldr pc, [pc, #-4092]
^
../../../../ext/fiddle/libffi-3.2.1/src/arm/trampoline.S:3453:17: error: vector register expected
stmfd sp!, {r0-r3}
^
../../../../ext/fiddle/libffi-3.2.1/src/arm/trampoline.S:3458:9: error: invalid operand for instruction
ldr r0, [pc, #-4092]
^
../../../../ext/fiddle/libffi-3.2.1/src/arm/trampoline.S:3461:9: error: invalid operand for instruction
ldr pc, [pc, #-4092]
^
../../../../ext/fiddle/libffi-3.2.1/src/arm/trampoline.S:3466:17: error: vector register expected
stmfd sp!, {r0-r3}
^
../../../../ext/fiddle/libffi-3.2.1/src/arm/trampoline.S:3471:9: error: invalid operand for instruction
ldr r0, [pc, #-4092]
^
../../../../ext/fiddle/libffi-3.2.1/src/arm/trampoline.S:3474:9: error: invalid operand for instruction
ldr pc, [pc, #-4092]
^
../../../../ext/fiddle/libffi-3.2.1/src/arm/trampoline.S:3479:17: error: vector register expected
stmfd sp!, {r0-r3}
^
../../../../ext/fiddle/libffi-3.2.1/src/arm/trampoline.S:3484:9: error: invalid operand for instruction
ldr r0, [pc, #-4092]
^
../../../../ext/fiddle/libffi-3.2.1/src/arm/trampoline.S:3487:9: error: invalid operand for instruction
ldr pc, [pc, #-4092]
^
../../../../ext/fiddle/libffi-3.2.1/src/arm/trampoline.S:3492:17: error: vector register expected
stmfd sp!, {r0-r3}
^
../../../../ext/fiddle/libffi-3.2.1/src/arm/trampoline.S:3497:9: error: invalid operand for instruction
ldr r0, [pc, #-4092]
^
../../../../ext/fiddle/libffi-3.2.1/src/arm/trampoline.S:3500:9: error: invalid operand for instruction
ldr pc, [pc, #-4092]
^
../../../../ext/fiddle/libffi-3.2.1/src/arm/trampoline.S:3505:17: error: vector register expected
stmfd sp!, {r0-r3}
^
../../../../ext/fiddle/libffi-3.2.1/src/arm/trampoline.S:3510:9: error: invalid operand for instruction
ldr r0, [pc, #-4092]
^
../../../../ext/fiddle/libffi-3.2.1/src/arm/trampoline.S:3513:9: error: invalid operand for instruction
ldr pc, [pc, #-4092]
^
../../../../ext/fiddle/libffi-3.2.1/src/arm/trampoline.S:3518:17: error: vector register expected
stmfd sp!, {r0-r3}
^
../../../../ext/fiddle/libffi-3.2.1/src/arm/trampoline.S:3523:9: error: invalid operand for instruction
ldr r0, [pc, #-4092]
^
../../../../ext/fiddle/libffi-3.2.1/src/arm/trampoline.S:3526:9: error: invalid operand for instruction
ldr pc, [pc, #-4092]
^
../../../../ext/fiddle/libffi-3.2.1/src/arm/trampoline.S:3531:17: error: vector register expected
stmfd sp!, {r0-r3}
^
../../../../ext/fiddle/libffi-3.2.1/src/arm/trampoline.S:3536:9: error: invalid operand for instruction
ldr r0, [pc, #-4092]
^
../../../../ext/fiddle/libffi-3.2.1/src/arm/trampoline.S:3539:9: error: invalid operand for instruction
ldr pc, [pc, #-4092]
^
../../../../ext/fiddle/libffi-3.2.1/src/arm/trampoline.S:3544:17: error: vector register expected
stmfd sp!, {r0-r3}
^
../../../../ext/fiddle/libffi-3.2.1/src/arm/trampoline.S:3549:9: error: invalid operand for instruction
ldr r0, [pc, #-4092]
^
../../../../ext/fiddle/libffi-3.2.1/src/arm/trampoline.S:3552:9: error: invalid operand for instruction
ldr pc, [pc, #-4092]
^
../../../../ext/fiddle/libffi-3.2.1/src/arm/trampoline.S:3557:17: error: vector register expected
stmfd sp!, {r0-r3}
^
../../../../ext/fiddle/libffi-3.2.1/src/arm/trampoline.S:3562:9: error: invalid operand for instruction
ldr r0, [pc, #-4092]
^
../../../../ext/fiddle/libffi-3.2.1/src/arm/trampoline.S:3565:9: error: invalid operand for instruction
ldr pc, [pc, #-4092]
^
../../../../ext/fiddle/libffi-3.2.1/src/arm/trampoline.S:3570:17: error: vector register expected
stmfd sp!, {r0-r3}
^
../../../../ext/fiddle/libffi-3.2.1/src/arm/trampoline.S:3575:9: error: invalid operand for instruction
ldr r0, [pc, #-4092]
^
../../../../ext/fiddle/libffi-3.2.1/src/arm/trampoline.S:3578:9: error: invalid operand for instruction
ldr pc, [pc, #-4092]
^
../../../../ext/fiddle/libffi-3.2.1/src/arm/trampoline.S:3583:17: error: vector register expected
stmfd sp!, {r0-r3}
^
../../../../ext/fiddle/libffi-3.2.1/src/arm/trampoline.S:3588:9: error: invalid operand for instruction
ldr r0, [pc, #-4092]
^
../../../../ext/fiddle/libffi-3.2.1/src/arm/trampoline.S:3591:9: error: invalid operand for instruction
ldr pc, [pc, #-4092]
^
../../../../ext/fiddle/libffi-3.2.1/src/arm/trampoline.S:3596:17: error: vector register expected
stmfd sp!, {r0-r3}
^
../../../../ext/fiddle/libffi-3.2.1/src/arm/trampoline.S:3601:9: error: invalid operand for instruction
ldr r0, [pc, #-4092]
^
../../../../ext/fiddle/libffi-3.2.1/src/arm/trampoline.S:3604:9: error: invalid operand for instruction
ldr pc, [pc, #-4092]
^
../../../../ext/fiddle/libffi-3.2.1/src/arm/trampoline.S:3609:17: error: vector register expected
stmfd sp!, {r0-r3}
^
../../../../ext/fiddle/libffi-3.2.1/src/arm/trampoline.S:3614:9: error: invalid operand for instruction
ldr r0, [pc, #-4092]
^
../../../../ext/fiddle/libffi-3.2.1/src/arm/trampoline.S:3617:9: error: invalid operand for instruction
linking shared-object json/ext/parser.bundle
ldr pc, [pc, #-4092]
^
../../../../ext/fiddle/libffi-3.2.1/src/arm/trampoline.S:3622:17: error: vector register expected
stmfd sp!, {r0-r3}
^
../../../../ext/fiddle/libffi-3.2.1/src/arm/trampoline.S:3627:9: error: invalid operand for instruction
ldr r0, [pc, #-4092]
^
../../../../ext/fiddle/libffi-3.2.1/src/arm/trampoline.S:3630:9: error: invalid operand for instruction
ldr pc, [pc, #-4092]
^
../../../../ext/fiddle/libffi-3.2.1/src/arm/trampoline.S:3635:17: error: vector register expected
stmfd sp!, {r0-r3}
^
../../../../ext/fiddle/libffi-3.2.1/src/arm/trampoline.S:3640:9: error: invalid operand for instruction
ldr r0, [pc, #-4092]
^
../../../../ext/fiddle/libffi-3.2.1/src/arm/trampoline.S:3643:9: error: invalid operand for instruction
ldr pc, [pc, #-4092]
^
../../../../ext/fiddle/libffi-3.2.1/src/arm/trampoline.S:3648:17: error: vector register expected
stmfd sp!, {r0-r3}
^
../../../../ext/fiddle/libffi-3.2.1/src/arm/trampoline.S:3653:9: error: invalid operand for instruction
ldr r0, [pc, #-4092]
^
../../../../ext/fiddle/libffi-3.2.1/src/arm/trampoline.S:3656:9: error: invalid operand for instruction
ldr pc, [pc, #-4092]
^
../../../../ext/fiddle/libffi-3.2.1/src/arm/trampoline.S:3661:17: error: vector register expected
stmfd sp!, {r0-r3}
^
../../../../ext/fiddle/libffi-3.2.1/src/arm/trampoline.S:3666:9: error: invalid operand for instruction
ldr r0, [pc, #-4092]
^
../../../../ext/fiddle/libffi-3.2.1/src/arm/trampoline.S:3669:9: error: invalid operand for instruction
ldr pc, [pc, #-4092]
^
../../../../ext/fiddle/libffi-3.2.1/src/arm/trampoline.S:3674:17: error: vector register expected
stmfd sp!, {r0-r3}
^
../../../../ext/fiddle/libffi-3.2.1/src/arm/trampoline.S:3679:9: error: invalid operand for instruction
ldr r0, [pc, #-4092]
^
../../../../ext/fiddle/libffi-3.2.1/src/arm/trampoline.S:3682:9: error: invalid operand for instruction
ldr pc, [pc, #-4092]
^
../../../../ext/fiddle/libffi-3.2.1/src/arm/trampoline.S:3687:17: error: vector register expected
stmfd sp!, {r0-r3}
^
../../../../ext/fiddle/libffi-3.2.1/src/arm/trampoline.S:3692:9: error: invalid operand for instruction
ldr r0, [pc, #-4092]
^
../../../../ext/fiddle/libffi-3.2.1/src/arm/trampoline.S:3695:9: error: invalid operand for instruction
ldr pc, [pc, #-4092]
^
../../../../ext/fiddle/libffi-3.2.1/src/arm/trampoline.S:3700:17: error: vector register expected
stmfd sp!, {r0-r3}
^
../../../../ext/fiddle/libffi-3.2.1/src/arm/trampoline.S:3705:9: error: invalid operand for instruction
ldr r0, [pc, #-4092]
^
../../../../ext/fiddle/libffi-3.2.1/src/arm/trampoline.S:3708:9: error: invalid operand for instruction
ldr pc, [pc, #-4092]
^
../../../../ext/fiddle/libffi-3.2.1/src/arm/trampoline.S:3713:17: error: vector register expected
stmfd sp!, {r0-r3}
^
../../../../ext/fiddle/libffi-3.2.1/src/arm/trampoline.S:3718:9: error: invalid operand for instruction
ldr r0, [pc, #-4092]
^
../../../../ext/fiddle/libffi-3.2.1/src/arm/trampoline.S:3721:9: error: invalid operand for instruction
ldr pc, [pc, #-4092]
^
../../../../ext/fiddle/libffi-3.2.1/src/arm/trampoline.S:3726:17: error: vector register expected
stmfd sp!, {r0-r3}
^
../../../../ext/fiddle/libffi-3.2.1/src/arm/trampoline.S:3731:9: error: invalid operand for instruction
ldr r0, [pc, #-4092]
^
../../../../ext/fiddle/libffi-3.2.1/src/arm/trampoline.S:3734:9: error: invalid operand for instruction
ldr pc, [pc, #-4092]
^
../../../../ext/fiddle/libffi-3.2.1/src/arm/trampoline.S:3739:17: error: vector register expected
stmfd sp!, {r0-r3}
^
../../../../ext/fiddle/libffi-3.2.1/src/arm/trampoline.S:3744:9: error: invalid operand for instruction
ldr r0, [pc, #-4092]
^
../../../../ext/fiddle/libffi-3.2.1/src/arm/trampoline.S:3747:9: error: invalid operand for instruction
ldr pc, [pc, #-4092]
^
../../../../ext/fiddle/libffi-3.2.1/src/arm/trampoline.S:3752:17: error: vector register expected
stmfd sp!, {r0-r3}
^
../../../../ext/fiddle/libffi-3.2.1/src/arm/trampoline.S:3757:9: error: invalid operand for instruction
ldr r0, [pc, #-4092]
^
../../../../ext/fiddle/libffi-3.2.1/src/arm/trampoline.S:3760:9: error: invalid operand for instruction
ldr pc, [pc, #-4092]
^
../../../../ext/fiddle/libffi-3.2.1/src/arm/trampoline.S:3765:17: error: vector register expected
stmfd sp!, {r0-r3}
^
../../../../ext/fiddle/libffi-3.2.1/src/arm/trampoline.S:3770:9: error: invalid operand for instruction
ldr r0, [pc, #-4092]
^
../../../../ext/fiddle/libffi-3.2.1/src/arm/trampoline.S:3773:9: error: invalid operand for instruction
ldr pc, [pc, #-4092]
^
../../../../ext/fiddle/libffi-3.2.1/src/arm/trampoline.S:3778:17: error: vector register expected
stmfd sp!, {r0-r3}
^
../../../../ext/fiddle/libffi-3.2.1/src/arm/trampoline.S:3783:9: error: invalid operand for instruction
ldr r0, [pc, #-4092]
^
../../../../ext/fiddle/libffi-3.2.1/src/arm/trampoline.S:3786:9: error: invalid operand for instruction
ldr pc, [pc, #-4092]
^
../../../../ext/fiddle/libffi-3.2.1/src/arm/trampoline.S:3791:17: error: vector register expected
stmfd sp!, {r0-r3}
^
../../../../ext/fiddle/libffi-3.2.1/src/arm/trampoline.S:3796:9: error: invalid operand for instruction
ldr r0, [pc, #-4092]
^
../../../../ext/fiddle/libffi-3.2.1/src/arm/trampoline.S:3799:9: error: invalid operand for instruction
ldr pc, [pc, #-4092]
^
../../../../ext/fiddle/libffi-3.2.1/src/arm/trampoline.S:3804:17: error: vector register expected
stmfd sp!, {r0-r3}
^
../../../../ext/fiddle/libffi-3.2.1/src/arm/trampoline.S:3809:9: error: invalid operand for instruction
ldr r0, [pc, #-4092]
^
../../../../ext/fiddle/libffi-3.2.1/src/arm/trampoline.S:3812:9: error: invalid operand for instruction
ldr pc, [pc, #-4092]
^
../../../../ext/fiddle/libffi-3.2.1/src/arm/trampoline.S:3817:17: error: vector register expected
stmfd sp!, {r0-r3}
^
../../../../ext/fiddle/libffi-3.2.1/src/arm/trampoline.S:3822:9: error: invalid operand for instruction
ldr r0, [pc, #-4092]
^
../../../../ext/fiddle/libffi-3.2.1/src/arm/trampoline.S:3825:9: error: invalid operand for instruction
ldr pc, [pc, #-4092]
^
../../../../ext/fiddle/libffi-3.2.1/src/arm/trampoline.S:3830:17: error: vector register expected
stmfd sp!, {r0-r3}
^
../../../../ext/fiddle/libffi-3.2.1/src/arm/trampoline.S:3835:9: error: invalid operand for instruction
ldr r0, [pc, #-4092]
^
../../../../ext/fiddle/libffi-3.2.1/src/arm/trampoline.S:3838:9: error: invalid operand for instruction
ldr pc, [pc, #-4092]
^
../../../../ext/fiddle/libffi-3.2.1/src/arm/trampoline.S:3843:17: error: vector register expected
stmfd sp!, {r0-r3}
^
../../../../ext/fiddle/libffi-3.2.1/src/arm/trampoline.S:3848:9: error: invalid operand for instruction
ldr r0, [pc, #-4092]
^
../../../../ext/fiddle/libffi-3.2.1/src/arm/trampoline.S:3851:9: error: invalid operand for instruction
ldr pc, [pc, #-4092]
^
../../../../ext/fiddle/libffi-3.2.1/src/arm/trampoline.S:3856:17: error: vector register expected
stmfd sp!, {r0-r3}
^
../../../../ext/fiddle/libffi-3.2.1/src/arm/trampoline.S:3861:9: error: invalid operand for instruction
ldr r0, [pc, #-4092]
^
../../../../ext/fiddle/libffi-3.2.1/src/arm/trampoline.S:3864:9: error: invalid operand for instruction
ldr pc, [pc, #-4092]
^
../../../../ext/fiddle/libffi-3.2.1/src/arm/trampoline.S:3869:17: error: vector register expected
stmfd sp!, {r0-r3}
^
../../../../ext/fiddle/libffi-3.2.1/src/arm/trampoline.S:3874:9: error: invalid operand for instruction
ldr r0, [pc, #-4092]
^
../../../../ext/fiddle/libffi-3.2.1/src/arm/trampoline.S:3877:9: error: invalid operand for instruction
ldr pc, [pc, #-4092]
^
../../../../ext/fiddle/libffi-3.2.1/src/arm/trampoline.S:3882:17: error: vector register expected
stmfd sp!, {r0-r3}
^
../../../../ext/fiddle/libffi-3.2.1/src/arm/trampoline.S:3887:9: error: invalid operand for instruction
ldr r0, [pc, #-4092]
^
../../../../ext/fiddle/libffi-3.2.1/src/arm/trampoline.S:3890:9: error: invalid operand for instruction
ldr pc, [pc, #-4092]
^
../../../../ext/fiddle/libffi-3.2.1/src/arm/trampoline.S:3895:17: error: vector register expected
stmfd sp!, {r0-r3}
^
../../../../ext/fiddle/libffi-3.2.1/src/arm/trampoline.S:3900:9: error: invalid operand for instruction
ldr r0, [pc, #-4092]
^
../../../../ext/fiddle/libffi-3.2.1/src/arm/trampoline.S:3903:9: error: invalid operand for instruction
ldr pc, [pc, #-4092]
^
../../../../ext/fiddle/libffi-3.2.1/src/arm/trampoline.S:3908:17: error: vector register expected
stmfd sp!, {r0-r3}
^
../../../../ext/fiddle/libffi-3.2.1/src/arm/trampoline.S:3913:9: error: invalid operand for instruction
ldr r0, [pc, #-4092]
^
../../../../ext/fiddle/libffi-3.2.1/src/arm/trampoline.S:3916:9: error: invalid operand for instruction
ldr pc, [pc, #-4092]
^
../../../../ext/fiddle/libffi-3.2.1/src/arm/trampoline.S:3921:17: error: vector register expected
stmfd sp!, {r0-r3}
^
../../../../ext/fiddle/libffi-3.2.1/src/arm/trampoline.S:3926:9: error: invalid operand for instruction
ldr r0, [pc, #-4092]
^
../../../../ext/fiddle/libffi-3.2.1/src/arm/trampoline.S:3929:9: error: invalid operand for instruction
ldr pc, [pc, #-4092]
^
../../../../ext/fiddle/libffi-3.2.1/src/arm/trampoline.S:3934:17: error: vector register expected
stmfd sp!, {r0-r3}
^
../../../../ext/fiddle/libffi-3.2.1/src/arm/trampoline.S:3939:9: error: invalid operand for instruction
ldr r0, [pc, #-4092]
^
../../../../ext/fiddle/libffi-3.2.1/src/arm/trampoline.S:3942:9: error: invalid operand for instruction
ldr pc, [pc, #-4092]
^
../../../../ext/fiddle/libffi-3.2.1/src/arm/trampoline.S:3947:17: error: vector register expected
stmfd sp!, {r0-r3}
^
../../../../ext/fiddle/libffi-3.2.1/src/arm/trampoline.S:3952:9: error: invalid operand for instruction
ldr r0, [pc, #-4092]
^
../../../../ext/fiddle/libffi-3.2.1/src/arm/trampoline.S:3955:9: error: invalid operand for instruction
ldr pc, [pc, #-4092]
^
../../../../ext/fiddle/libffi-3.2.1/src/arm/trampoline.S:3960:17: error: vector register expected
stmfd sp!, {r0-r3}
^
../../../../ext/fiddle/libffi-3.2.1/src/arm/trampoline.S:3965:9: error: invalid operand for instruction
ldr r0, [pc, #-4092]
^
../../../../ext/fiddle/libffi-3.2.1/src/arm/trampoline.S:3968:9: error: invalid operand for instruction
ldr pc, [pc, #-4092]
^
../../../../ext/fiddle/libffi-3.2.1/src/arm/trampoline.S:3973:17: error: vector register expected
stmfd sp!, {r0-r3}
^
../../../../ext/fiddle/libffi-3.2.1/src/arm/trampoline.S:3978:9: error: invalid operand for instruction
ldr r0, [pc, #-4092]
^
../../../../ext/fiddle/libffi-3.2.1/src/arm/trampoline.S:3981:9: error: invalid operand for instruction
ldr pc, [pc, #-4092]
^
../../../../ext/fiddle/libffi-3.2.1/src/arm/trampoline.S:3986:17: error: vector register expected
stmfd sp!, {r0-r3}
^
../../../../ext/fiddle/libffi-3.2.1/src/arm/trampoline.S:3991:9: error: invalid operand for instruction
ldr r0, [pc, #-4092]
^
../../../../ext/fiddle/libffi-3.2.1/src/arm/trampoline.S:3994:9: error: invalid operand for instruction
ldr pc, [pc, #-4092]
^
../../../../ext/fiddle/libffi-3.2.1/src/arm/trampoline.S:3999:17: error: vector register expected
stmfd sp!, {r0-r3}
^
../../../../ext/fiddle/libffi-3.2.1/src/arm/trampoline.S:4004:9: error: invalid operand for instruction
ldr r0, [pc, #-4092]
^
../../../../ext/fiddle/libffi-3.2.1/src/arm/trampoline.S:4007:9: error: invalid operand for instruction
ldr pc, [pc, #-4092]
^
../../../../ext/fiddle/libffi-3.2.1/src/arm/trampoline.S:4012:17: error: vector register expected
stmfd sp!, {r0-r3}
^
../../../../ext/fiddle/libffi-3.2.1/src/arm/trampoline.S:4017:9: error: invalid operand for instruction
ldr r0, [pc, #-4092]
^
../../../../ext/fiddle/libffi-3.2.1/src/arm/trampoline.S:4020:9: error: invalid operand for instruction
ldr pc, [pc, #-4092]
^
../../../../ext/fiddle/libffi-3.2.1/src/arm/trampoline.S:4025:17: error: vector register expected
stmfd sp!, {r0-r3}
^
../../../../ext/fiddle/libffi-3.2.1/src/arm/trampoline.S:4030:9: error: invalid operand for instruction
ldr r0, [pc, #-4092]
^
../../../../ext/fiddle/libffi-3.2.1/src/arm/trampoline.S:4033:9: error: invalid operand for instruction
ldr pc, [pc, #-4092]
^
../../../../ext/fiddle/libffi-3.2.1/src/arm/trampoline.S:4038:17: error: vector register expected
stmfd sp!, {r0-r3}
^
../../../../ext/fiddle/libffi-3.2.1/src/arm/trampoline.S:4043:9: error: invalid operand for instruction
ldr r0, [pc, #-4092]
^
../../../../ext/fiddle/libffi-3.2.1/src/arm/trampoline.S:4046:9: error: invalid operand for instruction
ldr pc, [pc, #-4092]
^
../../../../ext/fiddle/libffi-3.2.1/src/arm/trampoline.S:4051:17: error: vector register expected
stmfd sp!, {r0-r3}
^
../../../../ext/fiddle/libffi-3.2.1/src/arm/trampoline.S:4056:9: error: invalid operand for instruction
ldr r0, [pc, #-4092]
^
../../../../ext/fiddle/libffi-3.2.1/src/arm/trampoline.S:4059:9: error: invalid operand for instruction
ldr pc, [pc, #-4092]
^
../../../../ext/fiddle/libffi-3.2.1/src/arm/trampoline.S:4064:17: error: linking shared-object vector register expected
pathname.bundle
stmfd sp!, {r0-r3}
^
../../../../ext/fiddle/libffi-3.2.1/src/arm/trampoline.S:4069:9: error: invalid operand for instruction
ldr r0, [pc, #-4092]
^
../../../../ext/fiddle/libffi-3.2.1/src/arm/trampoline.S:4072:9: error: invalid operand for instruction
ldr pc, [pc, #-4092]
^
../../../../ext/fiddle/libffi-3.2.1/src/arm/trampoline.S:4077:17: error: vector register expected
stmfd sp!, {r0-r3}
^
../../../../ext/fiddle/libffi-3.2.1/src/arm/trampoline.S:4082:9: error: invalid operand for instruction
ldr r0, [pc, #-4092]
^
../../../../ext/fiddle/libffi-3.2.1/src/arm/trampoline.S:4085:9: error: invalid operand for instruction
ldr pc, [pc, #-4092]
^
../../../../ext/fiddle/libffi-3.2.1/src/arm/trampoline.S:4090:17: error: vector register expected
stmfd sp!, {r0-r3}
^
../../../../ext/fiddle/libffi-3.2.1/src/arm/trampoline.S:4095:9: error: invalid operand for instruction
ldr r0, [pc, #-4092]
^
../../../../ext/fiddle/libffi-3.2.1/src/arm/trampoline.S:4098:9: error: invalid operand for instruction
ldr pc, [pc, #-4092]
^
../../../../ext/fiddle/libffi-3.2.1/src/arm/trampoline.S:4103:17: error: vector register expected
stmfd sp!, {r0-r3}
^
../../../../ext/fiddle/libffi-3.2.1/src/arm/trampoline.S:4108:9: error: invalid operand for instruction
ldr r0, [pc, #-4092]
^
../../../../ext/fiddle/libffi-3.2.1/src/arm/trampoline.S:4111:9: error: invalid operand for instruction
ldr pc, [pc, #-4092]
^
../../../../ext/fiddle/libffi-3.2.1/src/arm/trampoline.S:4116:17: error: vector register expected
stmfd sp!, {r0-r3}
^
../../../../ext/fiddle/libffi-3.2.1/src/arm/trampoline.S:4121:9: error: invalid operand for instruction
ldr r0, [pc, #-4092]
^
../../../../ext/fiddle/libffi-3.2.1/src/arm/trampoline.S:4124:9: error: invalid operand for instruction
ldr pc, [pc, #-4092]
^
../../../../ext/fiddle/libffi-3.2.1/src/arm/trampoline.S:4129:17: error: vector register expected
stmfd sp!, {r0-r3}
^
../../../../ext/fiddle/libffi-3.2.1/src/arm/trampoline.S:4134:9: error: invalid operand for instruction
ldr r0, [pc, #-4092]
^
../../../../ext/fiddle/libffi-3.2.1/src/arm/trampoline.S:4137:9: error: invalid operand for instruction
ldr pc, [pc, #-4092]
^
../../../../ext/fiddle/libffi-3.2.1/src/arm/trampoline.S:4142:17: error: vector register expected
stmfd sp!, {r0-r3}
^
../../../../ext/fiddle/libffi-3.2.1/src/arm/trampoline.S:4147:9: error: invalid operand for instruction
ldr r0, [pc, #-4092]
^
../../../../ext/fiddle/libffi-3.2.1/src/arm/trampoline.S:4150:9: error: invalid operand for instruction
ldr pc, [pc, #-4092]
^
../../../../ext/fiddle/libffi-3.2.1/src/arm/trampoline.S:4155:17: error: vector register expected
stmfd sp!, {r0-r3}
^
../../../../ext/fiddle/libffi-3.2.1/src/arm/trampoline.S:4160:9: error: invalid operand for instruction
ldr r0, [pc, #-4092]
^
../../../../ext/fiddle/libffi-3.2.1/src/arm/trampoline.S:4163:9: error: invalid operand for instruction
ldr pc, [pc, #-4092]
^
../../../../ext/fiddle/libffi-3.2.1/src/arm/trampoline.S:4168:17: error: vector register expected
stmfd sp!, {r0-r3}
^
../../../../ext/fiddle/libffi-3.2.1/src/arm/trampoline.S:4173:9: error: invalid operand for instruction
ldr r0, [pc, #-4092]
^
../../../../ext/fiddle/libffi-3.2.1/src/arm/trampoline.S:4176:9: error: invalid operand for instruction
ldr pc, [pc, #-4092]
^
../../../../ext/fiddle/libffi-3.2.1/src/arm/trampoline.S:4181:17: error: vector register expected
stmfd sp!, {r0-r3}
^
../../../../ext/fiddle/libffi-3.2.1/src/arm/trampoline.S:4186:9: error: invalid operand for instruction
ldr r0, [pc, #-4092]
^
../../../../ext/fiddle/libffi-3.2.1/src/arm/trampoline.S:4189:9: error: invalid operand for instruction
ldr pc, [pc, #-4092]
^
../../../../ext/fiddle/libffi-3.2.1/src/arm/trampoline.S:4194:17: error: vector register expected
stmfd sp!, {r0-r3}
^
../../../../ext/fiddle/libffi-3.2.1/src/arm/trampoline.S:4199:9: error: invalid operand for instruction
ldr r0, [pc, #-4092]
^
../../../../ext/fiddle/libffi-3.2.1/src/arm/trampoline.S:4202:9: error: invalid operand for instruction
ldr pc, [pc, #-4092]
^
../../../../ext/fiddle/libffi-3.2.1/src/arm/trampoline.S:4207:17: error: vector register expected
stmfd sp!, {r0-r3}
^
../../../../ext/fiddle/libffi-3.2.1/src/arm/trampoline.S:4212:9: error: invalid operand for instruction
ldr r0, [pc, #-4092]
^
../../../../ext/fiddle/libffi-3.2.1/src/arm/trampoline.S:4215:9: error: invalid operand for instruction
ldr pc, [pc, #-4092]
^
../../../../ext/fiddle/libffi-3.2.1/src/arm/trampoline.S:4220:17: error: vector register expected
stmfd sp!, {r0-r3}
^
../../../../ext/fiddle/libffi-3.2.1/src/arm/trampoline.S:4225:9: error: invalid operand for instruction
ldr r0, [pc, #-4092]
^
../../../../ext/fiddle/libffi-3.2.1/src/arm/trampoline.S:4228:9: error: invalid operand for instruction
ldr pc, [pc, #-4092]
^
../../../../ext/fiddle/libffi-3.2.1/src/arm/trampoline.S:4233:17: error: vector register expected
stmfd sp!, {r0-r3}
^
../../../../ext/fiddle/libffi-3.2.1/src/arm/trampoline.S:4238:9: error: invalid operand for instruction
ldr r0, [pc, #-4092]
^
../../../../ext/fiddle/libffi-3.2.1/src/arm/trampoline.S:4241:9: error: invalid operand for instruction
ldr pc, [pc, #-4092]
^
../../../../ext/fiddle/libffi-3.2.1/src/arm/trampoline.S:4246:17: error: vector register expected
stmfd sp!, {r0-r3}