Skip to content

Instantly share code, notes, and snippets.

@jenhsun jenhsun/config.log
Created Sep 20, 2014

Embed
What would you like to do?
rbenv installation output
This file contains any messages produced by compilers while
running configure, to aid debugging if configure makes a mistake.
It was created by configure, which was
generated by GNU Autoconf 2.69. Invocation command line was
$ ./configure --prefix=/usr/local/var/rbenv/versions/2.1.3 --with-openssl-dir=/usr/local/opt/openssl --with-readline-dir=/usr/local/opt/readline
## --------- ##
## Platform. ##
## --------- ##
hostname = localhost
uname -m = x86_64
uname -r = 13.4.0
uname -s = Darwin
uname -v = Darwin Kernel Version 13.4.0: Sun Aug 17 19:50:11 PDT 2014; root:xnu-2422.115.4~1/RELEASE_X86_64
/usr/bin/uname -p = i386
/bin/uname -X = unknown
/bin/arch = unknown
/usr/bin/arch -k = unknown
/usr/convex/getsysinfo = unknown
/usr/bin/hostinfo = Mach kernel version:
Darwin Kernel Version 13.4.0: Sun Aug 17 19:50:11 PDT 2014; root:xnu-2422.115.4~1/RELEASE_X86_64
Kernel configured for up to 2 processors.
2 processors are physically available.
2 processors are logically available.
Processor type: i486 (Intel 80486)
Processors active: 0 1
Primary memory available: 8.00 gigabytes
Default processor set: 168 tasks, 774 threads, 2 processors
Load average: 1.31, Mach factor: 0.73
/bin/machine = unknown
/usr/bin/oslevel = unknown
/bin/universe = unknown
PATH: /usr/local/Cellar/rbenv/0.4.0/libexec
PATH: /Users/jenhsun/.rbenv/bin
PATH: ~/bin
PATH: /usr/local/bin
PATH: /usr/bin
PATH: /bin
PATH: /usr/sbin
PATH: /sbin
PATH: /usr/local/sbin
PATH: /usr/local/lib/node_modules/npm/bin
PATH: /usr/bin
PATH: /bin
PATH: /usr/sbin
PATH: /sbin
PATH: /usr/local/bin
PATH: /opt/X11/bin
PATH: /usr/local/MacGPG2/bin
PATH: /usr/texbin
PATH: /Users/jenhsun/.rbenv/bin
PATH: ~/bin
PATH: /usr/local/sbin
PATH: /usr/local/lib/node_modules/npm/bin
## ----------- ##
## Core tests. ##
## ----------- ##
configure:2904: checking build system type
configure:2918: result: x86_64-apple-darwin13.4.0
configure:3018: checking host system type
configure:3031: result: x86_64-apple-darwin13.4.0
configure:3051: checking target system type
configure:3064: result: x86_64-apple-darwin13.4.0
configure:3800: checking for C compiler version
configure:3809: /usr/bin/gcc --version >&5
gcc (Homebrew gcc 4.9.1) 4.9.1
Copyright (C) 2014 Free Software Foundation, Inc.
This is free software; see the source for copying conditions. There is NO
warranty; not even for MERCHANTABILITY or FITNESS FOR A PARTICULAR PURPOSE.
configure:3820: $? = 0
configure:3809: /usr/bin/gcc -v >&5
Using built-in specs.
COLLECT_GCC=/usr/bin/gcc
COLLECT_LTO_WRAPPER=/usr/local/Cellar/gcc/4.9.1/libexec/gcc/x86_64-apple-darwin13.3.0/4.9.1/lto-wrapper
Target: x86_64-apple-darwin13.3.0
Configured with: ../configure --build=x86_64-apple-darwin13.3.0 --prefix=/usr/local/Cellar/gcc/4.9.1 --enable-languages=c,c++,objc,obj-c++,fortran --program-suffix=-4.9 --with-gmp=/usr/local/opt/gmp --with-mpfr=/usr/local/opt/mpfr --with-mpc=/usr/local/opt/libmpc --with-cloog=/usr/local/opt/cloog --with-isl=/usr/local/opt/isl --with-system-zlib --enable-version-specific-runtime-libs --enable-libstdcxx-time=yes --enable-stage1-checking --enable-checking=release --enable-lto --disable-werror --with-pkgversion='Homebrew gcc 4.9.1' --with-bugurl=https://github.com/Homebrew/homebrew/issues --enable-plugin --disable-nls --enable-multilib
Thread model: posix
gcc version 4.9.1 (Homebrew gcc 4.9.1)
configure:3820: $? = 0
configure:3809: /usr/bin/gcc -V >&5
gcc: error: unrecognized command line option '-V'
gcc: fatal error: no input files
compilation terminated.
configure:3820: $? = 1
configure:3809: /usr/bin/gcc -qversion >&5
gcc: error: unrecognized command line option '-qversion'
gcc: fatal error: no input files
compilation terminated.
configure:3820: $? = 1
configure:3840: checking whether the C compiler works
configure:3862: /usr/bin/gcc -I/usr/local/var/rbenv/versions/2.1.3/include -L/usr/local/var/rbenv/versions/2.1.3/lib -Wl,-rpath='/usr/local/lib',--enable-new-dtags -Wl,-rpath='/usr/local/lib',--enable-new-dtags conftest.c >&5
ld: unknown option: -rpath='/usr/local/lib'
collect2: error: ld returned 1 exit status
configure:3866: $? = 1
configure:3904: result: no
configure: failed program was:
| /* confdefs.h */
| #define PACKAGE_NAME ""
| #define PACKAGE_TARNAME ""
| #define PACKAGE_VERSION ""
| #define PACKAGE_STRING ""
| #define PACKAGE_BUGREPORT ""
| #define PACKAGE_URL ""
| #define CANONICALIZATION_FOR_MATHN 1
| /* end confdefs.h. */
|
| int
| main ()
| {
|
| ;
| return 0;
| }
configure:3909: error: in `/var/folders/nm/h4t34dwx51b51r4qt2l81szr0000gn/T/ruby-build.20140921001502.27325/ruby-2.1.3':
configure:3911: error: C compiler cannot create executables
See `config.log' for more details
## ---------------- ##
## Cache variables. ##
## ---------------- ##
ac_cv_build=x86_64-apple-darwin13.4.0
ac_cv_env_CCC_set=
ac_cv_env_CCC_value=
ac_cv_env_CC_set=set
ac_cv_env_CC_value=/usr/bin/gcc
ac_cv_env_CFLAGS_set=
ac_cv_env_CFLAGS_value=
ac_cv_env_CPPFLAGS_set=set
ac_cv_env_CPPFLAGS_value='-I/usr/local/var/rbenv/versions/2.1.3/include '
ac_cv_env_CPP_set=
ac_cv_env_CPP_value=
ac_cv_env_CXXFLAGS_set=
ac_cv_env_CXXFLAGS_value=
ac_cv_env_CXX_set=
ac_cv_env_CXX_value=
ac_cv_env_LDFLAGS_set=set
ac_cv_env_LDFLAGS_value='-L/usr/local/var/rbenv/versions/2.1.3/lib -Wl,-rpath='\''/usr/local/lib'\'',--enable-new-dtags -Wl,-rpath='\''/usr/local/lib'\'',--enable-new-dtags '
ac_cv_env_LIBS_set=
ac_cv_env_LIBS_value=
ac_cv_env_build_alias_set=
ac_cv_env_build_alias_value=
ac_cv_env_host_alias_set=
ac_cv_env_host_alias_value=
ac_cv_env_target_alias_set=
ac_cv_env_target_alias_value=
ac_cv_host=x86_64-apple-darwin13.4.0
ac_cv_prog_CC=/usr/bin/gcc
ac_cv_prog_CXX=g++
ac_cv_target=x86_64-apple-darwin13.4.0
## ----------------- ##
## Output variables. ##
## ----------------- ##
ALLOCA=''
AR=''
ARCHFILE=''
ARCH_FLAG=''
AS=''
ASFLAGS=''
BASERUBY='ruby --disable=gems'
BTESTRUBY=''
BUILTIN_ENCOBJS=''
BUILTIN_TRANSOBJS=''
BUILTIN_TRANSSRCS=''
CAPITARGET=''
CC='/usr/bin/gcc'
CCDLFLAGS=''
CC_VERSION=''
CFLAGS=''
CHDIR=''
COMMON_HEADERS=''
COMMON_LIBS=''
COMMON_MACROS=''
COUTFLAG=''
CP=''
CPP=''
CPPFLAGS='-I/usr/local/var/rbenv/versions/2.1.3/include '
CPPOUTFILE=''
CROSS_COMPILING=''
CXX='g++'
CXXFLAGS=''
DEFS=''
DLDFLAGS=''
DLDLIBS=''
DLEXT2=''
DLEXT=''
DLLWRAP=''
DLNOBJ=''
DOT=''
DOXYGEN=''
DTRACE=''
DTRACE_EXT=''
DTRACE_GLOMMED_OBJ=''
DTRACE_OBJ=''
ECHO_C='\c'
ECHO_N=''
ECHO_T=''
EGREP=''
ENABLE_SHARED=''
ENCOBJS=''
EXECUTABLE_EXTS=''
EXEEXT=''
EXPORT_PREFIX=''
EXTDLDFLAGS=''
EXTLDFLAGS=''
EXTOBJS=''
EXTOUT=''
EXTSTATIC=''
GCC=''
GNU_LD=''
GREP=''
INSTALLDOC=''
INSTALL_DATA=''
INSTALL_PROGRAM=''
INSTALL_SCRIPT=''
LD=''
LDFLAGS='-L/usr/local/var/rbenv/versions/2.1.3/lib -Wl,-rpath='\''/usr/local/lib'\'',--enable-new-dtags -Wl,-rpath='\''/usr/local/lib'\'',--enable-new-dtags '
LDSHARED=''
LDSHAREDXX=''
LIBEXT=''
LIBOBJS=''
LIBPATHENV=''
LIBPATHFLAG=''
LIBRUBY=''
LIBRUBYARG=''
LIBRUBYARG_SHARED=''
LIBRUBYARG_STATIC=''
LIBRUBY_A=''
LIBRUBY_ALIASES=''
LIBRUBY_A_OBJS=''
LIBRUBY_DLDFLAGS=''
LIBRUBY_LDSHARED=''
LIBRUBY_RELATIVE=''
LIBRUBY_SO=''
LIBS=''
LINK_SO=''
LN_S=''
LTLIBOBJS=''
MAINLIBS=''
MAJOR='2'
MAKEDIRS=''
MAKEFILES=''
MANTYPE=''
MINIOBJS=''
MINIRUBY=''
MINOR='1'
MKDIR_P=''
NACL_SDK_ROOT=''
NACL_SDK_VARIANT=''
NACL_TOOLCHAIN=''
NM=''
NROFF=''
NULLCMD=''
OBJCOPY=''
OBJDUMP=''
OBJEXT=''
OUTFLAG=''
PACKAGE=''
PACKAGE_BUGREPORT=''
PACKAGE_NAME=''
PACKAGE_STRING=''
PACKAGE_TARNAME=''
PACKAGE_URL=''
PACKAGE_VERSION=''
PATH_SEPARATOR=':'
PKG_CONFIG=''
PLATFORM_DIR=''
POSTLINK=''
PREP=''
PYTHON=''
RANLIB=''
RDOCTARGET=''
RI_BASE_NAME=''
RM=''
RMALL=''
RMDIR=''
RMDIRS=''
RPATHFLAG=''
RUBYW_BASE_NAME='rubyw'
RUBYW_INSTALL_NAME=''
RUBY_BASE_NAME='ruby'
RUBY_EXEC_PREFIX=''
RUBY_INSTALL_NAME=''
RUBY_LIB_VERSION=''
RUBY_LIB_VERSION_STYLE=''
RUBY_PROGRAM_VERSION='2.1.3'
RUBY_RELEASE_DATE='2014-09-19'
RUBY_SEARCH_PATH=''
RUBY_SO_NAME=''
RUBY_VERSION_NAME='${RUBY_BASE_NAME}-${ruby_version}'
RUNRUBY=''
RUNRUBY_COMMAND=''
SET_MAKE=''
SHELL='/bin/sh'
SOLIBS=''
STATIC=''
STRIP=''
SYMBOL_PREFIX=''
TEENY='0'
TEST_RUNNABLE=''
THREAD_MODEL=''
TRY_LINK=''
UNIVERSAL_ARCHNAMES=''
UNIVERSAL_INTS=''
USE_RUBYGEMS=''
WERRORFLAG=''
WINDRES=''
XCFLAGS=''
XLDFLAGS=''
XRUBY=''
XRUBY_LIBDIR=''
XRUBY_RUBYHDRDIR=''
XRUBY_RUBYLIBDIR=''
ac_ct_CC=''
ac_ct_CXX=''
ac_ct_OBJCOPY=''
ac_ct_OBJDUMP=''
arch=''
archincludedir=''
archlibdir=''
bindir='${exec_prefix}/bin'
build='x86_64-apple-darwin13.4.0'
build_alias=''
build_cpu='x86_64'
build_os='darwin13.4.0'
build_vendor='apple'
cflags=' ${optflags} ${debugflags} ${warnflags}'
codesign=''
configure_args=''
cppflags=''
cxxflags=' ${optflags} ${debugflags} ${warnflags}'
datadir='${datarootdir}'
datarootdir='${prefix}/share'
debugflags=''
docdir='${datarootdir}/doc/${PACKAGE}'
dvidir='${docdir}'
exec=''
exec_prefix='NONE'
host='x86_64-apple-darwin13.4.0'
host_alias=''
host_cpu='x86_64'
host_os='darwin13.4.0'
host_vendor='apple'
htmldir='${docdir}'
includedir='${prefix}/include'
infodir='${datarootdir}/info'
libdir='${exec_prefix}/lib'
libdirname=''
libexecdir='${exec_prefix}/libexec'
localedir='${datarootdir}/locale'
localstatedir='${prefix}/var'
mandir='${datarootdir}/man'
oldincludedir='/usr/include'
optflags=''
pdfdir='${docdir}'
prefix='/usr/local/var/rbenv/versions/2.1.3'
program_transform_name='s&^&&'
psdir='${docdir}'
ridir=''
ruby_pc=''
ruby_version=''
rubyarchdir=''
rubyarchhdrdir=''
rubyarchprefix=''
rubyhdrdir=''
rubylibdir=''
rubylibprefix=''
rubysitearchprefix=''
rubyw_install_name=''
sbindir='${exec_prefix}/sbin'
setup=''
sharedstatedir='${prefix}/com'
sitearch=''
sitearchdir=''
sitearchhdrdir=''
sitearchincludedir=''
sitearchlibdir=''
sitedir=''
sitehdrdir=''
sitelibdir=''
strict_warnflags=''
sysconfdir='${prefix}/etc'
target='x86_64-apple-darwin13.0'
target_alias=''
target_cpu='x86_64'
target_os='darwin13.0'
target_vendor='apple'
try_header=''
vendorarchdir=''
vendorarchhdrdir=''
vendordir=''
vendorhdrdir=''
vendorlibdir=''
warnflags=''
## ----------- ##
## confdefs.h. ##
## ----------- ##
/* confdefs.h */
#define PACKAGE_NAME ""
#define PACKAGE_TARNAME ""
#define PACKAGE_VERSION ""
#define PACKAGE_STRING ""
#define PACKAGE_BUGREPORT ""
#define PACKAGE_URL ""
#define CANONICALIZATION_FOR_MATHN 1
configure: exit 77
Sign up for free to join this conversation on GitHub. Already have an account? Sign in to comment
You can’t perform that action at this time.