Skip to content

Instantly share code, notes, and snippets.

Embed
What would you like to do?
2020-09-18T15:40:12.3044466Z Interface loading tests
2020-09-18T15:40:12.3046244Z iface-error-test-1: FAIL
2020-09-18T15:40:12.3059676Z Exception: NamedParserException "NotificationMessage ServerMethod PublishDiagnosticsParams" (NamedParserException "NotificationMessage ServerMethod PublishDiagnosticsParams" (NamedParserException "NotificationMessage ServerMethod PublishDiagnosticsParams" (NamedParserException "NotificationMessage ServerMethod PublishDiagnosticsParams" (NamedParserException "NotificationMessage ServerMethod PublishDiagnosticsParams" (NamedParserException "NotificationMessage ServerMethod PublishDiagnosticsParams" (NamedParserException "NotificationMessage ServerMethod PublishDiagnosticsParams" (NamedParserException "NotificationMessage ServerMethod PublishDiagnosticsParams" (NamedParserException "NotificationMessage ServerMethod PublishDiagnosticsParams" (NamedParserException "NotificationMessage ServerMethod PublishDiagnosticsParams" (NamedParserException "NotificationMessage ServerMethod PublishDiagnosticsParams" (NamedParserException "NotificationMessage ServerMethod PublishDiagnosticsParams" (NamedParserException "NotificationMessage ServerMethod PublishDiagnosticsParams" (NamedParserException "NotificationMessage ServerMethod PublishDiagnosticsParams" (NamedParserException "NotificationMessage ServerMethod PublishDiagnosticsParams" (NamedParserException "NotificationMessage ServerMethod PublishDiagnosticsParams" (NamedParserException "NotificationMessage ServerMethod PublishDiagnosticsParams" (NamedParserException "NotificationMessage ServerMethod PublishDiagnosticsParams" (NamedParserException "NotificationMessage ServerMethod PublishDiagnosticsParams" (NamedParserException "NotificationMessage ServerMethod PublishDiagnosticsParams" (NamedParserException "NotificationMessage ServerMethod PublishDiagnosticsParams" (NamedParserException "NotificationMessage ServerMethod PublishDiagnosticsParams" (NamedParserException "NotificationMessage ServerMethod PublishDiagnosticsParams" (NamedParserException "NotificationMessage ServerMethod PublishDiagnosticsParams" (NamedParserException "NotificationMessage ServerMethod PublishDiagnosticsParams" (NamedParserException "NotificationMessage ServerMethod PublishDiagnosticsParams" (NamedParserException "Response for id: IdInt 1" (NamedParserException "NotificationMessage ServerMethod (ProgressParams WorkDoneProgressBeginParams)" (NamedParserException "RequestMessage ServerMethod WorkDoneProgressCreateParams ()" (BothFailed (NamedParserException "NotificationMessage ServerMethod PublishDiagnosticsParams" (NamedParserException "NotificationMessage ServerMethod PublishDiagnosticsParams" (NamedParserException "NotificationMessage ServerMethod PublishDiagnosticsParams" (NamedParserException "NotificationMessage ServerMethod PublishDiagnosticsParams" (NamedParserException "NotificationMessage ServerMethod PublishDiagnosticsParams" (NamedParserException "NotificationMessage ServerMethod PublishDiagnosticsParams" (NamedParserException "NotificationMessage ServerMethod PublishDiagnosticsParams" (NamedParserException "NotificationMessage ServerMethod PublishDiagnosticsParams" (NamedParserException "NotificationMessage ServerMethod PublishDiagnosticsParams" (NamedParserException "NotificationMessage ServerMethod PublishDiagnosticsParams" (NamedParserException "NotificationMessage ServerMethod PublishDiagnosticsParams" (NamedParserException "NotificationMessage ServerMethod PublishDiagnosticsParams" (NamedParserException "NotificationMessage ServerMethod PublishDiagnosticsParams" (NamedParserException "NotificationMessage ServerMethod PublishDiagnosticsParams" (NamedParserException "NotificationMessage ServerMethod PublishDiagnosticsParams" (NamedParserException "NotificationMessage ServerMethod PublishDiagnosticsParams" (NamedParserException "NotificationMessage ServerMethod PublishDiagnosticsParams" (NamedParserException "NotificationMessage ServerMethod PublishDiagnosticsParams" (NamedParserException "NotificationMessage ServerMethod PublishDiagnosticsParams" (NamedParserException "NotificationMessage ServerMethod PublishDiagnosticsParams" (NamedParserException "NotificationMessage ServerMethod PublishDiagnosticsParams" (NamedParserException "NotificationMessage ServerMethod PublishDiagnosticsParams" (NamedParserException "NotificationMessage ServerMethod PublishDiagnosticsParams" (NamedParserException "NotificationMessage ServerMethod PublishDiagnosticsParams" (NamedParserException "NotificationMessage ServerMethod PublishDiagnosticsParams" (NamedParserException "NotificationMessage ServerMethod PublishDiagnosticsParams" (NamedParserException "Response for id: IdInt 1" (NamedParserException "NotificationMessage ServerMethod (ProgressParams WorkDoneProgressBeginParams)" (BothFailed (Unexpected "ConduitParser.empty") (Unexpected "ConduitParser.empty")))))))))))))))))))))))))))))) (Unexpected "ConduitParser.empty"))))))))))))))))))))))))))))))
2020-09-18T15:26:56.7632888Z ##[section]Starting: stack test --ghc-options=-Werror
2020-09-18T15:26:56.7643077Z ==============================================================================
2020-09-18T15:26:56.7643848Z Task : Bash
2020-09-18T15:26:56.7644312Z Description : Run a Bash script on macOS, Linux, or Windows
2020-09-18T15:26:56.7644794Z Version : 3.171.1
2020-09-18T15:26:56.7645328Z Author : Microsoft Corporation
2020-09-18T15:26:56.7645861Z Help : https://docs.microsoft.com/azure/devops/pipelines/tasks/utility/bash
2020-09-18T15:26:56.7646445Z ==============================================================================
2020-09-18T15:26:56.8963771Z Generating script.
2020-09-18T15:26:56.8989494Z ========================== Starting Command Output ===========================
2020-09-18T15:26:56.9007277Z [command]/bin/bash --noprofile --norc /home/vsts/work/_temp/7160cb80-1219-43fa-9a9d-2667bad92d2c.sh
2020-09-18T15:26:57.4646704Z Building all executables for `ghcide' once. After a successful build of all of them, only specified executables will be rebuilt.
2020-09-18T15:26:57.4649202Z ghcide> configure (lib + exe + test)
2020-09-18T15:26:58.3425069Z Configuring ghcide-0.4.0...
2020-09-18T15:26:58.7214101Z ghcide> build (lib + exe + test)
2020-09-18T15:26:58.8274667Z Preprocessing executable 'ghcide-test-preprocessor' for ghcide-0.4.0..
2020-09-18T15:26:58.8275720Z Building executable 'ghcide-test-preprocessor' for ghcide-0.4.0..
2020-09-18T15:26:58.9403322Z [1 of 1] Compiling Main
2020-09-18T15:26:59.2856076Z Linking .stack-work/dist/x86_64-linux/Cabal-3.0.1.0/build/ghcide-test-preprocessor/ghcide-test-preprocessor ...
2020-09-18T15:26:59.7814756Z Preprocessing library for ghcide-0.4.0..
2020-09-18T15:26:59.7816763Z Building library for ghcide-0.4.0..
2020-09-18T15:27:00.1969995Z [ 1 of 53] Compiling Development.IDE.Compat
2020-09-18T15:27:00.2800956Z [ 2 of 53] Compiling Development.IDE.Core.Debouncer
2020-09-18T15:27:00.7727335Z [ 3 of 53] Compiling Development.IDE.Core.PositionMapping
2020-09-18T15:27:01.7630973Z [ 4 of 53] Compiling Development.IDE.GHC.HieAst
2020-09-18T15:27:14.2577108Z [ 5 of 53] Compiling Development.IDE.GHC.HieBin
2020-09-18T15:27:16.0807308Z [ 6 of 53] Compiling Development.IDE.GHC.Compat
2020-09-18T15:27:16.6557105Z [ 7 of 53] Compiling Development.IDE.GHC.CPP
2020-09-18T15:27:17.1959704Z [ 8 of 53] Compiling Development.IDE.GHC.WithDynFlags
2020-09-18T15:27:17.3793748Z [ 9 of 53] Compiling Development.IDE.Plugin.CodeAction.PositionIndexed
2020-09-18T15:27:17.5266054Z [10 of 53] Compiling Development.IDE.Session.VersionCheck
2020-09-18T15:27:17.6945282Z [11 of 53] Compiling Development.IDE.Spans.Common
2020-09-18T15:27:18.7768842Z [12 of 53] Compiling Development.IDE.Plugin.Completions.Types
2020-09-18T15:27:19.3379716Z [13 of 53] Compiling Development.IDE.Types.Location
2020-09-18T15:27:19.5488050Z [14 of 53] Compiling Development.IDE.Types.Diagnostics
2020-09-18T15:27:19.7870929Z [15 of 53] Compiling Development.IDE.LSP.Protocol
2020-09-18T15:27:19.8496303Z [16 of 53] Compiling Development.IDE.GHC.Util
2020-09-18T15:27:20.6740311Z [17 of 53] Compiling Development.IDE.Types.Exports
2020-09-18T15:27:23.2714471Z [18 of 53] Compiling Development.IDE.Spans.Type
2020-09-18T15:27:23.5610875Z [19 of 53] Compiling Development.IDE.Plugin.CodeAction.RuleTypes
2020-09-18T15:27:23.7483010Z [20 of 53] Compiling Development.IDE.GHC.Orphans
2020-09-18T15:27:24.0477073Z [21 of 53] Compiling Development.IDE.GHC.Error
2020-09-18T15:27:24.5222039Z [22 of 53] Compiling Development.IDE.Import.FindImports
2020-09-18T15:27:24.9208482Z [23 of 53] Compiling Development.IDE.Import.DependencyInformation
2020-09-18T15:27:27.4795447Z [24 of 53] Compiling Development.IDE.GHC.Warnings
2020-09-18T15:27:27.6833846Z [25 of 53] Compiling Development.IDE.Core.Preprocessor
2020-09-18T15:27:28.6042773Z [26 of 53] Compiling Development.IDE.Types.Logger
2020-09-18T15:27:28.9667699Z [27 of 53] Compiling Development.IDE.Types.Action
2020-09-18T15:27:29.4485331Z [28 of 53] Compiling Development.IDE.Types.Options
2020-09-18T15:27:31.4349942Z [29 of 53] Compiling Development.IDE.Spans.AtPoint
2020-09-18T15:27:32.9562018Z [30 of 53] Compiling Development.IDE.Core.Shake
2020-09-18T15:27:40.7421480Z [31 of 53] Compiling Development.IDE.Core.RuleTypes
2020-09-18T15:27:43.1901383Z [32 of 53] Compiling Development.IDE.Core.OfInterest
2020-09-18T15:27:43.7018969Z [33 of 53] Compiling Development.IDE.Session
2020-09-18T15:27:48.9938966Z [34 of 53] Compiling Development.IDE.Core.IdeConfiguration
2020-09-18T15:27:49.6806644Z [35 of 53] Compiling Development.IDE.Core.FileStore
2020-09-18T15:27:50.6568024Z [36 of 53] Compiling Development.IDE.Core.FileExists
2020-09-18T15:27:51.8456463Z [37 of 53] Compiling Development.IDE.Core.Service
2020-09-18T15:27:51.9296219Z [38 of 53] Compiling Development.IDE.LSP.Server
2020-09-18T15:27:52.0248803Z [39 of 53] Compiling Development.IDE.LSP.Notifications
2020-09-18T15:27:53.7545017Z [40 of 53] Compiling Development.IDE.Core.Compile
2020-09-18T15:27:56.2030266Z [41 of 53] Compiling Development.IDE.Spans.Documentation
2020-09-18T15:27:57.0154644Z [42 of 53] Compiling Development.IDE.Spans.Calculate
2020-09-18T15:27:59.6023643Z [43 of 53] Compiling Development.IDE.Plugin.Completions.Logic
2020-09-18T15:28:03.5720692Z [44 of 53] Compiling Development.IDE.Core.Rules
2020-09-18T15:28:08.7341900Z [45 of 53] Compiling Development.IDE.Plugin.CodeAction.Rules
2020-09-18T15:28:08.8425299Z [46 of 53] Compiling Development.IDE.Plugin
2020-09-18T15:28:09.0796061Z [47 of 53] Compiling Development.IDE.Plugin.Test
2020-09-18T15:28:10.0463400Z [48 of 53] Compiling Development.IDE.Plugin.Completions
2020-09-18T15:28:10.7738754Z [49 of 53] Compiling Development.IDE.Plugin.CodeAction
2020-09-18T15:28:34.5224320Z [50 of 53] Compiling Development.IDE.LSP.Outline
2020-09-18T15:28:36.5890289Z [51 of 53] Compiling Development.IDE.LSP.HoverDefinition
2020-09-18T15:28:36.8728936Z [52 of 53] Compiling Development.IDE.LSP.LanguageServer
2020-09-18T15:28:37.6398916Z [53 of 53] Compiling Development.IDE
2020-09-18T15:28:39.1424826Z Preprocessing executable 'ghcide' for ghcide-0.4.0..
2020-09-18T15:28:39.1427265Z Building executable 'ghcide' for ghcide-0.4.0..
2020-09-18T15:28:39.2849326Z [1 of 3] Compiling Arguments
2020-09-18T15:28:39.5485901Z [2 of 3] Compiling Paths_ghcide
2020-09-18T15:28:39.6673754Z [3 of 3] Compiling Main
2020-09-18T15:28:42.8843874Z Linking .stack-work/dist/x86_64-linux/Cabal-3.0.1.0/build/ghcide/ghcide ...
2020-09-18T15:28:45.9827039Z Preprocessing executable 'ghcide-bench' for ghcide-0.4.0..
2020-09-18T15:28:45.9829397Z Building executable 'ghcide-bench' for ghcide-0.4.0..
2020-09-18T15:28:46.1057117Z [1 of 2] Compiling Experiments
2020-09-18T15:28:48.6297489Z [2 of 2] Compiling Main
2020-09-18T15:28:49.1027793Z Linking .stack-work/dist/x86_64-linux/Cabal-3.0.1.0/build/ghcide-bench/ghcide-bench ...
2020-09-18T15:28:50.6070592Z Preprocessing test suite 'ghcide-tests' for ghcide-0.4.0..
2020-09-18T15:28:50.6074834Z Building test suite 'ghcide-tests' for ghcide-0.4.0..
2020-09-18T15:28:50.7833920Z [1 of 4] Compiling Development.IDE.Test
2020-09-18T15:28:51.7696317Z [2 of 4] Compiling Development.IDE.Test.Runfiles
2020-09-18T15:28:51.7848062Z [3 of 4] Compiling Experiments
2020-09-18T15:28:52.2311946Z [4 of 4] Compiling Main
2020-09-18T15:28:57.1605722Z Linking .stack-work/dist/x86_64-linux/Cabal-3.0.1.0/build/ghcide-tests/ghcide-tests ...
2020-09-18T15:29:00.5893672Z ghcide> copy/register
2020-09-18T15:29:00.7419564Z Installing executable ghcide-test-preprocessor in /home/vsts/work/1/s/.stack-work/install/x86_64-linux/29854865ecf208e899fd934ddedcbe762bfbad035e026169f8becaea45390175/8.8.4/bin
2020-09-18T15:29:00.7866297Z Installing library in /home/vsts/work/1/s/.stack-work/install/x86_64-linux/29854865ecf208e899fd934ddedcbe762bfbad035e026169f8becaea45390175/8.8.4/lib/x86_64-linux-ghc-8.8.4/ghcide-0.4.0-5BwfxSA6c4g1FPVN22Hrgw
2020-09-18T15:29:01.1285369Z Installing executable ghcide in /home/vsts/work/1/s/.stack-work/install/x86_64-linux/29854865ecf208e899fd934ddedcbe762bfbad035e026169f8becaea45390175/8.8.4/bin
2020-09-18T15:29:01.7541157Z Installing executable ghcide-bench in /home/vsts/work/1/s/.stack-work/install/x86_64-linux/29854865ecf208e899fd934ddedcbe762bfbad035e026169f8becaea45390175/8.8.4/bin
2020-09-18T15:29:02.2432215Z Registering library for ghcide-0.4.0..
2020-09-18T15:29:02.8495946Z ghcide> test (suite: ghcide-tests)
2020-09-18T15:29:02.8497083Z
2020-09-18T15:29:02.8635901Z ghcide
2020-09-18T15:29:02.9520359Z open close: OK (0.09s)
2020-09-18T15:29:02.9536426Z initialize response capabilities
2020-09-18T15:29:02.9804059Z text doc sync: OK
2020-09-18T15:29:02.9806388Z hover: OK
2020-09-18T15:29:02.9808951Z completion: OK
2020-09-18T15:29:02.9809848Z NO signature help: OK
2020-09-18T15:29:02.9810651Z goto definition: OK
2020-09-18T15:29:02.9811402Z goto type definition: OK
2020-09-18T15:29:02.9812159Z NO goto implementation: OK
2020-09-18T15:29:02.9814318Z NO find references: OK
2020-09-18T15:29:02.9816568Z NO doc highlight: OK
2020-09-18T15:29:02.9817452Z doc symbol: OK
2020-09-18T15:29:02.9818749Z NO workspace symbol: OK
2020-09-18T15:29:02.9819801Z code action: OK
2020-09-18T15:29:02.9820668Z code lens: OK
2020-09-18T15:29:02.9821296Z NO doc formatting: OK
2020-09-18T15:29:02.9821921Z NO doc range formatting: OK
2020-09-18T15:29:02.9822525Z NO doc formatting on typing: OK
2020-09-18T15:29:02.9823100Z NO renaming: OK
2020-09-18T15:29:02.9829300Z NO doc link: OK
2020-09-18T15:29:02.9830082Z NO color: OK
2020-09-18T15:29:02.9830762Z NO folding range: OK
2020-09-18T15:29:02.9831405Z execute command: OK
2020-09-18T15:29:02.9832290Z workspace: OK
2020-09-18T15:29:02.9832900Z NO experimental: OK
2020-09-18T15:29:02.9833354Z completion
2020-09-18T15:29:02.9833638Z non local
2020-09-18T15:29:03.8563115Z variable: OK (0.87s)
2020-09-18T15:29:04.7204499Z constructor: OK (0.86s)
2020-09-18T15:29:05.6057063Z type: OK (0.88s)
2020-09-18T15:29:06.4894331Z qualified: OK (0.88s)
2020-09-18T15:29:06.4900100Z local
2020-09-18T15:29:07.3524106Z variable: OK (0.86s)
2020-09-18T15:29:08.2367194Z constructor: OK (0.88s)
2020-09-18T15:29:09.1090233Z class method: OK (0.87s)
2020-09-18T15:29:09.9951650Z type: OK (0.89s)
2020-09-18T15:29:10.8578677Z class: OK (0.86s)
2020-09-18T15:29:10.8579909Z other
2020-09-18T15:29:11.7303838Z keyword: OK (0.87s)
2020-09-18T15:29:12.6059643Z type context: OK (0.88s)
2020-09-18T15:29:12.6062746Z cpp
2020-09-18T15:29:13.3484881Z cpp-error: OK (0.74s)
2020-09-18T15:29:14.1410467Z cpp-ghcide: OK (0.79s)
2020-09-18T15:29:14.1419211Z diagnostics
2020-09-18T15:29:15.0114867Z fix syntax error: OK (0.87s)
2020-09-18T15:29:15.7310136Z introduce syntax error: OK (0.72s)
2020-09-18T15:29:16.4929436Z variable not in scope: OK (0.76s)
2020-09-18T15:29:17.2436338Z type error: OK (0.75s)
2020-09-18T15:29:18.3094943Z typed hole: OK (1.07s)
2020-09-18T15:29:18.3102933Z deferral
2020-09-18T15:29:19.2324554Z type error: OK (0.92s)
2020-09-18T15:29:20.5947457Z typed hole: OK (1.36s)
2020-09-18T15:29:21.5282440Z out of scope var: OK (0.93s)
2020-09-18T15:29:22.4815785Z remove required module: OK (0.95s)
2020-09-18T15:29:23.5450368Z add missing module: OK (1.06s)
2020-09-18T15:29:24.6204537Z add missing module (non workspace): OK (1.08s)
2020-09-18T15:29:25.5240654Z cyclic module dependency: OK (0.90s)
2020-09-18T15:29:26.0996855Z cyclic module dependency with hs-boot: OK (0.58s)
2020-09-18T15:29:26.6546903Z correct reference used with hs-boot: OK (0.55s)
2020-09-18T15:29:27.5984136Z redundant import: OK (0.94s)
2020-09-18T15:29:28.5534239Z package imports: OK (0.95s)
2020-09-18T15:29:29.3746628Z unqualified warnings: OK (0.82s)
2020-09-18T15:29:30.3282875Z lower-case drive: OK (0.95s)
2020-09-18T15:29:31.0573869Z haddock parse error: OK (0.73s)
2020-09-18T15:29:31.8180598Z strip file path: OK (0.76s)
2020-09-18T15:29:32.0776007Z -Werror in cradle is ignored: OK (0.26s)
2020-09-18T15:29:32.8412116Z -Werror in pragma is ignored: OK (0.76s)
2020-09-18T15:29:35.1514476Z typecheck-all-parents-of-interest: OK (2.31s)
2020-09-18T15:29:35.1515901Z code actions
2020-09-18T15:29:35.1516620Z rename actions
2020-09-18T15:29:39.1489512Z change to local variable name: OK (4.00s)
2020-09-18T15:29:43.0766011Z change to name of imported function: OK (3.93s)
2020-09-18T15:29:46.9424059Z suggest multiple local variable names: OK (3.87s)
2020-09-18T15:29:50.9716639Z change infix function: OK (4.03s)
2020-09-18T15:29:50.9718890Z type wildcard actions
2020-09-18T15:29:54.9775066Z global signature: OK (4.01s)
2020-09-18T15:29:59.0040997Z multi-line message: OK (4.03s)
2020-09-18T15:30:03.0843658Z local signature: OK (4.08s)
2020-09-18T15:30:03.0845490Z remove import actions
2020-09-18T15:30:07.1323643Z redundant: OK (4.05s)
2020-09-18T15:30:11.2222280Z qualified redundant: OK (4.09s)
2020-09-18T15:30:15.2191923Z redundant binding: OK (4.00s)
2020-09-18T15:30:19.2949591Z redundant operator: OK (4.08s)
2020-09-18T15:30:23.3313594Z redundant all import: OK (4.04s)
2020-09-18T15:30:27.3776966Z redundant constructor import: OK (4.05s)
2020-09-18T15:30:31.5264750Z import containing the identifier Strict: OK (4.15s)
2020-09-18T15:30:31.5271428Z extend import actions
2020-09-18T15:30:35.7223498Z extend single line import with value: OK (4.20s)
2020-09-18T15:30:40.1507908Z extend single line import with operator: OK (4.43s)
2020-09-18T15:30:44.3897304Z extend single line import with type: OK (4.24s)
2020-09-18T15:30:48.5053335Z extend single line import with constructor: FAIL (expected: known broken) (4.12s)
2020-09-18T15:30:48.5058171Z test/exe/Main.hs:1049:
2020-09-18T15:30:48.5062422Z expected: "module ModuleB where\nimport ModuleA (A(Constructor))\nb :: A\nb = Constructor\n"
2020-09-18T15:30:48.5063629Z but got: "module ModuleB where\nimport ModuleA (Constructor, A)\nb :: A\nb = Constructor\n"(expected failure)
2020-09-18T15:30:52.5812232Z extend single line qualified import with value: OK (4.08s)
2020-09-18T15:30:56.6186874Z extend multi line import with value: OK (4.04s)
2020-09-18T15:30:56.6188869Z suggest import actions
2020-09-18T15:30:56.6189885Z Dont want suggestion
2020-09-18T15:30:57.4293289Z f = nonEmpty: OK (0.81s)
2020-09-18T15:30:58.2488563Z f = First: OK (0.82s)
2020-09-18T15:30:59.0524434Z f :: Typeable a => a: OK (0.80s)
2020-09-18T15:30:59.7933723Z f = quickCheck: OK (0.74s)
2020-09-18T15:30:59.7935533Z want suggestion
2020-09-18T15:31:01.0132862Z f = foo: OK (1.22s)
2020-09-18T15:31:02.2149672Z f = Bar: OK (1.20s)
2020-09-18T15:31:03.4269743Z f :: Bar: OK (1.21s)
2020-09-18T15:31:04.2279197Z f = nonEmpty: OK (0.80s)
2020-09-18T15:31:04.9990848Z f = (:|): OK (0.77s)
2020-09-18T15:31:05.7081173Z f :: Natural: OK (0.71s)
2020-09-18T15:31:06.5089479Z f :: Natural: OK (0.80s)
2020-09-18T15:31:07.2409224Z f :: NonEmpty (): OK (0.73s)
2020-09-18T15:31:08.0008987Z f :: NonEmpty (): OK (0.76s)
2020-09-18T15:31:08.7321594Z f = First: OK (0.73s)
2020-09-18T15:31:09.5044786Z f = Endo: OK (0.77s)
2020-09-18T15:31:10.2785817Z f = Version: OK (0.77s)
2020-09-18T15:31:11.0179845Z f ExitSuccess = (): OK (0.74s)
2020-09-18T15:31:11.8016721Z f = AssertionFailed: OK (0.78s)
2020-09-18T15:31:12.6275674Z f = nonEmpty: OK (0.82s)
2020-09-18T15:31:13.3572741Z f :: Alternative f => f (): OK (0.73s)
2020-09-18T15:31:14.1678470Z f :: Alternative f => f (): OK (0.81s)
2020-09-18T15:31:14.9087412Z f = empty: OK (0.74s)
2020-09-18T15:31:15.7017081Z f = empty: OK (0.79s)
2020-09-18T15:31:16.5639889Z f = (&): OK (0.86s)
2020-09-18T15:31:17.2933605Z f = NE.nonEmpty: OK (0.73s)
2020-09-18T15:31:18.0515982Z f = Data.List.NonEmpty.nonEmpty: OK (0.76s)
2020-09-18T15:31:18.7935783Z f :: Typeable a => a: OK (0.74s)
2020-09-18T15:31:19.5936970Z f = pack: OK (0.80s)
2020-09-18T15:31:20.4258836Z f :: Text: OK (0.83s)
2020-09-18T15:31:21.2479817Z f = [] & id: OK (0.82s)
2020-09-18T15:31:22.0486604Z f = (&) [] id: OK (0.80s)
2020-09-18T15:31:22.0490821Z add language extension actions
2020-09-18T15:31:26.0274895Z add NamedFieldPuns language extension: OK (3.98s)
2020-09-18T15:31:30.0665445Z add RecordWildCards language extension: OK (4.04s)
2020-09-18T15:31:30.0666915Z fix import actions
2020-09-18T15:31:34.3673427Z fix constructor import: OK (4.30s)
2020-09-18T15:31:34.3675065Z import rename actions
2020-09-18T15:31:38.4063608Z Data.Mape -> Data.Map: OK (4.04s)
2020-09-18T15:31:42.3843107Z Data.Mape -> Data.Maybe: OK (3.98s)
2020-09-18T15:31:42.3845771Z fill typed holes
2020-09-18T15:31:46.5306617Z replace _ with show: OK (4.15s)
2020-09-18T15:31:50.6881705Z replace _ with globalConvert: OK (4.16s)
2020-09-18T15:31:54.8464416Z replace _convertme with localConvert: OK (4.16s)
2020-09-18T15:31:59.1822022Z replace _b with globalInt: OK (4.34s)
2020-09-18T15:32:03.5462894Z replace _c with globalInt: OK (4.36s)
2020-09-18T15:32:07.8225856Z replace _c with parameterInt: OK (4.28s)
2020-09-18T15:32:11.9771798Z replace _ with foo _: OK (4.15s)
2020-09-18T15:32:11.9777836Z add signature
2020-09-18T15:32:15.9632478Z abc = True: OK (3.99s)
2020-09-18T15:32:20.0618261Z foo a b = a + b: OK (4.10s)
2020-09-18T15:32:24.0993686Z bar a b = show $ a + b: OK (4.04s)
2020-09-18T15:32:28.1547711Z (!!!) a b = a > b: OK (4.06s)
2020-09-18T15:32:32.2262327Z a >>>> b = a + b: OK (4.07s)
2020-09-18T15:32:36.2331477Z a `haha` b = a b: OK (4.01s)
2020-09-18T15:32:40.2804350Z pattern Some a = Just a: OK (4.05s)
2020-09-18T15:32:40.2807561Z insert new definition actions
2020-09-18T15:32:44.3284123Z insert new function definition: OK (4.05s)
2020-09-18T15:32:48.4845235Z define a hole: OK (4.16s)
2020-09-18T15:32:48.4846963Z delete unused definition action
2020-09-18T15:32:52.6353249Z delete unused top level binding: OK (4.15s)
2020-09-18T15:32:56.6133461Z delete unused top level binding defined in infix form: OK (3.98s)
2020-09-18T15:33:00.5997483Z delete unused binding in where clause: OK (3.99s)
2020-09-18T15:33:04.6071446Z delete unused binding with multi-oneline signatures front: OK (4.01s)
2020-09-18T15:33:08.5646010Z delete unused binding with multi-oneline signatures mid: OK (3.96s)
2020-09-18T15:33:12.5006863Z delete unused binding with multi-oneline signatures end: OK (3.94s)
2020-09-18T15:33:12.5009191Z add instance constraint
2020-09-18T15:33:16.4992955Z Add `Eq a` to the context of the instance declaration: OK (4.00s)
2020-09-18T15:33:20.4971614Z Add `Eq b` to the context of the instance declaration: OK (4.00s)
2020-09-18T15:33:24.5431211Z Add `Eq c` to the context of the instance declaration: OK (4.05s)
2020-09-18T15:33:24.5432847Z add function constraint
2020-09-18T15:33:28.6101539Z Add `Eq a` to the context of the type signature for `eq`: OK (4.07s)
2020-09-18T15:33:32.6171475Z Add `Eq b` to the context of the type signature for `eq`: OK (4.01s)
2020-09-18T15:33:36.5746501Z Add `Eq c` to the context of the type signature for `eq`: OK (3.96s)
2020-09-18T15:33:36.5757460Z remove redundant function constraints
2020-09-18T15:33:40.4730290Z Remove redundant constraint `Eq a` from the context of the type signature for `foo`: OK (3.90s)
2020-09-18T15:33:44.3790688Z Remove redundant constraints `(Eq a, Monoid a)` from the context of the type signature for `foo`: OK (3.91s)
2020-09-18T15:33:48.2865718Z Remove redundant constraints `(Monoid a, Show a)` from the context of the type signature for `foo`: OK (3.91s)
2020-09-18T15:33:52.2037290Z should do nothing when constraints contain an arbitrary number of spaces: OK (3.92s)
2020-09-18T15:33:56.0614423Z should do nothing when constraints contain line feeds: OK (3.86s)
2020-09-18T15:33:56.0616633Z add type annotations to literals to satisfy contraints
2020-09-18T15:33:59.9785361Z add default type to satisfy one contraint: OK (3.92s)
2020-09-18T15:34:03.9873932Z add default type to satisfy one contraint with duplicate literals: OK (4.01s)
2020-09-18T15:34:07.9960796Z add default type to satisfy two contraints: OK (4.01s)
2020-09-18T15:34:11.9836243Z add default type to satisfy two contraints with duplicate literals: OK (3.99s)
2020-09-18T15:34:11.9839223Z export unused actions
2020-09-18T15:34:11.9840669Z don't want suggestion
2020-09-18T15:34:15.9005129Z implicit exports: OK (3.92s)
2020-09-18T15:34:19.7697536Z not top-level: OK (3.87s)
2020-09-18T15:34:23.6964471Z type is exported but not the constructor of same name: OK (3.93s)
2020-09-18T15:34:27.6152607Z unused data field: OK (3.92s)
2020-09-18T15:34:27.6154250Z want suggestion
2020-09-18T15:34:31.5039101Z empty exports: OK (3.89s)
2020-09-18T15:34:35.3807508Z single line explicit exports: OK (3.88s)
2020-09-18T15:34:39.2495236Z multi line explicit exports: OK (3.87s)
2020-09-18T15:34:43.1060136Z export list ends in comma: OK (3.86s)
2020-09-18T15:34:47.0021833Z unused pattern synonym: OK (3.90s)
2020-09-18T15:34:50.9067862Z unused data type: OK (3.90s)
2020-09-18T15:34:54.8430072Z unused newtype: OK (3.94s)
2020-09-18T15:34:58.8594502Z unused type synonym: OK (4.02s)
2020-09-18T15:35:03.1289173Z unused type family: OK (4.27s)
2020-09-18T15:35:07.0562637Z unused typeclass: OK (3.93s)
2020-09-18T15:35:11.0131394Z infix: OK (3.96s)
2020-09-18T15:35:11.0135039Z code lenses
2020-09-18T15:35:11.0136249Z add signature
2020-09-18T15:35:11.0136991Z with warnings enabled
2020-09-18T15:35:11.2861673Z abc = True: OK (0.27s)
2020-09-18T15:35:11.5575272Z foo a b = a + b: OK (0.27s)
2020-09-18T15:35:11.8282143Z bar a b = show $ a + b: OK (0.27s)
2020-09-18T15:35:12.1505692Z (!!!) a b = a > b: OK (0.32s)
2020-09-18T15:35:12.4210521Z a >>>> b = a + b: OK (0.27s)
2020-09-18T15:35:12.6825049Z a `haha` b = a b: OK (0.26s)
2020-09-18T15:35:12.9440047Z pattern Some a = Just a: OK (0.26s)
2020-09-18T15:35:12.9443765Z with warnings disabled
2020-09-18T15:35:13.2382585Z abc = True: OK (0.29s)
2020-09-18T15:35:13.5092960Z foo a b = a + b: OK (0.27s)
2020-09-18T15:35:13.7802213Z bar a b = show $ a + b: OK (0.27s)
2020-09-18T15:35:14.1121381Z (!!!) a b = a > b: OK (0.33s)
2020-09-18T15:35:14.3826803Z a >>>> b = a + b: OK (0.27s)
2020-09-18T15:35:14.6541553Z a `haha` b = a b: OK (0.27s)
2020-09-18T15:35:14.9269719Z pattern Some a = Just a: OK (0.27s)
2020-09-18T15:35:14.9271581Z outline
2020-09-18T15:35:15.6582590Z type class: OK (0.73s)
2020-09-18T15:35:16.3788653Z type class instance : OK (0.72s)
2020-09-18T15:35:17.1007796Z type family: OK (0.72s)
2020-09-18T15:35:17.8220020Z type family instance : OK (0.72s)
2020-09-18T15:35:18.5628344Z data family: OK (0.74s)
2020-09-18T15:35:19.2846733Z data family instance : OK (0.72s)
2020-09-18T15:35:20.0053261Z constant: OK (0.72s)
2020-09-18T15:35:20.7362379Z pattern: OK (0.73s)
2020-09-18T15:35:21.4674583Z pattern with type signature: OK (0.73s)
2020-09-18T15:35:22.1984676Z function: OK (0.73s)
2020-09-18T15:35:22.9392599Z type synonym: OK (0.74s)
2020-09-18T15:35:23.6594989Z datatype: OK (0.72s)
2020-09-18T15:35:24.3912686Z record fields: OK (0.73s)
2020-09-18T15:35:25.1320734Z import: OK (0.74s)
2020-09-18T15:35:25.8634268Z multiple import: OK (0.73s)
2020-09-18T15:35:26.5740656Z foreign import: OK (0.71s)
2020-09-18T15:35:27.3063786Z foreign export: OK (0.73s)
2020-09-18T15:35:27.3065782Z get
2020-09-18T15:35:27.3066583Z definition
2020-09-18T15:35:27.9388029Z field in record definition: OK (0.63s)
2020-09-18T15:35:28.5852270Z field in record construction #71: FAIL (expected: known broken) (0.65s)
2020-09-18T15:35:28.5860987Z test/exe/Main.hs:2075:
2020-09-18T15:35:28.5862255Z expected: Range {_start = Position {_line = 8, _character = 4}, _end = Position {_line = 8, _character = 7}}
2020-09-18T15:35:28.5863539Z but got: Range {_start = Position {_line = 7, _character = 23}, _end = Position {_line = 9, _character = 16}}(expected failure)
2020-09-18T15:35:29.2194596Z field name used as accessor: OK (0.63s)
2020-09-18T15:35:29.8322836Z top-level name: OK (0.61s)
2020-09-18T15:35:30.4769570Z data constructor record #247: OK (0.64s)
2020-09-18T15:35:31.1002052Z data constructor plain: OK (0.62s)
2020-09-18T15:35:31.7346333Z type constructor #248: OK (0.63s)
2020-09-18T15:35:32.3669035Z type constructor external #248,249: FAIL (expected: known broken) (0.63s)
2020-09-18T15:35:32.3674873Z test/exe/Main.hs:2068:
2020-09-18T15:35:32.3698788Z Expecting to fail to find in external file(expected failure)
2020-09-18T15:35:33.0128127Z value external package #249: FAIL (expected: known broken) (0.64s)
2020-09-18T15:35:33.0130336Z test/exe/Main.hs:2068:
2020-09-18T15:35:33.0131094Z Expecting to fail to find in external file(expected failure)
2020-09-18T15:35:33.6664682Z plain parameter: OK (0.65s)
2020-09-18T15:35:34.3194746Z pattern match name: OK (0.65s)
2020-09-18T15:35:34.9523387Z top-level operator: OK (0.63s)
2020-09-18T15:35:35.5873436Z parameter operator: OK (0.64s)
2020-09-18T15:35:36.2022366Z name in backticks: OK (0.61s)
2020-09-18T15:35:36.9055521Z class in instance declaration #250: OK (0.70s)
2020-09-18T15:35:37.5714562Z class in signature #250: OK (0.66s)
2020-09-18T15:35:38.2042341Z external class in signature #249,250: FAIL (expected: known broken) (0.63s)
2020-09-18T15:35:38.2048360Z test/exe/Main.hs:2068:
2020-09-18T15:35:38.2049553Z Expecting to fail to find in external file(expected failure)
2020-09-18T15:35:38.8160134Z do-notation bind: OK (0.61s)
2020-09-18T15:35:39.4307696Z do-notation lookup: OK (0.61s)
2020-09-18T15:35:40.0327276Z listcomp bind: OK (0.60s)
2020-09-18T15:35:40.6663298Z listcomp lookup: OK (0.63s)
2020-09-18T15:35:41.3012341Z top-level fn 1st clause: OK (0.62s)
2020-09-18T15:35:41.9248200Z top-level fn 2nd clause #246: OK (0.63s)
2020-09-18T15:35:42.5378881Z top-level fn on space #315: OK (0.61s)
2020-09-18T15:35:43.1610137Z top-level signature #310: FAIL (expected: known broken) (0.62s)
2020-09-18T15:35:43.1611956Z test/exe/Main.hs:2072:
2020-09-18T15:35:43.1612880Z number of definitions
2020-09-18T15:35:43.1613497Z expected: 1
2020-09-18T15:35:43.1614111Z but got: 0(expected failure)
2020-09-18T15:35:43.7940844Z inner signature #310: FAIL (expected: known broken) (0.63s)
2020-09-18T15:35:43.7942987Z test/exe/Main.hs:2072:
2020-09-18T15:35:43.7943906Z number of definitions
2020-09-18T15:35:43.7944914Z expected: 1
2020-09-18T15:35:43.7945590Z but got: 0(expected failure)
2020-09-18T15:35:44.7102197Z Imported symbol: OK (0.63s)
2020-09-18T15:35:45.1023784Z Imported symbol (reexported): OK (0.67s)
2020-09-18T15:35:45.1032383Z hover
2020-09-18T15:35:45.7477407Z field in record definition: OK (0.65s)
2020-09-18T15:35:46.3909311Z field in record construction #71: FAIL (expected: known broken) (0.64s)
2020-09-18T15:35:46.3911233Z test/exe/Main.hs:2128:
2020-09-18T15:35:46.3911910Z expected: Position {_line = 9, _character = 5}
2020-09-18T15:35:46.3912406Z but got: Position {_line = 8, _character = 24}(expected failure)
2020-09-18T15:35:47.0249508Z field name used as accessor: OK (0.63s)
2020-09-18T15:35:47.6399644Z top-level name: OK (0.61s)
2020-09-18T15:35:48.2531964Z data constructor record #247: OK (0.61s)
2020-09-18T15:35:48.8666177Z data constructor plain: OK (0.61s)
2020-09-18T15:35:49.5086908Z type constructor #248: OK (0.64s)
2020-09-18T15:35:50.1222223Z type constructor external #248,249: OK (0.61s)
2020-09-18T15:35:50.7790831Z value external package #249: OK (0.65s)
2020-09-18T15:35:51.4198956Z plain parameter: OK (0.64s)
2020-09-18T15:35:52.0671404Z pattern match name: OK (0.64s)
2020-09-18T15:35:52.6884420Z top-level operator: OK (0.62s)
2020-09-18T15:35:53.3234575Z parameter operator: OK (0.63s)
2020-09-18T15:35:53.9457803Z name in backticks: OK (0.62s)
2020-09-18T15:35:54.5600169Z class in instance declaration #250: OK (0.61s)
2020-09-18T15:35:55.1824516Z class in signature #250: OK (0.62s)
2020-09-18T15:35:55.8070100Z external class in signature #249,250: OK (0.62s)
2020-09-18T15:35:56.3991415Z do-notation bind: OK (0.59s)
2020-09-18T15:35:57.0136494Z do-notation lookup: OK (0.61s)
2020-09-18T15:35:57.6465702Z listcomp bind: OK (0.63s)
2020-09-18T15:35:58.2494403Z listcomp lookup: OK (0.60s)
2020-09-18T15:35:58.8725129Z top-level fn 1st clause: OK (0.62s)
2020-09-18T15:35:59.5250371Z top-level fn 2nd clause #246: OK (0.65s)
2020-09-18T15:36:00.1691575Z top-level fn on space #315: OK (0.64s)
2020-09-18T15:36:00.8035003Z documentation #7: OK (0.63s)
2020-09-18T15:36:01.4870578Z kind of Either #273: OK (0.68s)
2020-09-18T15:36:02.1288005Z kind of Int #273: OK (0.64s)
2020-09-18T15:36:02.7734937Z kind of (* -> *) type variable #273: FAIL (expected: known broken) (0.64s)
2020-09-18T15:36:02.7741321Z test/exe/Main.hs:2134:
2020-09-18T15:36:02.7742994Z failed to find: `:: * -> *
2020-09-18T15:36:02.7743727Z ` in hover message:
2020-09-18T15:36:02.7744335Z ```haskell
2020-09-18T15:36:02.7744862Z m
2020-09-18T15:36:02.7745392Z ```
2020-09-18T15:36:02.7745984Z * * *
2020-09-18T15:36:02.7746880Z *Defined at /tmp/extra-dir-83405126824988/GotoHover.hs:45:1*
2020-09-18T15:36:02.7747591Z * * *
2020-09-18T15:36:02.7748118Z
2020-09-18T15:36:02.7748649Z (expected failure)
2020-09-18T15:36:03.3963295Z literal Int in hover info #274: OK (0.62s)
2020-09-18T15:36:04.0796075Z literal Char in hover info #274: OK (0.68s)
2020-09-18T15:36:04.7134167Z literal Text in hover info #274: OK (0.63s)
2020-09-18T15:36:05.3598083Z literal List in hover info #274: OK (0.64s)
2020-09-18T15:36:05.9627277Z type constraint in hover info #283: OK (0.60s)
2020-09-18T15:36:06.6182147Z top-level signature #310: FAIL (expected: known broken) (0.66s)
2020-09-18T15:36:06.6193418Z test/exe/Main.hs:2104:
2020-09-18T15:36:06.6195153Z no hover found(expected failure)
2020-09-18T15:36:07.2409909Z inner signature #310: FAIL (expected: known broken) (0.62s)
2020-09-18T15:36:07.2415805Z test/exe/Main.hs:2104:
2020-09-18T15:36:07.2416870Z no hover found(expected failure)
2020-09-18T15:36:07.8725184Z Haddock html links: OK (0.63s)
2020-09-18T15:36:08.5067734Z Imported symbol: OK (0.63s)
2020-09-18T15:36:09.1085313Z Imported symbol (reexported): OK (0.60s)
2020-09-18T15:36:09.6727664Z Does GotoHover.hs compile: OK (0.56s)
2020-09-18T15:36:09.6734171Z type-definition
2020-09-18T15:36:10.2846041Z Saturated data con: OK (0.61s)
2020-09-18T15:36:10.9086865Z Polymorphic variable: OK (0.62s)
2020-09-18T15:36:12.8298271Z simple plugin: OK (1.92s)
2020-09-18T15:36:14.4396750Z parsedResultAction plugin: OK (1.61s)
2020-09-18T15:36:15.2022045Z preprocessor: OK (0.76s)
2020-09-18T15:36:15.2023986Z TemplateHaskell
2020-09-18T15:36:16.3932768Z load: OK (1.19s)
2020-09-18T15:36:16.9617872Z newtype-closure: OK (0.57s)
2020-09-18T15:36:17.4298555Z reloading-th-test: FAIL (expected: expect broken (#672)) (0.47s)
2020-09-18T15:36:17.4306329Z test/src/Development/IDE/Test.hs:41:
2020-09-18T15:36:17.4309274Z Could not find (DsError,(4,4),"Couldn't match expected type '()' with actual type 'Bool'") in List [Diagnostic {_range = Range {_start = Position {_line = 6, _character = 0}, _end = Position {_line = 6, _character = 3}}, _severity = Just DsWarning, _code = Nothing, _source = Just "typecheck", _message = "Top-level binding with no type signature: foo :: ()", _tags = Nothing, _relatedInformation = Nothing}](expected failure)
2020-09-18T15:36:17.4310925Z SafeHaskell
2020-09-18T15:36:18.9823519Z load: OK (1.55s)
2020-09-18T15:36:18.9827042Z Unit
2020-09-18T15:36:18.9828231Z empty file path does NOT work with the empty String literal: OK
2020-09-18T15:36:18.9830767Z empty file path works using toNormalizedFilePath': OK
2020-09-18T15:36:18.9831756Z empty path URI: OK
2020-09-18T15:36:18.9832641Z from empty path URI: OK
2020-09-18T15:36:18.9839474Z Key with empty file path roundtrips via Binary: OK
2020-09-18T15:36:18.9840228Z haddock
2020-09-18T15:36:18.9840660Z Num: OK
2020-09-18T15:36:18.9849478Z unsafePerformIO: OK
2020-09-18T15:36:18.9850315Z position mapping
2020-09-18T15:36:18.9851159Z toCurrent
2020-09-18T15:36:18.9852564Z before: OK
2020-09-18T15:36:18.9853519Z after, same line, same length: OK
2020-09-18T15:36:18.9859210Z after, same line, increased length: OK
2020-09-18T15:36:18.9860134Z after, same line, decreased length: OK
2020-09-18T15:36:18.9860897Z after, next line, no newline: OK
2020-09-18T15:36:18.9861620Z after, next line, newline: OK
2020-09-18T15:36:18.9862351Z after, same line, newline: OK
2020-09-18T15:36:18.9865510Z after, same line, newline + newline at end: OK
2020-09-18T15:36:18.9866400Z after, same line, newline + newline at end: OK
2020-09-18T15:36:18.9867969Z fromCurrent
2020-09-18T15:36:18.9869950Z before: OK
2020-09-18T15:36:18.9874913Z after, same line, same length: OK
2020-09-18T15:36:18.9875785Z after, same line, increased length: OK
2020-09-18T15:36:18.9876538Z after, same line, decreased length: OK
2020-09-18T15:36:18.9877279Z after, next line, no newline: OK
2020-09-18T15:36:18.9879980Z after, next line, newline: OK
2020-09-18T15:36:18.9882460Z after, same line, newline: OK
2020-09-18T15:36:18.9886189Z after, same line, newline + newline at end: OK
2020-09-18T15:36:18.9887006Z after, same line, newline + newline at end: OK
2020-09-18T15:36:18.9919752Z properties
2020-09-18T15:36:19.1025390Z fromCurrent r t <=< toCurrent r t: OK (0.09s)
2020-09-18T15:36:19.1026746Z +++ OK, passed 1000 tests.
2020-09-18T15:36:19.2668498Z toCurrent r t <=< fromCurrent r t: OK (0.18s)
2020-09-18T15:36:19.2671970Z +++ OK, passed 1000 tests.
2020-09-18T15:36:19.2681039Z watched files
2020-09-18T15:36:19.5319351Z workspace files: OK (0.26s)
2020-09-18T15:36:19.8020446Z non workspace file: OK (0.27s)
2020-09-18T15:36:19.8021568Z cradle
2020-09-18T15:36:19.8021960Z dependencies
2020-09-18T15:36:20.4066778Z session-deps-are-picked-up: OK (0.60s)
2020-09-18T15:36:20.4068503Z ignore-fatal
2020-09-18T15:36:25.4356171Z ignore-fatal-warning: OK (5.03s)
2020-09-18T15:36:25.4361873Z loading
2020-09-18T15:36:25.4362933Z load cradle only once
2020-09-18T15:36:26.0390260Z implicit: OK (0.60s)
2020-09-18T15:36:26.6160433Z direct: OK (0.57s)
2020-09-18T15:36:26.6162302Z multi
2020-09-18T15:36:32.0711363Z simple-multi-test: OK (5.45s)
2020-09-18T15:36:52.6273131Z simple-multi-test2: OK (20.56s)
2020-09-18T15:36:52.6274986Z addDependentFile
2020-09-18T15:36:52.6275830Z file-changed
2020-09-18T15:36:53.4691113Z test: OK (0.84s)
2020-09-18T15:36:53.4692892Z ghcide command line
2020-09-18T15:36:55.4392236Z works: OK (1.97s)
2020-09-18T15:36:55.4393993Z benchmark experiments
2020-09-18T15:37:36.7672401Z hover: OK (39.65s)
2020-09-18T15:37:52.5764712Z hover after edit: OK (15.81s)
2020-09-18T15:38:12.3653070Z getDefinition: OK (19.79s)
2020-09-18T15:38:32.1760190Z documentSymbols: OK (19.81s)
2020-09-18T15:38:53.6737379Z documentSymbols after edit: OK (21.50s)
2020-09-18T15:39:16.2857333Z completions after edit: OK (22.61s)
2020-09-18T15:39:43.3942177Z code actions: OK (27.11s)
2020-09-18T15:40:12.2993655Z code actions after edit: OK (28.35s)
2020-09-18T15:40:12.3044466Z Interface loading tests
2020-09-18T15:40:12.3046244Z iface-error-test-1: FAIL
2020-09-18T15:40:12.3059676Z Exception: NamedParserException "NotificationMessage ServerMethod PublishDiagnosticsParams" (NamedParserException "NotificationMessage ServerMethod PublishDiagnosticsParams" (NamedParserException "NotificationMessage ServerMethod PublishDiagnosticsParams" (NamedParserException "NotificationMessage ServerMethod PublishDiagnosticsParams" (NamedParserException "NotificationMessage ServerMethod PublishDiagnosticsParams" (NamedParserException "NotificationMessage ServerMethod PublishDiagnosticsParams" (NamedParserException "NotificationMessage ServerMethod PublishDiagnosticsParams" (NamedParserException "NotificationMessage ServerMethod PublishDiagnosticsParams" (NamedParserException "NotificationMessage ServerMethod PublishDiagnosticsParams" (NamedParserException "NotificationMessage ServerMethod PublishDiagnosticsParams" (NamedParserException "NotificationMessage ServerMethod PublishDiagnosticsParams" (NamedParserException "NotificationMessage ServerMethod PublishDiagnosticsParams" (NamedParserException "NotificationMessage ServerMethod PublishDiagnosticsParams" (NamedParserException "NotificationMessage ServerMethod PublishDiagnosticsParams" (NamedParserException "NotificationMessage ServerMethod PublishDiagnosticsParams" (NamedParserException "NotificationMessage ServerMethod PublishDiagnosticsParams" (NamedParserException "NotificationMessage ServerMethod PublishDiagnosticsParams" (NamedParserException "NotificationMessage ServerMethod PublishDiagnosticsParams" (NamedParserException "NotificationMessage ServerMethod PublishDiagnosticsParams" (NamedParserException "NotificationMessage ServerMethod PublishDiagnosticsParams" (NamedParserException "NotificationMessage ServerMethod PublishDiagnosticsParams" (NamedParserException "NotificationMessage ServerMethod PublishDiagnosticsParams" (NamedParserException "NotificationMessage ServerMethod PublishDiagnosticsParams" (NamedParserException "NotificationMessage ServerMethod PublishDiagnosticsParams" (NamedParserException "NotificationMessage ServerMethod PublishDiagnosticsParams" (NamedParserException "NotificationMessage ServerMethod PublishDiagnosticsParams" (NamedParserException "Response for id: IdInt 1" (NamedParserException "NotificationMessage ServerMethod (ProgressParams WorkDoneProgressBeginParams)" (NamedParserException "RequestMessage ServerMethod WorkDoneProgressCreateParams ()" (BothFailed (NamedParserException "NotificationMessage ServerMethod PublishDiagnosticsParams" (NamedParserException "NotificationMessage ServerMethod PublishDiagnosticsParams" (NamedParserException "NotificationMessage ServerMethod PublishDiagnosticsParams" (NamedParserException "NotificationMessage ServerMethod PublishDiagnosticsParams" (NamedParserException "NotificationMessage ServerMethod PublishDiagnosticsParams" (NamedParserException "NotificationMessage ServerMethod PublishDiagnosticsParams" (NamedParserException "NotificationMessage ServerMethod PublishDiagnosticsParams" (NamedParserException "NotificationMessage ServerMethod PublishDiagnosticsParams" (NamedParserException "NotificationMessage ServerMethod PublishDiagnosticsParams" (NamedParserException "NotificationMessage ServerMethod PublishDiagnosticsParams" (NamedParserException "NotificationMessage ServerMethod PublishDiagnosticsParams" (NamedParserException "NotificationMessage ServerMethod PublishDiagnosticsParams" (NamedParserException "NotificationMessage ServerMethod PublishDiagnosticsParams" (NamedParserException "NotificationMessage ServerMethod PublishDiagnosticsParams" (NamedParserException "NotificationMessage ServerMethod PublishDiagnosticsParams" (NamedParserException "NotificationMessage ServerMethod PublishDiagnosticsParams" (NamedParserException "NotificationMessage ServerMethod PublishDiagnosticsParams" (NamedParserException "NotificationMessage ServerMethod PublishDiagnosticsParams" (NamedParserException "NotificationMessage ServerMethod PublishDiagnosticsParams" (NamedParserException "NotificationMessage ServerMethod PublishDiagnosticsParams" (NamedParserException "NotificationMessage ServerMethod PublishDiagnosticsParams" (NamedParserException "NotificationMessage ServerMethod PublishDiagnosticsParams" (NamedParserException "NotificationMessage ServerMethod PublishDiagnosticsParams" (NamedParserException "NotificationMessage ServerMethod PublishDiagnosticsParams" (NamedParserException "NotificationMessage ServerMethod PublishDiagnosticsParams" (NamedParserException "NotificationMessage ServerMethod PublishDiagnosticsParams" (NamedParserException "Response for id: IdInt 1" (NamedParserException "NotificationMessage ServerMethod (ProgressParams WorkDoneProgressBeginParams)" (BothFailed (Unexpected "ConduitParser.empty") (Unexpected "ConduitParser.empty")))))))))))))))))))))))))))))) (Unexpected "ConduitParser.empty"))))))))))))))))))))))))))))))
2020-09-18T15:40:14.3640676Z iface-error-test-2: OK (2.29s)
2020-09-18T15:40:16.6345064Z iface-error-test-3: OK (2.27s)
2020-09-18T15:40:17.1017861Z iface-th-test: OK (0.47s)
2020-09-18T15:40:17.5328521Z boot-def-test: OK (0.43s)
2020-09-18T15:40:18.0617145Z use rootUri: OK (0.53s)
2020-09-18T15:40:18.0619826Z async
2020-09-18T15:40:22.0988634Z command: OK (4.04s)
2020-09-18T15:40:26.0960184Z request: OK (4.00s)
2020-09-18T15:40:26.0963739Z client settings handling
2020-09-18T15:40:26.1331673Z ghcide does not support update config: OK (0.04s)
2020-09-18T15:40:26.1619397Z ghcide restarts shake session on config changes: OK (0.03s)
2020-09-18T15:40:26.1621361Z
2020-09-18T15:40:26.1622276Z 1 out of 330 tests failed (683.30s)
2020-09-18T15:40:26.1764913Z
2020-09-18T15:40:26.1767259Z ghcide> Test suite ghcide-tests failed
2020-09-18T15:40:26.1767940Z Completed 2 action(s).
2020-09-18T15:40:26.1771391Z Test suite failure for package ghcide-0.4.0
2020-09-18T15:40:26.1772419Z ghcide-tests: exited with: ExitFailure 1
2020-09-18T15:40:26.1773012Z Logs printed to console
2020-09-18T15:40:26.1773418Z
2020-09-18T15:40:26.8711487Z ghcide> test (suite: ghcide-tests, args: --rerun)
2020-09-18T15:40:26.8712202Z
2020-09-18T15:40:26.8854571Z ghcide
2020-09-18T15:40:26.9721980Z open close: OK (0.09s)
2020-09-18T15:40:26.9730866Z initialize response capabilities
2020-09-18T15:40:26.9957189Z text doc sync: OK
2020-09-18T15:40:26.9959415Z hover: OK
2020-09-18T15:40:26.9960829Z completion: OK
2020-09-18T15:40:26.9962024Z NO signature help: OK
2020-09-18T15:40:26.9963060Z goto definition: OK
2020-09-18T15:40:26.9964097Z goto type definition: OK
2020-09-18T15:40:26.9965296Z NO goto implementation: OK
2020-09-18T15:40:26.9966802Z NO find references: OK
2020-09-18T15:40:26.9968079Z NO doc highlight: OK
2020-09-18T15:40:26.9969430Z doc symbol: OK
2020-09-18T15:40:26.9970490Z NO workspace symbol: OK
2020-09-18T15:40:26.9971496Z code action: OK
2020-09-18T15:40:26.9972501Z code lens: OK
2020-09-18T15:40:26.9973485Z NO doc formatting: OK
2020-09-18T15:40:26.9974460Z NO doc range formatting: OK
2020-09-18T15:40:26.9975482Z NO doc formatting on typing: OK
2020-09-18T15:40:26.9976478Z NO renaming: OK
2020-09-18T15:40:26.9978734Z NO doc link: OK
2020-09-18T15:40:26.9980217Z NO color: OK
2020-09-18T15:40:26.9981336Z NO folding range: OK
2020-09-18T15:40:26.9982175Z execute command: OK
2020-09-18T15:40:26.9983024Z workspace: OK
2020-09-18T15:40:26.9984089Z NO experimental: OK
2020-09-18T15:40:27.0008255Z completion
2020-09-18T15:40:27.0009122Z non local
2020-09-18T15:40:27.8937102Z variable: OK (0.89s)
2020-09-18T15:40:28.7959824Z constructor: OK (0.90s)
2020-09-18T15:40:29.6594745Z type: OK (0.86s)
2020-09-18T15:40:30.5123493Z qualified: OK (0.85s)
2020-09-18T15:40:30.5125478Z local
2020-09-18T15:40:31.4147452Z variable: OK (0.90s)
2020-09-18T15:40:32.2770279Z constructor: OK (0.86s)
2020-09-18T15:40:33.1396982Z class method: OK (0.86s)
2020-09-18T15:40:34.0157902Z type: OK (0.88s)
2020-09-18T15:40:34.8790748Z class: OK (0.86s)
2020-09-18T15:40:34.8794088Z other
2020-09-18T15:40:35.7419987Z keyword: OK (0.86s)
2020-09-18T15:40:36.6149035Z type context: OK (0.87s)
2020-09-18T15:40:36.6151147Z cpp
2020-09-18T15:40:37.3346007Z cpp-error: OK (0.72s)
2020-09-18T15:40:38.1257396Z cpp-ghcide: OK (0.79s)
2020-09-18T15:40:38.1259293Z diagnostics
2020-09-18T15:40:38.9957931Z fix syntax error: OK (0.87s)
2020-09-18T15:40:39.7161636Z introduce syntax error: OK (0.72s)
2020-09-18T15:40:40.4864923Z variable not in scope: OK (0.77s)
2020-09-18T15:40:41.2474653Z type error: OK (0.76s)
2020-09-18T15:40:42.3331687Z typed hole: OK (1.09s)
2020-09-18T15:40:42.3333184Z deferral
2020-09-18T15:40:43.2874514Z type error: OK (0.95s)
2020-09-18T15:40:44.6060279Z typed hole: OK (1.32s)
2020-09-18T15:40:45.5197720Z out of scope var: OK (0.91s)
2020-09-18T15:40:46.4736178Z remove required module: OK (0.95s)
2020-09-18T15:40:47.5270943Z add missing module: OK (1.05s)
2020-09-18T15:40:48.5615387Z add missing module (non workspace): OK (1.03s)
2020-09-18T15:40:49.4744590Z cyclic module dependency: OK (0.91s)
2020-09-18T15:40:50.0604604Z cyclic module dependency with hs-boot: OK (0.59s)
2020-09-18T15:40:50.5954405Z correct reference used with hs-boot: OK (0.54s)
2020-09-18T15:40:51.5606312Z redundant import: OK (0.96s)
2020-09-18T15:40:52.5045195Z package imports: OK (0.94s)
2020-09-18T15:40:53.3276962Z unqualified warnings: OK (0.82s)
2020-09-18T15:40:54.2900172Z lower-case drive: OK (0.96s)
2020-09-18T15:40:55.0305070Z haddock parse error: OK (0.74s)
2020-09-18T15:40:55.8017259Z strip file path: OK (0.77s)
2020-09-18T15:40:56.0625191Z -Werror in cradle is ignored: OK (0.26s)
2020-09-18T15:40:56.8346591Z -Werror in pragma is ignored: OK (0.77s)
2020-09-18T15:40:59.1365751Z typecheck-all-parents-of-interest: OK (2.30s)
2020-09-18T15:40:59.1371370Z code actions
2020-09-18T15:40:59.1372451Z rename actions
2020-09-18T15:41:02.9926586Z change to local variable name: OK (3.86s)
2020-09-18T15:41:06.8276993Z change to name of imported function: OK (3.83s)
2020-09-18T15:41:10.6643274Z suggest multiple local variable names: OK (3.84s)
2020-09-18T15:41:14.7739015Z change infix function: OK (4.11s)
2020-09-18T15:41:14.7745563Z type wildcard actions
2020-09-18T15:41:18.5119686Z global signature: OK (3.74s)
2020-09-18T15:41:22.3772016Z multi-line message: OK (3.87s)
2020-09-18T15:41:26.1947620Z local signature: OK (3.82s)
2020-09-18T15:41:26.1949672Z remove import actions
2020-09-18T15:41:30.1008980Z redundant: OK (3.91s)
2020-09-18T15:41:34.0252038Z qualified redundant: OK (3.92s)
2020-09-18T15:41:37.9633220Z redundant binding: OK (3.94s)
2020-09-18T15:41:41.8981959Z redundant operator: OK (3.94s)
2020-09-18T15:41:45.8935828Z redundant all import: OK (4.00s)
2020-09-18T15:41:49.8112606Z redundant constructor import: OK (3.92s)
2020-09-18T15:41:53.7874990Z import containing the identifier Strict: OK (3.98s)
2020-09-18T15:41:53.7877861Z extend import actions
2020-09-18T15:41:57.7015886Z extend single line import with value: OK (3.92s)
2020-09-18T15:42:01.5970891Z extend single line import with operator: OK (3.90s)
2020-09-18T15:42:05.5126438Z extend single line import with type: OK (3.92s)
2020-09-18T15:42:09.3907675Z extend single line import with constructor: FAIL (expected: known broken) (3.88s)
2020-09-18T15:42:09.3915332Z test/exe/Main.hs:1049:
2020-09-18T15:42:09.3916791Z expected: "module ModuleB where\nimport ModuleA (A(Constructor))\nb :: A\nb = Constructor\n"
2020-09-18T15:42:09.3918000Z but got: "module ModuleB where\nimport ModuleA (Constructor, A)\nb :: A\nb = Constructor\n"(expected failure)
2020-09-18T15:42:13.3258662Z extend single line qualified import with value: OK (3.94s)
2020-09-18T15:42:17.2439620Z extend multi line import with value: OK (3.92s)
2020-09-18T15:42:17.2441701Z suggest import actions
2020-09-18T15:42:17.2442337Z Dont want suggestion
2020-09-18T15:42:18.0259353Z f = nonEmpty: OK (0.78s)
2020-09-18T15:42:18.7949386Z f = First: OK (0.77s)
2020-09-18T15:42:19.4959896Z f :: Typeable a => a: OK (0.70s)
2020-09-18T15:42:20.1960264Z f = quickCheck: OK (0.70s)
2020-09-18T15:42:20.1964841Z want suggestion
2020-09-18T15:42:21.4884188Z f = foo: OK (1.29s)
2020-09-18T15:42:22.6783517Z f = Bar: OK (1.19s)
2020-09-18T15:42:23.9477764Z f :: Bar: OK (1.27s)
2020-09-18T15:42:24.7307688Z f = nonEmpty: OK (0.78s)
2020-09-18T15:42:25.5206984Z f = (:|): OK (0.79s)
2020-09-18T15:42:26.2430007Z f :: Natural: OK (0.72s)
2020-09-18T15:42:26.9641548Z f :: Natural: OK (0.72s)
2020-09-18T15:42:27.6943180Z f :: NonEmpty (): OK (0.73s)
2020-09-18T15:42:28.4134599Z f :: NonEmpty (): OK (0.72s)
2020-09-18T15:42:29.1348337Z f = First: OK (0.72s)
2020-09-18T15:42:29.9075104Z f = Endo: OK (0.77s)
2020-09-18T15:42:30.5277777Z f = Version: OK (0.62s)
2020-09-18T15:42:31.2976283Z f ExitSuccess = (): OK (0.77s)
2020-09-18T15:42:31.8789764Z f = AssertionFailed: OK (0.58s)
2020-09-18T15:42:32.6393153Z f = nonEmpty: OK (0.76s)
2020-09-18T15:42:33.3304263Z f :: Alternative f => f (): OK (0.69s)
2020-09-18T15:42:34.1022199Z f :: Alternative f => f (): OK (0.77s)
2020-09-18T15:42:34.8029304Z f = empty: OK (0.70s)
2020-09-18T15:42:35.5343095Z f = empty: OK (0.73s)
2020-09-18T15:42:36.3135927Z f = (&): OK (0.78s)
2020-09-18T15:42:37.0947968Z f = NE.nonEmpty: OK (0.78s)
2020-09-18T15:42:37.8035901Z f = Data.List.NonEmpty.nonEmpty: OK (0.71s)
2020-09-18T15:42:38.5946013Z f :: Typeable a => a: OK (0.79s)
2020-09-18T15:42:39.4501889Z f = pack: OK (0.85s)
2020-09-18T15:42:40.1794148Z f :: Text: OK (0.73s)
2020-09-18T15:42:40.8901827Z f = [] & id: OK (0.71s)
2020-09-18T15:42:41.6225305Z f = (&) [] id: OK (0.73s)
2020-09-18T15:42:41.6227402Z add language extension actions
2020-09-18T15:42:45.9407641Z add NamedFieldPuns language extension: OK (4.32s)
2020-09-18T15:42:49.7260407Z add RecordWildCards language extension: OK (3.79s)
2020-09-18T15:42:49.7262275Z fix import actions
2020-09-18T15:42:53.6509994Z fix constructor import: OK (3.92s)
2020-09-18T15:42:53.6516072Z import rename actions
2020-09-18T15:42:57.5692879Z Data.Mape -> Data.Map: OK (3.92s)
2020-09-18T15:43:01.5347591Z Data.Mape -> Data.Maybe: OK (3.97s)
2020-09-18T15:43:01.5349345Z fill typed holes
2020-09-18T15:43:05.6302157Z replace _ with show: OK (4.10s)
2020-09-18T15:43:09.6458987Z replace _ with globalConvert: OK (4.02s)
2020-09-18T15:43:13.6816790Z replace _convertme with localConvert: OK (4.04s)
2020-09-18T15:43:17.7680397Z replace _b with globalInt: OK (4.09s)
2020-09-18T15:43:21.8536040Z replace _c with globalInt: OK (4.08s)
2020-09-18T15:43:25.9465759Z replace _c with parameterInt: OK (4.09s)
2020-09-18T15:43:30.3174279Z replace _ with foo _: OK (4.37s)
2020-09-18T15:43:30.3176251Z add signature
2020-09-18T15:43:34.1622252Z abc = True: OK (3.85s)
2020-09-18T15:43:38.0613261Z foo a b = a + b: OK (3.90s)
2020-09-18T15:43:41.9259415Z bar a b = show $ a + b: OK (3.87s)
2020-09-18T15:43:45.8324186Z (!!!) a b = a > b: OK (3.91s)
2020-09-18T15:43:49.6992415Z a >>>> b = a + b: OK (3.87s)
2020-09-18T15:43:53.6408863Z a `haha` b = a b: OK (3.94s)
2020-09-18T15:43:57.6248292Z pattern Some a = Just a: OK (3.99s)
2020-09-18T15:43:57.6250062Z insert new definition actions
2020-09-18T15:44:01.5216255Z insert new function definition: OK (3.90s)
2020-09-18T15:44:05.8828417Z define a hole: OK (4.36s)
2020-09-18T15:44:05.8829873Z delete unused definition action
2020-09-18T15:44:09.8400257Z delete unused top level binding: OK (3.96s)
2020-09-18T15:44:13.7354749Z delete unused top level binding defined in infix form: OK (3.90s)
2020-09-18T15:44:17.6046112Z delete unused binding in where clause: OK (3.87s)
2020-09-18T15:44:21.5113184Z delete unused binding with multi-oneline signatures front: OK (3.91s)
2020-09-18T15:44:25.4772521Z delete unused binding with multi-oneline signatures mid: OK (3.97s)
2020-09-18T15:44:29.3726916Z delete unused binding with multi-oneline signatures end: OK (3.90s)
2020-09-18T15:44:29.3731674Z add instance constraint
2020-09-18T15:44:33.4629181Z Add `Eq a` to the context of the instance declaration: OK (4.09s)
2020-09-18T15:44:37.4767050Z Add `Eq b` to the context of the instance declaration: OK (4.01s)
2020-09-18T15:44:41.3957115Z Add `Eq c` to the context of the instance declaration: OK (3.92s)
2020-09-18T15:44:41.3959244Z add function constraint
2020-09-18T15:44:45.3716595Z Add `Eq a` to the context of the type signature for `eq`: OK (3.98s)
2020-09-18T15:44:49.3374106Z Add `Eq b` to the context of the type signature for `eq`: OK (3.97s)
2020-09-18T15:44:53.2868071Z Add `Eq c` to the context of the type signature for `eq`: OK (3.95s)
2020-09-18T15:44:53.2872098Z remove redundant function constraints
2020-09-18T15:44:57.2959340Z Remove redundant constraint `Eq a` from the context of the type signature for `foo`: OK (4.01s)
2020-09-18T15:45:01.2519199Z Remove redundant constraints `(Eq a, Monoid a)` from the context of the type signature for `foo`: OK (3.96s)
2020-09-18T15:45:05.2326792Z Remove redundant constraints `(Monoid a, Show a)` from the context of the type signature for `foo`: OK (3.98s)
2020-09-18T15:45:09.1358132Z should do nothing when constraints contain an arbitrary number of spaces: OK (3.90s)
2020-09-18T15:45:12.9615304Z should do nothing when constraints contain line feeds: OK (3.83s)
2020-09-18T15:45:12.9623200Z add type annotations to literals to satisfy contraints
2020-09-18T15:45:16.8473480Z add default type to satisfy one contraint: OK (3.89s)
2020-09-18T15:45:20.7336995Z add default type to satisfy one contraint with duplicate literals: OK (3.89s)
2020-09-18T15:45:24.6019462Z add default type to satisfy two contraints: OK (3.87s)
2020-09-18T15:45:28.7706716Z add default type to satisfy two contraints with duplicate literals: OK (4.17s)
2020-09-18T15:45:28.7708765Z export unused actions
2020-09-18T15:45:28.7710177Z don't want suggestion
2020-09-18T15:45:32.6474618Z implicit exports: OK (3.88s)
2020-09-18T15:45:36.5339193Z not top-level: OK (3.89s)
2020-09-18T15:45:40.3622217Z type is exported but not the constructor of same name: OK (3.83s)
2020-09-18T15:45:44.2793211Z unused data field: OK (3.92s)
2020-09-18T15:45:44.2798605Z want suggestion
2020-09-18T15:45:48.1047033Z empty exports: OK (3.83s)
2020-09-18T15:45:51.9150316Z single line explicit exports: OK (3.81s)
2020-09-18T15:45:55.7517023Z multi line explicit exports: OK (3.84s)
2020-09-18T15:45:59.5469446Z export list ends in comma: OK (3.80s)
2020-09-18T15:46:03.4061915Z unused pattern synonym: OK (3.86s)
2020-09-18T15:46:07.2412403Z unused data type: OK (3.84s)
2020-09-18T15:46:11.0977585Z unused newtype: OK (3.86s)
2020-09-18T15:46:14.9770815Z unused type synonym: OK (3.88s)
2020-09-18T15:46:18.8519223Z unused type family: OK (3.88s)
2020-09-18T15:46:22.9495966Z unused typeclass: OK (4.10s)
2020-09-18T15:46:26.8289241Z infix: OK (3.88s)
2020-09-18T15:46:26.8291283Z code lenses
2020-09-18T15:46:26.8291970Z add signature
2020-09-18T15:46:26.8292669Z with warnings enabled
2020-09-18T15:46:27.1308174Z abc = True: OK (0.30s)
2020-09-18T15:46:27.3917378Z foo a b = a + b: OK (0.26s)
2020-09-18T15:46:27.6635088Z bar a b = show $ a + b: OK (0.27s)
2020-09-18T15:46:28.0163374Z (!!!) a b = a > b: OK (0.35s)
2020-09-18T15:46:28.3069603Z a >>>> b = a + b: OK (0.29s)
2020-09-18T15:46:28.5788361Z a `haha` b = a b: OK (0.27s)
2020-09-18T15:46:28.8809800Z pattern Some a = Just a: OK (0.30s)
2020-09-18T15:46:28.8811679Z with warnings disabled
2020-09-18T15:46:29.1423471Z abc = True: OK (0.26s)
2020-09-18T15:46:29.4133045Z foo a b = a + b: OK (0.27s)
2020-09-18T15:46:29.7255112Z bar a b = show $ a + b: OK (0.31s)
2020-09-18T15:46:30.0396772Z (!!!) a b = a > b: OK (0.31s)
2020-09-18T15:46:30.3015112Z a >>>> b = a + b: OK (0.26s)
2020-09-18T15:46:30.5626653Z a `haha` b = a b: OK (0.26s)
2020-09-18T15:46:30.8637840Z pattern Some a = Just a: OK (0.30s)
2020-09-18T15:46:30.8639944Z outline
2020-09-18T15:46:31.5960226Z type class: OK (0.73s)
2020-09-18T15:46:32.3156305Z type class instance : OK (0.72s)
2020-09-18T15:46:33.0361207Z type family: OK (0.72s)
2020-09-18T15:46:33.7564792Z type family instance : OK (0.72s)
2020-09-18T15:46:34.4790338Z data family: OK (0.72s)
2020-09-18T15:46:35.1999687Z data family instance : OK (0.72s)
2020-09-18T15:46:35.9259277Z constant: OK (0.72s)
2020-09-18T15:46:36.6452993Z pattern: OK (0.73s)
2020-09-18T15:46:37.3658896Z pattern with type signature: OK (0.72s)
2020-09-18T15:46:38.0860975Z function: OK (0.72s)
2020-09-18T15:46:38.8084818Z type synonym: OK (0.72s)
2020-09-18T15:46:39.5479444Z datatype: OK (0.74s)
2020-09-18T15:46:40.2805704Z record fields: OK (0.73s)
2020-09-18T15:46:41.0021344Z import: OK (0.72s)
2020-09-18T15:46:41.7229432Z multiple import: OK (0.72s)
2020-09-18T15:46:42.4445148Z foreign import: OK (0.72s)
2020-09-18T15:46:43.1751202Z foreign export: OK (0.73s)
2020-09-18T15:46:43.1756934Z get
2020-09-18T15:46:43.1757866Z definition
2020-09-18T15:46:43.7568290Z field in record definition: OK (0.58s)
2020-09-18T15:46:44.3817733Z field in record construction #71: FAIL (expected: known broken) (0.62s)
2020-09-18T15:46:44.3819476Z test/exe/Main.hs:2075:
2020-09-18T15:46:44.3820283Z expected: Range {_start = Position {_line = 8, _character = 4}, _end = Position {_line = 8, _character = 7}}
2020-09-18T15:46:44.3821258Z but got: Range {_start = Position {_line = 7, _character = 23}, _end = Position {_line = 9, _character = 16}}(expected failure)
2020-09-18T15:46:45.0251279Z field name used as accessor: OK (0.64s)
2020-09-18T15:46:45.6479294Z top-level name: OK (0.62s)
2020-09-18T15:46:46.2626707Z data constructor record #247: OK (0.61s)
2020-09-18T15:46:46.9456782Z data constructor plain: OK (0.68s)
2020-09-18T15:46:47.5486489Z type constructor #248: OK (0.60s)
2020-09-18T15:46:48.1506068Z type constructor external #248,249: FAIL (expected: known broken) (0.60s)
2020-09-18T15:46:48.1508019Z test/exe/Main.hs:2068:
2020-09-18T15:46:48.1508967Z Expecting to fail to find in external file(expected failure)
2020-09-18T15:46:48.8144479Z value external package #249: FAIL (expected: known broken) (0.66s)
2020-09-18T15:46:48.8146948Z test/exe/Main.hs:2068:
2020-09-18T15:46:48.8148172Z Expecting to fail to find in external file(expected failure)
2020-09-18T15:46:49.4685919Z plain parameter: OK (0.65s)
2020-09-18T15:46:50.1130151Z pattern match name: OK (0.64s)
2020-09-18T15:46:50.7344409Z top-level operator: OK (0.62s)
2020-09-18T15:46:51.3892329Z parameter operator: OK (0.65s)
2020-09-18T15:46:52.0712743Z name in backticks: OK (0.68s)
2020-09-18T15:46:52.7173113Z class in instance declaration #250: OK (0.64s)
2020-09-18T15:46:53.3120464Z class in signature #250: OK (0.60s)
2020-09-18T15:46:53.9361941Z external class in signature #249,250: FAIL (expected: known broken) (0.62s)
2020-09-18T15:46:53.9370798Z test/exe/Main.hs:2068:
2020-09-18T15:46:53.9373886Z Expecting to fail to find in external file(expected failure)
2020-09-18T15:46:54.5594177Z do-notation bind: OK (0.62s)
2020-09-18T15:46:55.2226569Z do-notation lookup: OK (0.66s)
2020-09-18T15:46:55.8268608Z listcomp bind: OK (0.60s)
2020-09-18T15:46:56.4784957Z listcomp lookup: OK (0.65s)
2020-09-18T15:46:57.1319572Z top-level fn 1st clause: OK (0.65s)
2020-09-18T15:46:57.7663068Z top-level fn 2nd clause #246: OK (0.63s)
2020-09-18T15:46:58.3698691Z top-level fn on space #315: OK (0.60s)
2020-09-18T15:46:58.9632055Z top-level signature #310: FAIL (expected: known broken) (0.59s)
2020-09-18T15:46:58.9634152Z test/exe/Main.hs:2072:
2020-09-18T15:46:58.9634849Z number of definitions
2020-09-18T15:46:58.9635446Z expected: 1
2020-09-18T15:46:58.9636067Z but got: 0(expected failure)
2020-09-18T15:46:59.5750426Z inner signature #310: FAIL (expected: known broken) (0.61s)
2020-09-18T15:46:59.5752195Z test/exe/Main.hs:2072:
2020-09-18T15:46:59.5753257Z number of definitions
2020-09-18T15:46:59.5753943Z expected: 1
2020-09-18T15:46:59.5754269Z but got: 0(expected failure)
2020-09-18T15:47:00.1772196Z Imported symbol: OK (0.60s)
2020-09-18T15:47:00.9340990Z Imported symbol (reexported): OK (0.60s)
2020-09-18T15:47:00.9346804Z hover
2020-09-18T15:47:01.3850630Z field in record definition: OK (0.60s)
2020-09-18T15:47:02.0096997Z field in record construction #71: FAIL (expected: known broken) (0.62s)
2020-09-18T15:47:02.0104363Z test/exe/Main.hs:2128:
2020-09-18T15:47:02.0105594Z expected: Position {_line = 9, _character = 5}
2020-09-18T15:47:02.0106382Z but got: Position {_line = 8, _character = 24}(expected failure)
2020-09-18T15:47:02.6025880Z field name used as accessor: OK (0.59s)
2020-09-18T15:47:03.2144791Z top-level name: OK (0.61s)
2020-09-18T15:47:03.8580030Z data constructor record #247: OK (0.64s)
2020-09-18T15:47:04.4937763Z data constructor plain: OK (0.63s)
2020-09-18T15:47:05.0967376Z type constructor #248: OK (0.60s)
2020-09-18T15:47:05.6908704Z type constructor external #248,249: OK (0.59s)
2020-09-18T15:47:06.2949475Z value external package #249: OK (0.60s)
2020-09-18T15:47:06.9091618Z plain parameter: OK (0.61s)
2020-09-18T15:47:07.5217160Z pattern match name: OK (0.61s)
2020-09-18T15:47:08.1547996Z top-level operator: OK (0.63s)
2020-09-18T15:47:08.7772449Z parameter operator: OK (0.62s)
2020-09-18T15:47:09.3807841Z name in backticks: OK (0.60s)
2020-09-18T15:47:09.9836626Z class in instance declaration #250: OK (0.60s)
2020-09-18T15:47:10.5884463Z class in signature #250: OK (0.60s)
2020-09-18T15:47:11.2014583Z external class in signature #249,250: OK (0.61s)
2020-09-18T15:47:11.8246367Z do-notation bind: OK (0.62s)
2020-09-18T15:47:12.5166384Z do-notation lookup: OK (0.69s)
2020-09-18T15:47:13.1217733Z listcomp bind: OK (0.60s)
2020-09-18T15:47:13.7153059Z listcomp lookup: OK (0.60s)
2020-09-18T15:47:14.3596823Z top-level fn 1st clause: OK (0.64s)
2020-09-18T15:47:14.9827148Z top-level fn 2nd clause #246: OK (0.62s)
2020-09-18T15:47:15.5951415Z top-level fn on space #315: OK (0.61s)
2020-09-18T15:47:16.2197659Z documentation #7: OK (0.62s)
2020-09-18T15:47:16.8226254Z kind of Either #273: OK (0.60s)
2020-09-18T15:47:17.4254598Z kind of Int #273: OK (0.60s)
2020-09-18T15:47:18.0367932Z kind of (* -> *) type variable #273: FAIL (expected: known broken) (0.61s)
2020-09-18T15:47:18.0369521Z test/exe/Main.hs:2134:
2020-09-18T15:47:18.0370832Z failed to find: `:: * -> *
2020-09-18T15:47:18.0377084Z ` in hover message:
2020-09-18T15:47:18.0377993Z ```haskell
2020-09-18T15:47:18.0378522Z m
2020-09-18T15:47:18.0378952Z ```
2020-09-18T15:47:18.0379385Z * * *
2020-09-18T15:47:18.0380458Z *Defined at /tmp/extra-dir-10956158862698/GotoHover.hs:45:1*
2020-09-18T15:47:18.0380867Z * * *
2020-09-18T15:47:18.0381086Z
2020-09-18T15:47:18.0381303Z (expected failure)
2020-09-18T15:47:18.6409936Z literal Int in hover info #274: OK (0.60s)
2020-09-18T15:47:19.2959616Z literal Char in hover info #274: OK (0.65s)
2020-09-18T15:47:19.9193169Z literal Text in hover info #274: OK (0.62s)
2020-09-18T15:47:20.5447272Z literal List in hover info #274: OK (0.62s)
2020-09-18T15:47:21.1569665Z type constraint in hover info #283: OK (0.61s)
2020-09-18T15:47:21.7822847Z top-level signature #310: FAIL (expected: known broken) (0.62s)
2020-09-18T15:47:21.7824653Z test/exe/Main.hs:2104:
2020-09-18T15:47:21.7825356Z no hover found(expected failure)
2020-09-18T15:47:22.4239683Z inner signature #310: FAIL (expected: known broken) (0.64s)
2020-09-18T15:47:22.4243665Z test/exe/Main.hs:2104:
2020-09-18T15:47:22.4244776Z no hover found(expected failure)
2020-09-18T15:47:23.0169867Z Haddock html links: OK (0.59s)
2020-09-18T15:47:23.6224848Z Imported symbol: OK (0.60s)
2020-09-18T15:47:24.2460079Z Imported symbol (reexported): OK (0.62s)
2020-09-18T15:47:24.7983088Z Does GotoHover.hs compile: OK (0.55s)
2020-09-18T15:47:24.7985768Z type-definition
2020-09-18T15:47:25.4133814Z Saturated data con: OK (0.61s)
2020-09-18T15:47:26.0248058Z Polymorphic variable: OK (0.61s)
2020-09-18T15:47:27.5628521Z simple plugin: OK (1.54s)
2020-09-18T15:47:29.1732984Z parsedResultAction plugin: OK (1.61s)
2020-09-18T15:47:29.9336569Z preprocessor: OK (0.76s)
2020-09-18T15:47:29.9339218Z TemplateHaskell
2020-09-18T15:47:31.1333759Z load: OK (1.20s)
2020-09-18T15:47:31.7017902Z newtype-closure: OK (0.57s)
2020-09-18T15:47:32.1785133Z reloading-th-test: FAIL (expected: expect broken (#672)) (0.48s)
2020-09-18T15:47:32.1787195Z test/src/Development/IDE/Test.hs:41:
2020-09-18T15:47:32.1789505Z Could not find (DsError,(4,4),"Couldn't match expected type '()' with actual type 'Bool'") in List [Diagnostic {_range = Range {_start = Position {_line = 6, _character = 0}, _end = Position {_line = 6, _character = 3}}, _severity = Just DsWarning, _code = Nothing, _source = Just "typecheck", _message = "Top-level binding with no type signature: foo :: ()", _tags = Nothing, _relatedInformation = Nothing}](expected failure)
2020-09-18T15:47:32.1791352Z SafeHaskell
2020-09-18T15:47:33.7421380Z load: OK (1.56s)
2020-09-18T15:47:33.7423173Z Unit
2020-09-18T15:47:33.7423984Z empty file path does NOT work with the empty String literal: OK
2020-09-18T15:47:33.7425879Z empty file path works using toNormalizedFilePath': OK
2020-09-18T15:47:33.7426989Z empty path URI: OK
2020-09-18T15:47:33.7428267Z from empty path URI: OK
2020-09-18T15:47:33.7429229Z Key with empty file path roundtrips via Binary: OK
2020-09-18T15:47:33.7429985Z haddock
2020-09-18T15:47:33.7439728Z Num: OK
2020-09-18T15:47:33.7440959Z unsafePerformIO: OK
2020-09-18T15:47:33.7441692Z position mapping
2020-09-18T15:47:33.7442261Z toCurrent
2020-09-18T15:47:33.7443021Z before: OK
2020-09-18T15:47:33.7443924Z after, same line, same length: OK
2020-09-18T15:47:33.7444905Z after, same line, increased length: OK
2020-09-18T15:47:33.7445945Z after, same line, decreased length: OK
2020-09-18T15:47:33.7451767Z after, next line, no newline: OK
2020-09-18T15:47:33.7452857Z after, next line, newline: OK
2020-09-18T15:47:33.7453792Z after, same line, newline: OK
2020-09-18T15:47:33.7454716Z after, same line, newline + newline at end: OK
2020-09-18T15:47:33.7455619Z after, same line, newline + newline at end: OK
2020-09-18T15:47:33.7456665Z fromCurrent
2020-09-18T15:47:33.7457437Z before: OK
2020-09-18T15:47:33.7459237Z after, same line, same length: OK
2020-09-18T15:47:33.7460137Z after, same line, increased length: OK
2020-09-18T15:47:33.7460993Z after, same line, decreased length: OK
2020-09-18T15:47:33.7461814Z after, next line, no newline: OK
2020-09-18T15:47:33.7462651Z after, next line, newline: OK
2020-09-18T15:47:33.7463477Z after, same line, newline: OK
2020-09-18T15:47:33.7464320Z after, same line, newline + newline at end: OK
2020-09-18T15:47:33.7465162Z after, same line, newline + newline at end: OK
2020-09-18T15:47:33.7465813Z properties
2020-09-18T15:47:33.8450357Z fromCurrent r t <=< toCurrent r t: OK (0.09s)
2020-09-18T15:47:33.8451820Z +++ OK, passed 1000 tests.
2020-09-18T15:47:33.9961768Z toCurrent r t <=< fromCurrent r t: OK (0.14s)
2020-09-18T15:47:33.9963172Z +++ OK, passed 1000 tests.
2020-09-18T15:47:33.9963671Z watched files
2020-09-18T15:47:34.2481082Z workspace files: OK (0.25s)
2020-09-18T15:47:34.4888539Z non workspace file: OK (0.24s)
2020-09-18T15:47:34.4891963Z cradle
2020-09-18T15:47:34.4892329Z dependencies
2020-09-18T15:47:35.0524993Z session-deps-are-picked-up: OK (0.56s)
2020-09-18T15:47:35.0527274Z ignore-fatal
2020-09-18T15:47:40.0935211Z ignore-fatal-warning: OK (5.04s)
2020-09-18T15:47:40.0941853Z loading
2020-09-18T15:47:40.0942945Z load cradle only once
2020-09-18T15:47:40.6474288Z implicit: OK (0.55s)
2020-09-18T15:47:41.2013931Z direct: OK (0.55s)
2020-09-18T15:47:41.2017306Z multi
2020-09-18T15:47:46.4750592Z simple-multi-test: OK (5.27s)
2020-09-18T15:48:07.0290719Z simple-multi-test2: OK (20.55s)
2020-09-18T15:48:07.0292743Z addDependentFile
2020-09-18T15:48:07.0294180Z file-changed
2020-09-18T15:48:07.8534785Z test: OK (0.82s)
2020-09-18T15:48:07.8537240Z ghcide command line
2020-09-18T15:48:09.7134949Z works: OK (1.86s)
2020-09-18T15:48:09.7136828Z benchmark experiments
2020-09-18T15:48:51.4103885Z hover: OK (41.48s)
2020-09-18T15:49:06.8519706Z hover after edit: OK (15.44s)
2020-09-18T15:49:26.8785909Z getDefinition: OK (20.02s)
2020-09-18T15:49:45.7918826Z documentSymbols: OK (18.92s)
2020-09-18T15:50:06.9603983Z documentSymbols after edit: OK (21.17s)
2020-09-18T15:50:23.1080430Z completions after edit: OK (16.15s)
2020-09-18T15:50:48.2714830Z code actions: OK (25.16s)
2020-09-18T15:51:15.9663811Z code actions after edit: OK (27.68s)
2020-09-18T15:51:15.9671990Z Interface loading tests
2020-09-18T15:51:16.2372726Z iface-error-test-1: FAIL
2020-09-18T15:51:16.2395412Z Exception: NamedParserException "NotificationMessage ServerMethod PublishDiagnosticsParams" (NamedParserException "NotificationMessage ServerMethod PublishDiagnosticsParams" (NamedParserException "NotificationMessage ServerMethod PublishDiagnosticsParams" (NamedParserException "NotificationMessage ServerMethod PublishDiagnosticsParams" (NamedParserException "NotificationMessage ServerMethod PublishDiagnosticsParams" (NamedParserException "NotificationMessage ServerMethod PublishDiagnosticsParams" (NamedParserException "NotificationMessage ServerMethod PublishDiagnosticsParams" (NamedParserException "NotificationMessage ServerMethod PublishDiagnosticsParams" (NamedParserException "NotificationMessage ServerMethod PublishDiagnosticsParams" (NamedParserException "NotificationMessage ServerMethod PublishDiagnosticsParams" (NamedParserException "NotificationMessage ServerMethod PublishDiagnosticsParams" (NamedParserException "NotificationMessage ServerMethod PublishDiagnosticsParams" (NamedParserException "NotificationMessage ServerMethod PublishDiagnosticsParams" (NamedParserException "NotificationMessage ServerMethod PublishDiagnosticsParams" (NamedParserException "NotificationMessage ServerMethod PublishDiagnosticsParams" (NamedParserException "NotificationMessage ServerMethod PublishDiagnosticsParams" (NamedParserException "NotificationMessage ServerMethod PublishDiagnosticsParams" (NamedParserException "NotificationMessage ServerMethod PublishDiagnosticsParams" (NamedParserException "NotificationMessage ServerMethod PublishDiagnosticsParams" (NamedParserException "NotificationMessage ServerMethod PublishDiagnosticsParams" (NamedParserException "NotificationMessage ServerMethod PublishDiagnosticsParams" (NamedParserException "NotificationMessage ServerMethod PublishDiagnosticsParams" (NamedParserException "NotificationMessage ServerMethod PublishDiagnosticsParams" (NamedParserException "NotificationMessage ServerMethod PublishDiagnosticsParams" (NamedParserException "NotificationMessage ServerMethod PublishDiagnosticsParams" (NamedParserException "NotificationMessage ServerMethod PublishDiagnosticsParams" (NamedParserException "Response for id: IdInt 1" (NamedParserException "NotificationMessage ServerMethod (ProgressParams WorkDoneProgressBeginParams)" (NamedParserException "RequestMessage ServerMethod WorkDoneProgressCreateParams ()" (BothFailed (NamedParserException "NotificationMessage ServerMethod PublishDiagnosticsParams" (NamedParserException "NotificationMessage ServerMethod PublishDiagnosticsParams" (NamedParserException "NotificationMessage ServerMethod PublishDiagnosticsParams" (NamedParserException "NotificationMessage ServerMethod PublishDiagnosticsParams" (NamedParserException "NotificationMessage ServerMethod PublishDiagnosticsParams" (NamedParserException "NotificationMessage ServerMethod PublishDiagnosticsParams" (NamedParserException "NotificationMessage ServerMethod PublishDiagnosticsParams" (NamedParserException "NotificationMessage ServerMethod PublishDiagnosticsParams" (NamedParserException "NotificationMessage ServerMethod PublishDiagnosticsParams" (NamedParserException "NotificationMessage ServerMethod PublishDiagnosticsParams" (NamedParserException "NotificationMessage ServerMethod PublishDiagnosticsParams" (NamedParserException "NotificationMessage ServerMethod PublishDiagnosticsParams" (NamedParserException "NotificationMessage ServerMethod PublishDiagnosticsParams" (NamedParserException "NotificationMessage ServerMethod PublishDiagnosticsParams" (NamedParserException "NotificationMessage ServerMethod PublishDiagnosticsParams" (NamedParserException "NotificationMessage ServerMethod PublishDiagnosticsParams" (NamedParserException "NotificationMessage ServerMethod PublishDiagnosticsParams" (NamedParserException "NotificationMessage ServerMethod PublishDiagnosticsParams" (NamedParserException "NotificationMessage ServerMethod PublishDiagnosticsParams" (NamedParserException "NotificationMessage ServerMethod PublishDiagnosticsParams" (NamedParserException "NotificationMessage ServerMethod PublishDiagnosticsParams" (NamedParserException "NotificationMessage ServerMethod PublishDiagnosticsParams" (NamedParserException "NotificationMessage ServerMethod PublishDiagnosticsParams" (NamedParserException "NotificationMessage ServerMethod PublishDiagnosticsParams" (NamedParserException "NotificationMessage ServerMethod PublishDiagnosticsParams" (NamedParserException "NotificationMessage ServerMethod PublishDiagnosticsParams" (NamedParserException "Response for id: IdInt 1" (NamedParserException "NotificationMessage ServerMethod (ProgressParams WorkDoneProgressBeginParams)" (BothFailed (Unexpected "ConduitParser.empty") (Unexpected "ConduitParser.empty")))))))))))))))))))))))))))))) (Unexpected "ConduitParser.empty"))))))))))))))))))))))))))))))
2020-09-18T15:51:18.5406996Z iface-error-test-2: OK (2.30s)
2020-09-18T15:51:20.8012527Z iface-error-test-3: OK (2.26s)
2020-09-18T15:51:21.2787088Z iface-th-test: OK (0.48s)
2020-09-18T15:51:21.6986795Z boot-def-test: OK (0.42s)
2020-09-18T15:51:22.2262970Z use rootUri: OK (0.53s)
2020-09-18T15:51:22.2264976Z async
2020-09-18T15:51:26.1455084Z command: OK (3.92s)
2020-09-18T15:51:29.9820080Z request: OK (3.84s)
2020-09-18T15:51:29.9824067Z client settings handling
2020-09-18T15:51:30.0089903Z ghcide does not support update config: OK (0.03s)
2020-09-18T15:51:30.0335925Z ghcide restarts shake session on config changes: OK (0.03s)
2020-09-18T15:51:30.0337193Z
2020-09-18T15:51:30.0337767Z 1 out of 330 tests failed (663.15s)
2020-09-18T15:51:30.0497560Z
2020-09-18T15:51:30.0499920Z ghcide> Test suite ghcide-tests failed
2020-09-18T15:51:30.0537355Z Test suite failure for package ghcide-0.4.0
2020-09-18T15:51:30.0539431Z ghcide-tests: exited with: ExitFailure 1
2020-09-18T15:51:30.0540917Z Logs printed to console
2020-09-18T15:51:30.0542215Z
2020-09-18T15:51:30.7385353Z ghcide> test (suite: ghcide-tests, args: --rerun)
2020-09-18T15:51:30.7386100Z
2020-09-18T15:51:30.7660788Z ghcide
2020-09-18T15:51:30.7681378Z Interface loading tests
2020-09-18T15:51:30.7715101Z iface-error-test-1: --> {
2020-09-18T15:51:30.7715990Z "jsonrpc": "2.0",
2020-09-18T15:51:30.7716395Z "params": {
2020-09-18T15:51:30.7717168Z "rootUri": "file:///tmp/extra-dir-91571856709076",
2020-09-18T15:51:30.7717715Z "processId": 24222,
2020-09-18T15:51:30.7718730Z "rootPath": "/tmp/extra-dir-91571856709076",
2020-09-18T15:51:30.7719256Z "capabilities": {
2020-09-18T15:51:30.7719674Z "window": {
2020-09-18T15:51:30.7720108Z "workDoneProgress": true
2020-09-18T15:51:30.7720533Z },
2020-09-18T15:51:30.7721061Z "workspace": {
2020-09-18T15:51:30.7721532Z "didChangeWatchedFiles": {
2020-09-18T15:51:30.7722087Z "dynamicRegistration": true
2020-09-18T15:51:30.7722535Z },
2020-09-18T15:51:30.7722970Z "symbol": {
2020-09-18T15:51:30.7723290Z "symbolKind": {
2020-09-18T15:51:30.7723629Z "valueSet": [
2020-09-18T15:51:30.7723955Z 1,
2020-09-18T15:51:30.7724244Z 2,
2020-09-18T15:51:30.7724520Z 3,
2020-09-18T15:51:30.7724810Z 4,
2020-09-18T15:51:30.7725081Z 5,
2020-09-18T15:51:30.7725376Z 6,
2020-09-18T15:51:30.7725664Z 7,
2020-09-18T15:51:30.7725934Z 8,
2020-09-18T15:51:30.7726227Z 9,
2020-09-18T15:51:30.7726499Z 10,
2020-09-18T15:51:30.7726794Z 11,
2020-09-18T15:51:30.7727085Z 12,
2020-09-18T15:51:30.7727566Z 13,
2020-09-18T15:51:30.7727863Z 14,
2020-09-18T15:51:30.7728140Z 15,
2020-09-18T15:51:30.7728431Z 16,
2020-09-18T15:51:30.7728723Z 17,
2020-09-18T15:51:30.7728999Z 18,
2020-09-18T15:51:30.7729293Z 19,
2020-09-18T15:51:30.7729583Z 20,
2020-09-18T15:51:30.7729859Z 21,
2020-09-18T15:51:30.7730149Z 22,
2020-09-18T15:51:30.7730541Z 23,
2020-09-18T15:51:30.7730832Z 24,
2020-09-18T15:51:30.7731124Z 25,
2020-09-18T15:51:30.7731398Z 26
2020-09-18T15:51:30.7731682Z ]
2020-09-18T15:51:30.7731938Z },
2020-09-18T15:51:30.7732271Z "dynamicRegistration": true
2020-09-18T15:51:30.7732599Z },
2020-09-18T15:51:30.7732881Z "workspaceEdit": {
2020-09-18T15:51:30.7733242Z "documentChanges": true
2020-09-18T15:51:30.7733544Z },
2020-09-18T15:51:30.7733857Z "didChangeConfiguration": {
2020-09-18T15:51:30.7734246Z "dynamicRegistration": true
2020-09-18T15:51:30.7734554Z },
2020-09-18T15:51:30.7734848Z "applyEdit": true,
2020-09-18T15:51:30.7735174Z "executeCommand": {
2020-09-18T15:51:30.7735546Z "dynamicRegistration": true
2020-09-18T15:51:30.7735872Z },
2020-09-18T15:51:30.7736164Z "workspaceFolders": true,
2020-09-18T15:51:30.7736523Z "configuration": true
2020-09-18T15:51:30.7736835Z },
2020-09-18T15:51:30.7737100Z "textDocument": {
2020-09-18T15:51:30.7737425Z "completion": {
2020-09-18T15:51:30.7737776Z "dynamicRegistration": true,
2020-09-18T15:51:30.7738169Z "contextSupport": true,
2020-09-18T15:51:30.7738534Z "completionItem": {
2020-09-18T15:51:30.7738881Z "tagSupport": {
2020-09-18T15:51:30.7739249Z "valueSet": [
2020-09-18T15:51:30.7739571Z 1
2020-09-18T15:51:30.7739865Z ]
2020-09-18T15:51:30.7740147Z },
2020-09-18T15:51:30.7740477Z "preselectSupport": true,
2020-09-18T15:51:30.7740908Z "commitCharactersSupport": true,
2020-09-18T15:51:30.7741325Z "snippetSupport": true,
2020-09-18T15:51:30.7741752Z "deprecatedSupport": true,
2020-09-18T15:51:30.7742157Z "documentationFormat": [
2020-09-18T15:51:30.7742504Z "plaintext",
2020-09-18T15:51:30.7742826Z "markdown"
2020-09-18T15:51:30.7743128Z ]
2020-09-18T15:51:30.7743387Z },
2020-09-18T15:51:30.7743712Z "completionItemKind": {
2020-09-18T15:51:30.7744061Z "valueSet": [
2020-09-18T15:51:30.7744386Z 1,
2020-09-18T15:51:30.7744677Z 2,
2020-09-18T15:51:30.7744953Z 3,
2020-09-18T15:51:30.7745246Z 4,
2020-09-18T15:51:30.7745532Z 5,
2020-09-18T15:51:30.7745804Z 6,
2020-09-18T15:51:30.7746098Z 7,
2020-09-18T15:51:30.7746371Z 8,
2020-09-18T15:51:30.7746662Z 9,
2020-09-18T15:51:30.7746950Z 10,
2020-09-18T15:51:30.7747228Z 11,
2020-09-18T15:51:30.7747518Z 12,
2020-09-18T15:51:30.7747797Z 13,
2020-09-18T15:51:30.7748169Z 14,
2020-09-18T15:51:30.7748458Z 15,
2020-09-18T15:51:30.7748733Z 16,
2020-09-18T15:51:30.7749025Z 17,
2020-09-18T15:51:30.7749298Z 18,
2020-09-18T15:51:30.7749589Z 19,
2020-09-18T15:51:30.7749876Z 20,
2020-09-18T15:51:30.7750151Z 21,
2020-09-18T15:51:30.7750441Z 22,
2020-09-18T15:51:30.7750715Z 23,
2020-09-18T15:51:30.7751083Z 24,
2020-09-18T15:51:30.7751372Z 25
2020-09-18T15:51:30.7751638Z ]
2020-09-18T15:51:30.7751910Z }
2020-09-18T15:51:30.7752166Z },
2020-09-18T15:51:30.7752457Z "documentHighlight": {
2020-09-18T15:51:30.7752832Z "dynamicRegistration": true
2020-09-18T15:51:30.7753146Z },
2020-09-18T15:51:30.7753447Z "synchronization": {
2020-09-18T15:51:30.7753822Z "dynamicRegistration": true,
2020-09-18T15:51:30.7754180Z "willSave": true,
2020-09-18T15:51:30.7754528Z "didSave": true,
2020-09-18T15:51:30.7754889Z "willSaveWaitUntil": true
2020-09-18T15:51:30.7755208Z },
2020-09-18T15:51:30.7755494Z "definition": {
2020-09-18T15:51:30.7755845Z "dynamicRegistration": true
2020-09-18T15:51:30.7756170Z },
2020-09-18T15:51:30.7756450Z "signatureHelp": {
2020-09-18T15:51:30.7756819Z "dynamicRegistration": true,
2020-09-18T15:51:30.7757213Z "signatureInformation": {
2020-09-18T15:51:30.7757594Z "ocumentationFormat": [
2020-09-18T15:51:30.7757957Z "plaintext",
2020-09-18T15:51:30.7760069Z "markdown"
2020-09-18T15:51:30.7760517Z ]
2020-09-18T15:51:30.7760885Z }
2020-09-18T15:51:30.7761221Z },
2020-09-18T15:51:30.7761627Z "references": {
2020-09-18T15:51:30.7762084Z "dynamicRegistration": true
2020-09-18T15:51:30.7762484Z },
2020-09-18T15:51:30.7762877Z "rangeFormatting": {
2020-09-18T15:51:30.7763327Z "dynamicRegistration": true
2020-09-18T15:51:30.7763746Z },
2020-09-18T15:51:30.7764129Z "codeAction": {
2020-09-18T15:51:30.7764572Z "codeActionLiteralSupport": {
2020-09-18T15:51:30.7765056Z "codeActionKind": {
2020-09-18T15:51:30.7765508Z "valueSet": [
2020-09-18T15:51:30.7765953Z "quickfix",
2020-09-18T15:51:30.7766375Z "refactor",
2020-09-18T15:51:30.7766804Z "refactor.extract",
2020-09-18T15:51:30.7767262Z "refactor.inline",
2020-09-18T15:51:30.7767713Z "refactor.rewrite",
2020-09-18T15:51:30.7768133Z "source",
2020-09-18T15:51:30.7768580Z "source.organizeImports"
2020-09-18T15:51:30.7768992Z ]
2020-09-18T15:51:30.7769373Z }
2020-09-18T15:51:30.7769739Z },
2020-09-18T15:51:30.7770170Z "dynamicRegistration": true
2020-09-18T15:51:30.7770592Z },
2020-09-18T15:51:30.7770973Z "foldingRange": {
2020-09-18T15:51:30.7771414Z "lineFoldingOnly": false,
2020-09-18T15:51:30.7771893Z "dynamicRegistration": true
2020-09-18T15:51:30.7772313Z },
2020-09-18T15:51:30.7772704Z "onTypeFormatting": {
2020-09-18T15:51:30.7773305Z "dynamicRegistration": true
2020-09-18T15:51:30.7773703Z },
2020-09-18T15:51:30.7774080Z "codeLens": {
2020-09-18T15:51:30.7774510Z "dynamicRegistration": true
2020-09-18T15:51:30.7774921Z },
2020-09-18T15:51:30.7775306Z "documentSymbol": {
2020-09-18T15:51:30.7775790Z "hierarchicalDocumentSymbolSupport": true,
2020-09-18T15:51:30.7776294Z "symbolKind": {
2020-09-18T15:51:30.7776718Z "valueSet": [
2020-09-18T15:51:30.7777223Z 1,
2020-09-18T15:51:30.7777606Z 2,
2020-09-18T15:51:30.7777968Z 3,
2020-09-18T15:51:30.7778346Z 4,
2020-09-18T15:51:30.7778718Z 5,
2020-09-18T15:51:30.7779080Z 6,
2020-09-18T15:51:30.7779454Z 7,
2020-09-18T15:51:30.7779829Z 8,
2020-09-18T15:51:30.7780210Z 9,
2020-09-18T15:51:30.7780590Z 10,
2020-09-18T15:51:30.7780957Z 11,
2020-09-18T15:51:30.7781338Z 12,
2020-09-18T15:51:30.7781706Z 13,
2020-09-18T15:51:30.7782090Z 14,
2020-09-18T15:51:30.7782469Z 15,
2020-09-18T15:51:30.7782835Z 16,
2020-09-18T15:51:30.7783244Z 17,
2020-09-18T15:51:30.7783613Z 18,
2020-09-18T15:51:30.7784938Z 19,
2020-09-18T15:51:30.7785366Z 20,
2020-09-18T15:51:30.7785738Z 21,
2020-09-18T15:51:30.7786125Z 22,
2020-09-18T15:51:30.7786492Z 23,
2020-09-18T15:51:30.7787045Z 24,
2020-09-18T15:51:30.7787497Z 25,
2020-09-18T15:51:30.7787865Z 26
2020-09-18T15:51:30.7788210Z ]
2020-09-18T15:51:30.7788536Z },
2020-09-18T15:51:30.7788910Z "dynamicRegistration": true
2020-09-18T15:51:30.7789289Z },
2020-09-18T15:51:30.7789575Z "colorProvider": {
2020-09-18T15:51:30.7790001Z "dynamicRegistration": true
2020-09-18T15:51:30.7790385Z },
2020-09-18T15:51:30.7790722Z "documentLink": {
2020-09-18T15:51:30.7791151Z "dynamicRegistration": true
2020-09-18T15:51:30.7791509Z },
2020-09-18T15:51:30.7791850Z "formatting": {
2020-09-18T15:51:30.7792262Z "dynamicRegistration": true
2020-09-18T15:51:30.7792624Z },
2020-09-18T15:51:30.7792977Z "implementation": {
2020-09-18T15:51:30.7793388Z "dynamicRegistration": true
2020-09-18T15:51:30.7793765Z },
2020-09-18T15:51:30.7794111Z "typeDefinition": {
2020-09-18T15:51:30.7794519Z "dynamicRegistration": true
2020-09-18T15:51:30.7794893Z },
2020-09-18T15:51:30.7795232Z "publishDiagnostics": {
2020-09-18T15:51:30.7795627Z "tagSupport": {
2020-09-18T15:51:30.7796017Z "valueSet": [
2020-09-18T15:51:30.7796372Z 1,
2020-09-18T15:51:30.7796718Z 2
2020-09-18T15:51:30.7797054Z ]
2020-09-18T15:51:30.7797366Z },
2020-09-18T15:51:30.7797745Z "relatedInformation": true
2020-09-18T15:51:30.7798102Z },
2020-09-18T15:51:30.7798596Z "rename": {
2020-09-18T15:51:30.7798999Z "prepareSupport": true,
2020-09-18T15:51:30.7799424Z "dynamicRegistration": true
2020-09-18T15:51:30.7799979Z },
2020-09-18T15:51:30.7800294Z "hover": {
2020-09-18T15:51:30.7800719Z "contentFormat": [
2020-09-18T15:51:30.7801104Z "plaintext",
2020-09-18T15:51:30.7801452Z "markdown"
2020-09-18T15:51:30.7801789Z ],
2020-09-18T15:51:30.7802158Z "dynamicRegistration": true
2020-09-18T15:51:30.7802532Z }
2020-09-18T15:51:30.7802826Z }
2020-09-18T15:51:30.7803094Z },
2020-09-18T15:51:30.7803527Z "trace": "off"
2020-09-18T15:51:30.7803812Z },
2020-09-18T15:51:30.7804118Z "method": "initialize",
2020-09-18T15:51:30.7804440Z "id": 0
2020-09-18T15:51:30.7804698Z }
2020-09-18T15:51:30.7828794Z ghcide version: 0.4.0 (GHC: 8.8) (PATH: /home/vsts/work/1/s/.stack-work/install/x86_64-linux/29854865ecf208e899fd934ddedcbe762bfbad035e026169f8becaea45390175/8.8.4/bin/ghcide) (GIT hash: 0819541efac9d8faacf7147044db96be7c3b7281)
2020-09-18T15:51:30.7829741Z Starting LSP server...
2020-09-18T15:51:30.7831950Z If you are seeing this in a terminal, you probably should have run ghcide WITHOUT the --lsp option!
2020-09-18T15:51:30.7878899Z Started LSP server in 0.00s
2020-09-18T15:51:30.7902797Z [INFO] Registering ide configuration: IdeConfiguration {workspaceFolders = fromList [NormalizedUri (-7110252795089024023) "file:///tmp/extra-dir-91571856709076"], clientSettings = hashed Nothing}
2020-09-18T15:51:30.7905759Z <-- {
2020-09-18T15:51:30.7906492Z "tag": "RspInitialize",
2020-09-18T15:51:30.7907065Z "contents": {
2020-09-18T15:51:30.7907607Z "result": {
2020-09-18T15:51:30.7908170Z "capabilities": {
2020-09-18T15:51:30.7908780Z "typeDefinitionProvider": true,
2020-09-18T15:51:30.7909438Z "foldingRangeProvider": false,
2020-09-18T15:51:30.7910067Z "textDocumentSync": {
2020-09-18T15:51:30.7910664Z "openClose": true,
2020-09-18T15:51:30.7911268Z "change": 2,
2020-09-18T15:51:30.7917557Z "save": {}
2020-09-18T15:51:30.7919396Z },
2020-09-18T15:51:30.7920023Z "workspace": {
2020-09-18T15:51:30.7920567Z "workspaceFolders": {
2020-09-18T15:51:30.7921298Z "supported": true,
2020-09-18T15:51:30.7921889Z "changeNotifications": true
2020-09-18T15:51:30.7922397Z }
2020-09-18T15:51:30.7922812Z },
2020-09-18T15:51:30.7923305Z "implementationProvider": true,
2020-09-18T15:51:30.7923853Z "executeCommandProvider": {
2020-09-18T15:51:30.7924380Z "commands": [
2020-09-18T15:51:30.7924934Z "24228:ghcide:typesignature.add"
2020-09-18T15:51:30.7925431Z ]
2020-09-18T15:51:30.7925860Z },
2020-09-18T15:51:30.7926336Z "renameProvider": false,
2020-09-18T15:51:30.7926864Z "colorProvider": false,
2020-09-18T15:51:30.7927395Z "definitionProvider": true,
2020-09-18T15:51:30.7927921Z "hoverProvider": true,
2020-09-18T15:51:30.7928433Z "codeActionProvider": true,
2020-09-18T15:51:30.7928962Z "completionProvider": {
2020-09-18T15:51:30.7929500Z "triggerCharacters": [
2020-09-18T15:51:30.7929991Z "."
2020-09-18T15:51:30.7930448Z ],
2020-09-18T15:51:30.7930965Z "resolveProvider": false
2020-09-18T15:51:30.7932563Z },
2020-09-18T15:51:30.7933154Z "codeLensProvider": {},
2020-09-18T15:51:30.7933700Z "documentSymbolProvider": true
2020-09-18T15:51:30.7934128Z }
2020-09-18T15:51:30.7934539Z },
2020-09-18T15:51:30.7934977Z "jsonrpc": "2.0",
2020-09-18T15:51:30.7935418Z "id": 0
2020-09-18T15:51:30.7935827Z }
2020-09-18T15:51:30.7936437Z }
2020-09-18T15:51:30.7937351Z --> {
2020-09-18T15:51:30.7938856Z "jsonrpc": "2.0",
2020-09-18T15:51:30.7939449Z "params": {},
2020-09-18T15:51:30.7939967Z "method": "initialized"
2020-09-18T15:51:30.7941356Z }
2020-09-18T15:51:30.7942217Z --> {
2020-09-18T15:51:30.7942748Z "jsonrpc": "2.0",
2020-09-18T15:51:30.7943247Z "params": {
2020-09-18T15:51:30.7943732Z "textDocument": {
2020-09-18T15:51:30.7944278Z "languageId": "haskell",
2020-09-18T15:51:30.7944916Z "text": "module B(y) where\n\ny :: Int\ny = undefined\n",
2020-09-18T15:51:30.7946102Z "uri": "file:///tmp/extra-dir-91571856709076/B.hs",
2020-09-18T15:51:30.7946724Z "version": 0
2020-09-18T15:51:30.7947232Z }
2020-09-18T15:51:30.7947660Z },
2020-09-18T15:51:30.7948149Z "method": "textDocument/didOpen"
2020-09-18T15:51:30.7948616Z }
2020-09-18T15:51:30.7951500Z [DEBUG] Set files of interest to: [(NormalizedFilePath "/tmp/extra-dir-91571856709076/B.hs",Modified)]
2020-09-18T15:51:30.7952418Z [DEBUG] Finishing build session(exception: AsyncCancelled)
2020-09-18T15:51:30.7954469Z [DEBUG] Restarting build session (aborting the previous one took 0.00s)
2020-09-18T15:51:30.7956925Z <-- {
2020-09-18T15:51:30.7957259Z "tag": "NotLogMessage",
2020-09-18T15:51:30.7957604Z "contents": {
2020-09-18T15:51:30.7957942Z "jsonrpc": "2.0",
2020-09-18T15:51:30.7958517Z "params": {
2020-09-18T15:51:30.7958874Z "type": 4,
2020-09-18T15:51:30.7959317Z "message": "Finishing build session(exception: AsyncCancelled)"
2020-09-18T15:51:30.7959748Z },
2020-09-18T15:51:30.7960028Z "method": "window/logMessage"
2020-09-18T15:51:30.7960294Z }
2020-09-18T15:51:30.7960495Z }
2020-09-18T15:51:30.7960852Z <-- {
2020-09-18T15:51:30.7961119Z "tag": "NotLogMessage",
2020-09-18T15:51:30.7961403Z "contents": {
2020-09-18T15:51:30.7961672Z "jsonrpc": "2.0",
2020-09-18T15:51:30.7961961Z "params": {
2020-09-18T15:51:30.7962233Z "type": 4,
2020-09-18T15:51:30.7962640Z "message": "Restarting build session (aborting the previous one took 0.00s)"
2020-09-18T15:51:30.7963025Z },
2020-09-18T15:51:30.7963295Z "method": "window/logMessage"
2020-09-18T15:51:30.7963569Z }
2020-09-18T15:51:30.7963753Z }
2020-09-18T15:51:30.7973441Z [INFO] Opened text document: file:///tmp/extra-dir-91571856709076/B.hs
2020-09-18T15:51:30.7994275Z [INFO] Consulting the cradle for "B.hs"
2020-09-18T15:51:30.7995872Z Output from setting up the cradle Cradle {cradleRootDir = "/tmp/extra-dir-91571856709076", cradleOptsProg = CradleAction: Direct}
2020-09-18T15:51:30.7996713Z <-- {
2020-09-18T15:51:30.7997125Z "tag": "ReqWorkDoneProgressCreate",
2020-09-18T15:51:30.7997511Z "contents": {
2020-09-18T15:51:30.7997865Z "jsonrpc": "2.0",
2020-09-18T15:51:30.7998368Z "params": {
2020-09-18T15:51:30.7998739Z "token": "1"
2020-09-18T15:51:30.7999066Z },
2020-09-18T15:51:30.7999427Z "method": "window/workDoneProgress/create",
2020-09-18T15:51:30.7999820Z "id": 0
2020-09-18T15:51:30.8000111Z }
2020-09-18T15:51:30.8000355Z }
2020-09-18T15:51:30.8000781Z <-- {
2020-09-18T15:51:30.8001114Z "tag": "NotWorkDoneProgressBegin",
2020-09-18T15:51:30.8001482Z "contents": {
2020-09-18T15:51:30.8001829Z "jsonrpc": "2.0",
2020-09-18T15:51:30.8002166Z "params": {
2020-09-18T15:51:30.8002507Z "value": {
2020-09-18T15:51:30.8002863Z "kind": "begin",
2020-09-18T15:51:30.8003266Z "title": "Processing"
2020-09-18T15:51:30.8003629Z },
2020-09-18T15:51:30.8003944Z "token": "1"
2020-09-18T15:51:30.8004265Z },
2020-09-18T15:51:30.8004576Z "method": "$/progress"
2020-09-18T15:51:30.8004901Z }
2020-09-18T15:51:30.8005155Z }
2020-09-18T15:51:30.8005540Z <-- {
2020-09-18T15:51:30.8005873Z "tag": "NotCustomServer",
2020-09-18T15:51:30.8006207Z "contents": {
2020-09-18T15:51:30.8006736Z "jsonrpc": "2.0",
2020-09-18T15:51:30.8007079Z "params": "B.hs",
2020-09-18T15:51:30.8007467Z "method": "ghcide/cradle/loaded"
2020-09-18T15:51:30.8007809Z }
2020-09-18T15:51:30.8008051Z }
2020-09-18T15:51:30.8008459Z <-- {
2020-09-18T15:51:30.8008787Z "tag": "ReqWorkDoneProgressCreate",
2020-09-18T15:51:30.8009153Z "contents": {
2020-09-18T15:51:30.8009489Z "jsonrpc": "2.0",
2020-09-18T15:51:30.8009823Z "params": {
2020-09-18T15:51:30.8010167Z "token": 0
2020-09-18T15:51:30.8010474Z },
2020-09-18T15:51:30.8010950Z "method": "window/workDoneProgress/create",
2020-09-18T15:51:30.8011338Z "id": 1
2020-09-18T15:51:30.8011616Z }
2020-09-18T15:51:30.8011872Z }
2020-09-18T15:51:30.8012261Z <-- {
2020-09-18T15:51:30.8012605Z "tag": "NotWorkDoneProgressBegin",
2020-09-18T15:51:30.8012970Z "contents": {
2020-09-18T15:51:30.8013301Z "jsonrpc": "2.0",
2020-09-18T15:51:30.8013655Z "params": {
2020-09-18T15:51:30.8013934Z "value": {
2020-09-18T15:51:30.8014253Z "kind": "begin",
2020-09-18T15:51:30.8014603Z "cancellable": false,
2020-09-18T15:51:30.8015281Z "title": "Setting up extra-dir-91571856709076 (for B.hs)"
2020-09-18T15:51:30.8015683Z },
2020-09-18T15:51:30.8015943Z "token": 0
2020-09-18T15:51:30.8016215Z },
2020-09-18T15:51:30.8016489Z "method": "$/progress"
2020-09-18T15:51:30.8016746Z }
2020-09-18T15:51:30.8016983Z }
2020-09-18T15:51:30.8571311Z [DEBUG] Session loading result: Right (ComponentOptions {componentOptions = ["-Wmissing-signatures","B","A","P"], componentRoot = "/tmp/extra-dir-91571856709076", componentDependencies = []},"/home/vsts/work/1/.stack/programs/x86_64-linux/ghc-8.8.4/lib/ghc-8.8.4")
2020-09-18T15:51:30.8573752Z <-- {
2020-09-18T15:51:30.8574678Z "tag": "NotWorkDoneProgressEnd",
2020-09-18T15:51:30.8575306Z "contents": {
2020-09-18T15:51:30.8575626Z "jsonrpc": "2.0",
2020-09-18T15:51:30.8575955Z "params": {
2020-09-18T15:51:30.8576231Z "value": {
2020-09-18T15:51:30.8576541Z "kind": "end"
2020-09-18T15:51:30.8576808Z },
2020-09-18T15:51:30.8577075Z "token": 0
2020-09-18T15:51:30.8577333Z },
2020-09-18T15:51:30.8577585Z "method": "$/progress"
2020-09-18T15:51:30.8577853Z }
2020-09-18T15:51:30.8578038Z }
2020-09-18T15:51:30.8998136Z <-- {
2020-09-18T15:51:30.9000687Z "tag": "NotWorkDoneProgressReport",
2020-09-18T15:51:30.9001482Z "contents": {
2020-09-18T15:51:30.9002646Z "jsonrpc": "2.0",
2020-09-18T15:51:30.9003409Z "params": {
2020-09-18T15:51:30.9004028Z "value": {
2020-09-18T15:51:30.9004415Z "kind": "report",
2020-09-18T15:51:30.9004822Z "message": "1/2"
2020-09-18T15:51:30.9005143Z },
2020-09-18T15:51:30.9005435Z "token": "1"
2020-09-18T15:51:30.9005751Z },
2020-09-18T15:51:30.9006053Z "method": "$/progress"
2020-09-18T15:51:30.9006371Z }
2020-09-18T15:51:30.9006577Z }
2020-09-18T15:51:30.9151706Z [INFO] Using interface files cache dir: /home/vsts/.cache/ghcide/main-67f5d3e80e9a5dab967334c225648bdcd080465f
2020-09-18T15:51:30.9152593Z [INFO] Making new HscEnv[main]
2020-09-18T15:51:30.9271836Z [DEBUG] New Component Cache HscEnvEq: (([],Just HscEnvEq 2),fromList [("/tmp/extra-dir-91571856709076/hie.yaml",Just 2020-09-18 15:51:30.760871614 UTC)])
2020-09-18T15:51:30.9276521Z [DEBUG] Known files updated: fromList [(P,["/tmp/extra-dir-91571856709076/P.hs"]),(A,["/tmp/extra-dir-91571856709076/A.hs"]),(special,["/tmp/extra-dir-91571856709076/B.hs"]),(B,["/tmp/extra-dir-91571856709076/B.hs"])]
2020-09-18T15:51:30.9286112Z [DEBUG] Finishing build session(exception: AsyncCancelled)
2020-09-18T15:51:30.9293607Z [DEBUG] Restarting build session (aborting the previous one took 0.00s)
2020-09-18T15:51:30.9299362Z <-- {
2020-09-18T15:51:30.9300729Z "tag": "NotLogMessage",
2020-09-18T15:51:30.9301597Z "contents": {
2020-09-18T15:51:30.9302366Z "jsonrpc": "2.0",
2020-09-18T15:51:30.9302942Z "params": {
2020-09-18T15:51:30.9303545Z "type": 4,
2020-09-18T15:51:30.9304299Z "message": "Finishing build session(exception: AsyncCancelled)"
2020-09-18T15:51:30.9305082Z },
2020-09-18T15:51:30.9305626Z "method": "window/logMessage"
2020-09-18T15:51:30.9306191Z }
2020-09-18T15:51:30.9306546Z }
2020-09-18T15:51:30.9307482Z <-- {
2020-09-18T15:51:30.9308034Z "tag": "NotLogMessage",
2020-09-18T15:51:30.9308959Z "contents": {
2020-09-18T15:51:30.9309531Z "jsonrpc": "2.0",
2020-09-18T15:51:30.9310114Z "params": {
2020-09-18T15:51:30.9310690Z "type": 4,
2020-09-18T15:51:30.9311414Z "message": "Restarting build session (aborting the previous one took 0.00s)"
2020-09-18T15:51:30.9312170Z },
2020-09-18T15:51:30.9312720Z "method": "window/logMessage"
2020-09-18T15:51:30.9313288Z }
2020-09-18T15:51:30.9313697Z }
2020-09-18T15:51:30.9366129Z <-- {
2020-09-18T15:51:30.9366821Z "tag": "ReqRegisterCapability",
2020-09-18T15:51:30.9367261Z "contents": {
2020-09-18T15:51:30.9367684Z "jsonrpc": "2.0",
2020-09-18T15:51:30.9368105Z "params": {
2020-09-18T15:51:30.9368519Z "registrations": [
2020-09-18T15:51:30.9368932Z {
2020-09-18T15:51:30.9369354Z "registerOptions": {
2020-09-18T15:51:30.9369844Z "watchers": [
2020-09-18T15:51:30.9370291Z {
2020-09-18T15:51:30.9370744Z "kind": 5,
2020-09-18T15:51:30.9371594Z "globPattern": "/tmp/extra-dir-91571856709076/hie.yaml"
2020-09-18T15:51:30.9372177Z }
2020-09-18T15:51:30.9372577Z ]
2020-09-18T15:51:30.9372980Z },
2020-09-18T15:51:30.9373804Z "method": "workspace/didChangeWatchedFiles",
2020-09-18T15:51:30.9374724Z "id": "/tmp/extra-dir-91571856709076/hie.yaml"
2020-09-18T15:51:30.9375346Z }
2020-09-18T15:51:30.9375814Z ]
2020-09-18T15:51:30.9376252Z },
2020-09-18T15:51:30.9376772Z "method": "client/registerCapability",
2020-09-18T15:51:30.9377306Z "id": 2
2020-09-18T15:51:30.9377746Z }
2020-09-18T15:51:30.9378166Z }
2020-09-18T15:51:30.9424691Z <-- {
2020-09-18T15:51:30.9425205Z "tag": "ReqRegisterCapability",
2020-09-18T15:51:30.9425525Z "contents": {
2020-09-18T15:51:30.9425823Z "jsonrpc": "2.0",
2020-09-18T15:51:30.9426100Z "params": {
2020-09-18T15:51:30.9426400Z "registrations": [
2020-09-18T15:51:30.9426679Z {
2020-09-18T15:51:30.9426991Z "registerOptions": {
2020-09-18T15:51:30.9427352Z "watchers": [
2020-09-18T15:51:30.9427659Z {
2020-09-18T15:51:30.9428000Z "kind": 5,
2020-09-18T15:51:30.9428688Z "globPattern": "/tmp/extra-dir-91571856709076/B.hs"
2020-09-18T15:51:30.9429121Z }
2020-09-18T15:51:30.9429404Z ]
2020-09-18T15:51:30.9429662Z },
2020-09-18T15:51:30.9430020Z "method": "workspace/didChangeWatchedFiles",
2020-09-18T15:51:30.9430640Z "id": "/tmp/extra-dir-91571856709076/B.hs"
2020-09-18T15:51:30.9431001Z }
2020-09-18T15:51:30.9431245Z ]
2020-09-18T15:51:30.9431468Z },
2020-09-18T15:51:30.9431765Z "method": "client/registerCapability",
2020-09-18T15:51:30.9432078Z "id": 3
2020-09-18T15:51:30.9432295Z }
2020-09-18T15:51:30.9432493Z }
2020-09-18T15:51:30.9450118Z <-- {
2020-09-18T15:51:30.9450625Z "tag": "ReqRegisterCapability",
2020-09-18T15:51:30.9450938Z "contents": {
2020-09-18T15:51:30.9451214Z "jsonrpc": "2.0",
2020-09-18T15:51:30.9451698Z "params": {
2020-09-18T15:51:30.9451984Z "registrations": [
2020-09-18T15:51:30.9452279Z {
2020-09-18T15:51:30.9452587Z "registerOptions": {
2020-09-18T15:51:30.9452937Z "watchers": [
2020-09-18T15:51:30.9453265Z {
2020-09-18T15:51:30.9453583Z "kind": 5,
2020-09-18T15:51:30.9454291Z "globPattern": "/tmp/extra-dir-91571856709076/A.hs"
2020-09-18T15:51:30.9454721Z }
2020-09-18T15:51:30.9455127Z ]
2020-09-18T15:51:30.9455404Z },
2020-09-18T15:51:30.9455763Z "method": "workspace/didChangeWatchedFiles",
2020-09-18T15:51:30.9456402Z "id": "/tmp/extra-dir-91571856709076/A.hs"
2020-09-18T15:51:30.9456764Z }
2020-09-18T15:51:30.9456992Z ]
2020-09-18T15:51:30.9457229Z },
2020-09-18T15:51:30.9457526Z "method": "client/registerCapability",
2020-09-18T15:51:30.9457828Z "id": 4
2020-09-18T15:51:30.9458060Z }
2020-09-18T15:51:30.9458245Z }
2020-09-18T15:51:31.0091561Z <-- {
2020-09-18T15:51:31.0093545Z "tag": "NotWorkDoneProgressReport",
2020-09-18T15:51:31.0094693Z "contents": {
2020-09-18T15:51:31.0095772Z "jsonrpc": "2.0",
2020-09-18T15:51:31.0096831Z "params": {
2020-09-18T15:51:31.0097968Z "value": {
2020-09-18T15:51:31.0099446Z "kind": "report",
2020-09-18T15:51:31.0100261Z "message": "2/5"
2020-09-18T15:51:31.0100932Z },
2020-09-18T15:51:31.0101568Z "token": "1"
2020-09-18T15:51:31.0102177Z },
2020-09-18T15:51:31.0102810Z "method": "$/progress"
2020-09-18T15:51:31.0103424Z }
2020-09-18T15:51:31.0103915Z }
2020-09-18T15:51:31.0232452Z <-- {
2020-09-18T15:51:31.0233841Z "tag": "NotWorkDoneProgressEnd",
2020-09-18T15:51:31.0234325Z "contents": {
2020-09-18T15:51:31.0234708Z "jsonrpc": "2.0",
2020-09-18T15:51:31.0235064Z "params": {
2020-09-18T15:51:31.0235446Z "value": {
2020-09-18T15:51:31.0235851Z "kind": "end"
2020-09-18T15:51:31.0236208Z },
2020-09-18T15:51:31.0236570Z "token": "1"
2020-09-18T15:51:31.0236905Z },
2020-09-18T15:51:31.0237263Z "method": "$/progress"
2020-09-18T15:51:31.0237619Z }
2020-09-18T15:51:31.0237893Z }
2020-09-18T15:51:31.0352867Z <-- {
2020-09-18T15:51:31.0357974Z "tag": "NotPublishDiagnostics",
2020-09-18T15:51:31.0358677Z "contents": {
2020-09-18T15:51:31.0361142Z "jsonrpc": "2.0",
2020-09-18T15:51:31.0361945Z "params": {
2020-09-18T15:51:31.0363196Z "uri": "file:///tmp/extra-dir-91571856709076/P.hs",
2020-09-18T15:51:31.0363722Z "diagnostics": [
2020-09-18T15:51:31.0364112Z {
2020-09-18T15:51:31.0364510Z "severity": 2,
2020-09-18T15:51:31.0364956Z "range": {
2020-09-18T15:51:31.0365389Z "start": {
2020-09-18T15:51:31.0366864Z "line": 4,
2020-09-18T15:51:31.0367340Z "character": 0
2020-09-18T15:51:31.0367726Z },
2020-09-18T15:51:31.0368063Z "end": {
2020-09-18T15:51:31.0368463Z "line": 4,
2020-09-18T15:51:31.0368869Z "character": 3
2020-09-18T15:51:31.0369254Z }
2020-09-18T15:51:31.0369580Z },
2020-09-18T15:51:31.0369946Z "source": "typecheck",
2020-09-18T15:51:31.0370772Z "message": "Top-level binding with no type signature: bar :: Int"
2020-09-18T15:51:31.0371260Z }
2020-09-18T15:51:31.0371542Z ]
2020-09-18T15:51:31.0371824Z },
2020-09-18T15:51:31.0372166Z "method": "textDocument/publishDiagnostics"
2020-09-18T15:51:31.0372756Z }
2020-09-18T15:51:31.0373007Z }
2020-09-18T15:51:31.0373405Z --> {
2020-09-18T15:51:31.0373716Z "jsonrpc": "2.0",
2020-09-18T15:51:31.0374025Z "params": {
2020-09-18T15:51:31.0374368Z "contentChanges": [
2020-09-18T15:51:31.0374694Z {
2020-09-18T15:51:31.0375090Z "text": "module B where\ny :: Bool\ny = undefined\n"
2020-09-18T15:51:31.0375507Z }
2020-09-18T15:51:31.0375775Z ],
2020-09-18T15:51:31.0376129Z "textDocument": {
2020-09-18T15:51:31.0376770Z "uri": "file:///tmp/extra-dir-91571856709076/B.hs",
2020-09-18T15:51:31.0377314Z "version": 1
2020-09-18T15:51:31.0377633Z }
2020-09-18T15:51:31.0377886Z },
2020-09-18T15:51:31.0378209Z "method": "textDocument/didChange"
2020-09-18T15:51:31.0378530Z }
2020-09-18T15:51:31.0378917Z --> {
2020-09-18T15:51:31.0379225Z "jsonrpc": "2.0",
2020-09-18T15:51:31.0379536Z "params": {
2020-09-18T15:51:31.0379868Z "textDocument": {
2020-09-18T15:51:31.0380501Z "uri": "file:///tmp/extra-dir-91571856709076/B.hs"
2020-09-18T15:51:31.0380885Z }
2020-09-18T15:51:31.0381104Z },
2020-09-18T15:51:31.0381403Z "method": "textDocument/didSave"
2020-09-18T15:51:31.0381720Z }
2020-09-18T15:51:31.0382034Z [DEBUG] finish: InitialLoad (took 0.10s)
2020-09-18T15:51:31.0382418Z [DEBUG] finish: InitialLoad (took 0.09s)
2020-09-18T15:51:31.0382810Z [DEBUG] finish: InitialLoad (took 0.10s)
2020-09-18T15:51:31.0383261Z <-- {
2020-09-18T15:51:31.0383574Z "tag": "NotLogMessage",
2020-09-18T15:51:31.0383915Z "contents": {
2020-09-18T15:51:31.0384241Z "jsonrpc": "2.0",
2020-09-18T15:51:31.0384579Z "params": {
2020-09-18T15:51:31.0384900Z "type": 4,
2020-09-18T15:51:31.0385311Z "message": "finish: InitialLoad (took 0.10s)"
2020-09-18T15:51:31.0385694Z },
2020-09-18T15:51:31.0386012Z "method": "window/logMessage"
2020-09-18T15:51:31.0386335Z }
2020-09-18T15:51:31.0386575Z }
2020-09-18T15:51:31.0386964Z <-- {
2020-09-18T15:51:31.0387280Z "tag": "NotLogMessage",
2020-09-18T15:51:31.0387601Z "contents": {
2020-09-18T15:51:31.0387934Z "jsonrpc": "2.0",
2020-09-18T15:51:31.0388252Z "params": {
2020-09-18T15:51:31.0388584Z "type": 4,
2020-09-18T15:51:31.0388992Z "message": "finish: InitialLoad (took 0.09s)"
2020-09-18T15:51:31.0389356Z },
2020-09-18T15:51:31.0389680Z "method": "window/logMessage"
2020-09-18T15:51:31.0389989Z }
2020-09-18T15:51:31.0390238Z }
2020-09-18T15:51:31.0390626Z <-- {
2020-09-18T15:51:31.0390930Z "tag": "NotLogMessage",
2020-09-18T15:51:31.0391267Z "contents": {
2020-09-18T15:51:31.0391584Z "jsonrpc": "2.0",
2020-09-18T15:51:31.0391924Z "params": {
2020-09-18T15:51:31.0392257Z "type": 4,
2020-09-18T15:51:31.0392651Z "message": "finish: InitialLoad (took 0.10s)"
2020-09-18T15:51:31.0393028Z },
2020-09-18T15:51:31.0393347Z "method": "window/logMessage"
2020-09-18T15:51:31.0393674Z }
2020-09-18T15:51:31.0393919Z }
2020-09-18T15:51:31.0394559Z [DEBUG] Set files of interest to: [(NormalizedFilePath "/tmp/extra-dir-91571856709076/B.hs",Modified)]
2020-09-18T15:51:31.0402296Z [DEBUG] Restarting build session (aborting the previous one took 0.00s)
2020-09-18T15:51:31.0402945Z [DEBUG] Finishing build session(exception: AsyncCancelled)
2020-09-18T15:51:31.0408393Z [INFO] Modified text document: file:///tmp/extra-dir-91571856709076/B.hs
2020-09-18T15:51:31.0416566Z [DEBUG] Set files of interest to: [(NormalizedFilePath "/tmp/extra-dir-91571856709076/B.hs",OnDisk)]
2020-09-18T15:51:31.0417861Z [DEBUG] Finishing build session(exception: AsyncCancelled)
2020-09-18T15:51:31.0420611Z <-- {
2020-09-18T15:51:31.0421264Z "tag": "NotLogMessage",
2020-09-18T15:51:31.0422509Z "contents": {
2020-09-18T15:51:31.0422899Z "jsonrpc": "2.0",
2020-09-18T15:51:31.0423229Z "params": {
2020-09-18T15:51:31.0423500Z "type": 4,
2020-09-18T15:51:31.0424140Z "message": "Restarting build session (aborting the previous one took 0.00s)"
2020-09-18T15:51:31.0424561Z },
2020-09-18T15:51:31.0424861Z "method": "window/logMessage"
2020-09-18T15:51:31.0425171Z }
2020-09-18T15:51:31.0425394Z }
2020-09-18T15:51:31.0425914Z <-- {
2020-09-18T15:51:31.0426221Z "tag": "NotLogMessage",
2020-09-18T15:51:31.0426495Z "contents": {
2020-09-18T15:51:31.0426782Z "jsonrpc": "2.0",
2020-09-18T15:51:31.0427055Z "params": {
2020-09-18T15:51:31.0427340Z "type": 4,
2020-09-18T15:51:31.0427852Z "message": "Finishing build session(exception: AsyncCancelled)"
2020-09-18T15:51:31.0428217Z },
2020-09-18T15:51:31.0428494Z "method": "window/logMessage"
2020-09-18T15:51:31.0428757Z }
2020-09-18T15:51:31.0428956Z }
2020-09-18T15:51:31.0429310Z <-- {
2020-09-18T15:51:31.0429557Z "tag": "NotLogMessage",
2020-09-18T15:51:31.0430175Z [DEBUG] Restarting build session (aborting the previous one took 0.00s)
2020-09-18T15:51:31.0430711Z "contents": {
2020-09-18T15:51:31.0430995Z "jsonrpc": "2.0",
2020-09-18T15:51:31.0431285Z "params": {
2020-09-18T15:51:31.0431864Z [INFO] Saved text document: file:///tmp/extra-dir-91571856709076/B.hs
2020-09-18T15:51:31.0432264Z "type": 4,
2020-09-18T15:51:31.0432650Z "message": "Finishing build session(exception: AsyncCancelled)"
2020-09-18T15:51:31.0433028Z },
2020-09-18T15:51:31.0433303Z "method": "window/logMessage"
2020-09-18T15:51:31.0433563Z }
2020-09-18T15:51:31.0433762Z }
2020-09-18T15:51:31.0434079Z <-- {
2020-09-18T15:51:31.0434341Z "tag": "NotLogMessage",
2020-09-18T15:51:31.0434621Z "contents": {
2020-09-18T15:51:31.0434888Z "jsonrpc": "2.0",
2020-09-18T15:51:31.0435176Z "params": {
2020-09-18T15:51:31.0435443Z "type": 4,
2020-09-18T15:51:31.0435849Z "message": "Restarting build session (aborting the previous one took 0.00s)"
2020-09-18T15:51:31.0436236Z },
2020-09-18T15:51:31.0436501Z "method": "window/logMessage"
2020-09-18T15:51:31.0436778Z }
2020-09-18T15:51:31.0436961Z }
2020-09-18T15:51:31.0454846Z <-- {
2020-09-18T15:51:31.0456450Z "tag": "ReqWorkDoneProgressCreate",
2020-09-18T15:51:31.0457147Z "contents": {
2020-09-18T15:51:31.0458059Z "jsonrpc": "2.0",
2020-09-18T15:51:31.0458770Z "params": {
2020-09-18T15:51:31.0459306Z "token": "10"
2020-09-18T15:51:31.0459795Z },
2020-09-18T15:51:31.0460321Z "method": "window/workDoneProgress/create",
2020-09-18T15:51:31.0460853Z "id": 5
2020-09-18T15:51:31.0461307Z }
2020-09-18T15:51:31.0461719Z }
2020-09-18T15:51:31.0462402Z <-- {
2020-09-18T15:51:31.0465195Z "tag": "NotWorkDoneProgressBegin",
2020-09-18T15:51:31.0465877Z "contents": {
2020-09-18T15:51:31.0466205Z "jsonrpc": "2.0",
2020-09-18T15:51:31.0466560Z "params": {
2020-09-18T15:51:31.0466885Z "value": {
2020-09-18T15:51:31.0467228Z "kind": "begin",
2020-09-18T15:51:31.0467597Z "title": "Processing"
2020-09-18T15:51:31.0467907Z },
2020-09-18T15:51:31.0468210Z "token": "10"
2020-09-18T15:51:31.0468506Z },
2020-09-18T15:51:31.0468793Z "method": "$/progress"
2020-09-18T15:51:31.0469149Z }
2020-09-18T15:51:31.0469387Z }
2020-09-18T15:51:31.0470568Z [INFO] Typechecking reverse dependencies forNormalizedFilePath "/tmp/extra-dir-91571856709076/B.hs": [NormalizedFilePath "/tmp/extra-dir-91571856709076/P.hs",NormalizedFilePath "/tmp/extra-dir-91571856709076/A.hs"]
2020-09-18T15:51:31.0560229Z <-- {
2020-09-18T15:51:31.0560752Z "tag": "NotWorkDoneProgressEnd",
2020-09-18T15:51:31.0561090Z "contents": {
2020-09-18T15:51:31.0561409Z "jsonrpc": "2.0",
2020-09-18T15:51:31.0561714Z "params": {
2020-09-18T15:51:31.0562037Z "value": {
2020-09-18T15:51:31.0562379Z "kind": "end"
2020-09-18T15:51:31.0562866Z },
2020-09-18T15:51:31.0563182Z "token": "10"
2020-09-18T15:51:31.0563485Z },
2020-09-18T15:51:31.0563804Z "method": "$/progress"
2020-09-18T15:51:31.0564114Z }
2020-09-18T15:51:31.0564346Z }
2020-09-18T15:51:31.0686231Z <-- {
2020-09-18T15:51:31.0686841Z "tag": "NotPublishDiagnostics",
2020-09-18T15:51:31.0687190Z "contents": {
2020-09-18T15:51:31.0687652Z "jsonrpc": "2.0",
2020-09-18T15:51:31.0687971Z "params": {
2020-09-18T15:51:31.0688614Z "uri": "file:///tmp/extra-dir-91571856709076/A.hs",
2020-09-18T15:51:31.0689287Z "diagnostics": [
2020-09-18T15:51:31.0689613Z {
2020-09-18T15:51:31.0689959Z "severity": 1,
2020-09-18T15:51:31.0690324Z "range": {
2020-09-18T15:51:31.0690705Z "start": {
2020-09-18T15:51:31.0691099Z "line": 5,
2020-09-18T15:51:31.0691500Z "character": 4
2020-09-18T15:51:31.0691883Z },
2020-09-18T15:51:31.0692234Z "end": {
2020-09-18T15:51:31.0692612Z "line": 5,
2020-09-18T15:51:31.0693023Z "character": 5
2020-09-18T15:51:31.0693381Z }
2020-09-18T15:51:31.0693702Z },
2020-09-18T15:51:31.0694066Z "source": "typecheck",
2020-09-18T15:51:31.0695088Z "message": "• Couldn't match expected type ‘Int’ with actual type ‘Bool’\n• In the expression: y\n In an equation for ‘x’: x = y"
2020-09-18T15:51:31.0695787Z }
2020-09-18T15:51:31.0696082Z ]
2020-09-18T15:51:31.0696345Z },
2020-09-18T15:51:31.0696701Z "method": "textDocument/publishDiagnostics"
2020-09-18T15:51:31.0697032Z }
2020-09-18T15:51:31.0697279Z }
2020-09-18T15:51:31.0697666Z --> {
2020-09-18T15:51:31.0697960Z "jsonrpc": "2.0",
2020-09-18T15:51:31.0698287Z "params": {
2020-09-18T15:51:31.0698613Z "tag": "GetInterfaceFilesDir",
2020-09-18T15:51:31.0699232Z "contents": "/tmp/extra-dir-91571856709076/B.hs"
2020-09-18T15:51:31.0699609Z },
2020-09-18T15:51:31.0699873Z "method": "hidir",
2020-09-18T15:51:31.0700137Z "id": 1
2020-09-18T15:51:31.0700334Z }
2020-09-18T15:51:31.0704721Z [DEBUG] finish: ParentTC (took 0.03s)
2020-09-18T15:51:31.0709470Z --> {
2020-09-18T15:51:31.0710341Z "jsonrpc": "2.0",
2020-09-18T15:51:31.0710998Z "params": null,
2020-09-18T15:51:31.0711482Z "method": "shutdown",
2020-09-18T15:51:31.0711812Z "id": 0
2020-09-18T15:51:31.0712380Z }
2020-09-18T15:51:31.0715504Z [INFO] finish: Test - GhcSession (took 0.00s)
2020-09-18T15:51:31.0718492Z <-- {
2020-09-18T15:51:31.0719251Z "tag": "NotLogMessage",
2020-09-18T15:51:31.0719788Z "contents": {
2020-09-18T15:51:31.0720249Z "jsonrpc": "2.0",
2020-09-18T15:51:31.0720739Z "params": {
2020-09-18T15:51:31.0721369Z "type": 4,
2020-09-18T15:51:31.0723522Z "message": "finish: Test - GhcSession (took 0.00s)"
2020-09-18T15:51:31.0724164Z },
2020-09-18T15:51:31.0724594Z "method": "window/logMessage"
2020-09-18T15:51:31.0724982Z }
2020-09-18T15:51:31.0725329Z }
2020-09-18T15:51:31.0728415Z <-- {
2020-09-18T15:51:31.0728965Z "tag": "RspCustomServer",
2020-09-18T15:51:31.0729459Z "contents": {
2020-09-18T15:51:31.0730531Z "result": "/home/vsts/.cache/ghcide/main-67f5d3e80e9a5dab967334c225648bdcd080465f",
2020-09-18T15:51:31.0732030Z "jsonrpc": "2.0",
2020-09-18T15:51:31.0732541Z "id": 1
2020-09-18T15:51:31.0732890Z }
2020-09-18T15:51:31.0733223Z }
2020-09-18T15:51:31.0733768Z <-- {
2020-09-18T15:51:31.0734160Z "tag": "RspShutdown",
2020-09-18T15:51:31.0734570Z "contents": {
2020-09-18T15:51:31.0734966Z "result": null,
2020-09-18T15:51:31.0735387Z "jsonrpc": "2.0",
2020-09-18T15:51:31.0735792Z "id": 0
2020-09-18T15:51:31.0736323Z }
2020-09-18T15:51:31.0736654Z }
2020-09-18T15:51:31.0737122Z --> {
2020-09-18T15:51:31.0737526Z "jsonrpc": "2.0",
2020-09-18T15:51:31.0737931Z "params": [],
2020-09-18T15:51:31.0738328Z "method": "exit"
2020-09-18T15:51:31.0738671Z }
2020-09-18T15:51:31.0963548Z FAIL
2020-09-18T15:51:31.0978246Z Exception: NamedParserException "NotificationMessage ServerMethod PublishDiagnosticsParams" (NamedParserException "NotificationMessage ServerMethod PublishDiagnosticsParams" (NamedParserException "NotificationMessage ServerMethod PublishDiagnosticsParams" (NamedParserException "NotificationMessage ServerMethod PublishDiagnosticsParams" (NamedParserException "NotificationMessage ServerMethod PublishDiagnosticsParams" (NamedParserException "NotificationMessage ServerMethod PublishDiagnosticsParams" (NamedParserException "NotificationMessage ServerMethod PublishDiagnosticsParams" (NamedParserException "NotificationMessage ServerMethod PublishDiagnosticsParams" (NamedParserException "NotificationMessage ServerMethod PublishDiagnosticsParams" (NamedParserException "NotificationMessage ServerMethod PublishDiagnosticsParams" (NamedParserException "NotificationMessage ServerMethod PublishDiagnosticsParams" (NamedParserException "NotificationMessage ServerMethod PublishDiagnosticsParams" (NamedParserException "NotificationMessage ServerMethod PublishDiagnosticsParams" (NamedParserException "NotificationMessage ServerMethod PublishDiagnosticsParams" (NamedParserException "NotificationMessage ServerMethod PublishDiagnosticsParams" (NamedParserException "NotificationMessage ServerMethod PublishDiagnosticsParams" (NamedParserException "NotificationMessage ServerMethod PublishDiagnosticsParams" (NamedParserException "NotificationMessage ServerMethod PublishDiagnosticsParams" (NamedParserException "NotificationMessage ServerMethod PublishDiagnosticsParams" (NamedParserException "NotificationMessage ServerMethod PublishDiagnosticsParams" (NamedParserException "NotificationMessage ServerMethod PublishDiagnosticsParams" (NamedParserException "NotificationMessage ServerMethod PublishDiagnosticsParams" (NamedParserException "NotificationMessage ServerMethod PublishDiagnosticsParams" (NamedParserException "NotificationMessage ServerMethod PublishDiagnosticsParams" (NamedParserException "NotificationMessage ServerMethod PublishDiagnosticsParams" (NamedParserException "NotificationMessage ServerMethod PublishDiagnosticsParams" (NamedParserException "Response for id: IdInt 1" (NamedParserException "NotificationMessage ServerMethod (ProgressParams WorkDoneProgressBeginParams)" (NamedParserException "RequestMessage ServerMethod WorkDoneProgressCreateParams ()" (BothFailed (NamedParserException "NotificationMessage ServerMethod PublishDiagnosticsParams" (NamedParserException "NotificationMessage ServerMethod PublishDiagnosticsParams" (NamedParserException "NotificationMessage ServerMethod PublishDiagnosticsParams" (NamedParserException "NotificationMessage ServerMethod PublishDiagnosticsParams" (NamedParserException "NotificationMessage ServerMethod PublishDiagnosticsParams" (NamedParserException "NotificationMessage ServerMethod PublishDiagnosticsParams" (NamedParserException "NotificationMessage ServerMethod PublishDiagnosticsParams" (NamedParserException "NotificationMessage ServerMethod PublishDiagnosticsParams" (NamedParserException "NotificationMessage ServerMethod PublishDiagnosticsParams" (NamedParserException "NotificationMessage ServerMethod PublishDiagnosticsParams" (NamedParserException "NotificationMessage ServerMethod PublishDiagnosticsParams" (NamedParserException "NotificationMessage ServerMethod PublishDiagnosticsParams" (NamedParserException "NotificationMessage ServerMethod PublishDiagnosticsParams" (NamedParserException "NotificationMessage ServerMethod PublishDiagnosticsParams" (NamedParserException "NotificationMessage ServerMethod PublishDiagnosticsParams" (NamedParserException "NotificationMessage ServerMethod PublishDiagnosticsParams" (NamedParserException "NotificationMessage ServerMethod PublishDiagnosticsParams" (NamedParserException "NotificationMessage ServerMethod PublishDiagnosticsParams" (NamedParserException "NotificationMessage ServerMethod PublishDiagnosticsParams" (NamedParserException "NotificationMessage ServerMethod PublishDiagnosticsParams" (NamedParserException "NotificationMessage ServerMethod PublishDiagnosticsParams" (NamedParserException "NotificationMessage ServerMethod PublishDiagnosticsParams" (NamedParserException "NotificationMessage ServerMethod PublishDiagnosticsParams" (NamedParserException "NotificationMessage ServerMethod PublishDiagnosticsParams" (NamedParserException "NotificationMessage ServerMethod PublishDiagnosticsParams" (NamedParserException "NotificationMessage ServerMethod PublishDiagnosticsParams" (NamedParserException "Response for id: IdInt 1" (NamedParserException "NotificationMessage ServerMethod (ProgressParams WorkDoneProgressBeginParams)" (BothFailed (Unexpected "ConduitParser.empty") (Unexpected "ConduitParser.empty")))))))))))))))))))))))))))))) (Unexpected "ConduitParser.empty"))))))))))))))))))))))))))))))
2020-09-18T15:51:31.0993252Z
2020-09-18T15:51:31.0993992Z 1 out of 1 tests failed (0.33s)
2020-09-18T15:51:31.1035436Z
2020-09-18T15:51:31.1037096Z ghcide> Test suite ghcide-tests failed
2020-09-18T15:51:31.1037699Z Test suite failure for package ghcide-0.4.0
2020-09-18T15:51:31.1038547Z ghcide-tests: exited with: ExitFailure 1
2020-09-18T15:51:31.1038940Z Logs printed to console
2020-09-18T15:51:31.1039165Z
2020-09-18T15:51:31.1178462Z
2020-09-18T15:51:31.1254043Z ##[error]Bash exited with code '1'.
2020-09-18T15:51:31.1270361Z ##[section]Finishing: stack test --ghc-options=-Werror
Sign up for free to join this conversation on GitHub. Already have an account? Sign in to comment