Skip to content

Instantly share code, notes, and snippets.

Embed
What would you like to do?
Gradle Phantomjs
repositories {
ivy {
url 'https://bitbucket.org/'
layout 'pattern', {
artifact '[organisation]/[artifact]/downloads/[artifact]-[revision]-[classifier].[ext]'
}
}
}
configurations {
phantomjs
}
dependencies {
phantomjs 'ariya:phantomjs:1.9.8:macosx@zip' //Should correspond to: https://bitbucket.org/ariya/phantomjs/downloads/phantomjs-1.9.8-macosx.zip
}
02:41:03.221 [DEBUG] [org.gradle.api.internal.artifacts.ivyservice.resolveengine.graph.DependencyGraphBuilder] Visiting dependency cellarhq:web:unspecified(phantomjs) -> ariya:phantomjs:1.9.8(dependency: ariya#phantomjs;1.9.8 {phantomjs=[default]})
02:41:03.247 [DEBUG] [org.gradle.api.internal.artifacts.ivyservice.resolveengine.graph.DependencyGraphBuilder] Selecting new module version ariya:phantomjs:1.9.8
02:41:03.247 [DEBUG] [org.gradle.api.internal.artifacts.ivyservice.ivyresolve.RepositoryChainDependencyResolver] Attempting to resolve module 'ariya:phantomjs:1.9.8' using repositories [ivy]
02:41:03.249 [DEBUG] [org.gradle.api.internal.artifacts.repositories.resolver.DefaultExternalResourceArtifactResolver] Loading https://bitbucket.org/ariya/ivy/downloads/ivy-1.9.8-[classifier].xml
02:41:03.252 [DEBUG] [org.gradle.internal.resource.transfer.DefaultCacheAwareExternalResourceAccessor] Constructing external resource: https://bitbucket.org/ariya/ivy/downloads/ivy-1.9.8-%5Bclassifier%5D.xml
02:41:03.252 [DEBUG] [org.gradle.cache.internal.btree.BTreePersistentIndexedCache] Opening cache artifact-at-url.bin (/Users/john/.gradle/caches/modules-2/metadata-2.13/artifact-at-url.bin)
02:41:03.257 [DEBUG] [org.gradle.internal.resource.transport.http.HttpResourceAccessor] Constructing external resource: https://bitbucket.org/ariya/ivy/downloads/ivy-1.9.8-%5Bclassifier%5D.xml
02:41:03.259 [DEBUG] [org.gradle.internal.resource.transport.http.HttpClientHelper] Performing HTTP GET: https://bitbucket.org/ariya/ivy/downloads/ivy-1.9.8-%5Bclassifier%5D.xml
02:41:03.387 [DEBUG] [org.apache.http.impl.conn.PoolingClientConnectionManager] Connection request: [route: {s}->https://bitbucket.org][total kept alive: 0; route allocated: 0 of 5; total allocated: 0 of 10]
02:41:03.396 [DEBUG] [org.apache.http.impl.conn.PoolingClientConnectionManager] Connection leased: [id: 0][route: {s}->https://bitbucket.org][total kept alive: 0; route allocated: 1 of 5; total allocated: 1 of 10]
02:41:03.521 [DEBUG] [org.apache.http.impl.conn.DefaultClientConnectionOperator] Connecting to bitbucket.org:443
02:41:03.816 [DEBUG] [org.apache.http.client.protocol.RequestAddCookies] CookieSpec selected: best-match
02:41:03.826 [DEBUG] [org.apache.http.client.protocol.RequestAuthCache] Auth cache not set in the context
02:41:03.826 [DEBUG] [org.apache.http.client.protocol.RequestTargetAuthentication] Target auth state: UNCHALLENGED
02:41:03.827 [DEBUG] [org.apache.http.client.protocol.RequestProxyAuthentication] Proxy auth state: UNCHALLENGED
02:41:03.827 [DEBUG] [org.apache.http.impl.client.SystemDefaultHttpClient] Attempt 1 to execute request
02:41:03.827 [DEBUG] [org.apache.http.impl.conn.DefaultClientConnection] Sending request: GET /ariya/ivy/downloads/ivy-1.9.8-%5Bclassifier%5D.xml HTTP/1.1
02:41:03.828 [DEBUG] [org.apache.http.headers] >> GET /ariya/ivy/downloads/ivy-1.9.8-%5Bclassifier%5D.xml HTTP/1.1
02:41:03.829 [DEBUG] [org.apache.http.headers] >> Accept-Encoding: gzip,deflate
02:41:03.829 [DEBUG] [org.apache.http.headers] >> Host: bitbucket.org
02:41:03.829 [DEBUG] [org.apache.http.headers] >> Connection: Keep-Alive
02:41:03.829 [DEBUG] [org.apache.http.headers] >> User-Agent: Gradle/2.1 (Mac OS X;10.10;x86_64) (Oracle Corporation;1.8.0_20;25.20-b23)
02:41:03.939 [DEBUG] [org.apache.http.impl.conn.DefaultClientConnection] Receiving response: HTTP/1.1 404 NOT FOUND
02:41:03.939 [DEBUG] [org.apache.http.headers] << HTTP/1.1 404 NOT FOUND
02:41:03.939 [DEBUG] [org.apache.http.headers] << Server: nginx/1.5.10
02:41:03.939 [DEBUG] [org.apache.http.headers] << Date: Wed, 05 Nov 2014 02:41:03 GMT
02:41:03.940 [DEBUG] [org.apache.http.headers] << Content-Type: text/html; charset=utf-8
02:41:03.940 [DEBUG] [org.apache.http.headers] << Transfer-Encoding: chunked
02:41:03.940 [DEBUG] [org.apache.http.headers] << Connection: keep-alive
02:41:03.940 [DEBUG] [org.apache.http.headers] << X-Served-By: app18
02:41:03.940 [DEBUG] [org.apache.http.headers] << X-Render-Time: 0.0433430671692
02:41:03.940 [DEBUG] [org.apache.http.headers] << Content-Language: en
02:41:03.940 [DEBUG] [org.apache.http.headers] << X-Static-Version: 681cde0c9586
02:41:03.940 [DEBUG] [org.apache.http.headers] << Vary: Accept-Language, Cookie
02:41:03.940 [DEBUG] [org.apache.http.headers] << X-Version: 0bb09755d479
02:41:03.940 [DEBUG] [org.apache.http.headers] << X-Request-Count: 113
02:41:03.941 [DEBUG] [org.apache.http.headers] << X-Frame-Options: SAMEORIGIN
02:41:03.941 [DEBUG] [org.apache.http.headers] << Content-Encoding: gzip
02:41:03.947 [DEBUG] [org.apache.http.impl.client.SystemDefaultHttpClient] Connection can be kept alive indefinitely
02:41:03.955 [DEBUG] [org.apache.http.impl.conn.PoolingClientConnectionManager] Connection [id: 0][route: {s}->https://bitbucket.org] can be kept alive indefinitely
02:41:03.955 [DEBUG] [org.apache.http.impl.conn.PoolingClientConnectionManager] Connection released: [id: 0][route: {s}->https://bitbucket.org][total kept alive: 1; route allocated: 1 of 5; total allocated: 1 of 10]
02:41:03.955 [INFO] [org.gradle.internal.resource.transport.http.HttpClientHelper] Resource missing. [HTTP GET: https://bitbucket.org/ariya/ivy/downloads/ivy-1.9.8-%5Bclassifier%5D.xml]
02:41:03.956 [DEBUG] [org.gradle.api.internal.artifacts.repositories.resolver.DefaultExternalResourceArtifactResolver] Loading https://bitbucket.org/ariya/phantomjs/downloads/phantomjs-1.9.8-macosx.zip
02:41:03.956 [DEBUG] [org.gradle.internal.resource.transport.http.HttpResourceAccessor] Constructing external resource metadata: https://bitbucket.org/ariya/phantomjs/downloads/phantomjs-1.9.8-macosx.zip
02:41:03.956 [DEBUG] [org.gradle.internal.resource.transport.http.HttpClientHelper] Performing HTTP HEAD: https://bitbucket.org/ariya/phantomjs/downloads/phantomjs-1.9.8-macosx.zip
02:41:03.956 [DEBUG] [org.apache.http.impl.conn.PoolingClientConnectionManager] Connection request: [route: {s}->https://bitbucket.org][total kept alive: 1; route allocated: 1 of 5; total allocated: 1 of 10]
02:41:03.957 [DEBUG] [org.apache.http.impl.conn.PoolingClientConnectionManager] Connection leased: [id: 0][route: {s}->https://bitbucket.org][total kept alive: 0; route allocated: 1 of 5; total allocated: 1 of 10]
02:41:03.957 [DEBUG] [org.apache.http.impl.client.SystemDefaultHttpClient] Stale connection check
02:41:03.958 [DEBUG] [org.apache.http.client.protocol.RequestAddCookies] CookieSpec selected: best-match
02:41:03.959 [DEBUG] [org.apache.http.client.protocol.RequestAuthCache] Auth cache not set in the context
02:41:03.959 [DEBUG] [org.apache.http.client.protocol.RequestTargetAuthentication] Target auth state: UNCHALLENGED
02:41:03.959 [DEBUG] [org.apache.http.client.protocol.RequestProxyAuthentication] Proxy auth state: UNCHALLENGED
02:41:03.959 [DEBUG] [org.apache.http.impl.client.SystemDefaultHttpClient] Attempt 1 to execute request
02:41:03.959 [DEBUG] [org.apache.http.impl.conn.DefaultClientConnection] Sending request: HEAD /ariya/phantomjs/downloads/phantomjs-1.9.8-macosx.zip HTTP/1.1
02:41:03.959 [DEBUG] [org.apache.http.headers] >> HEAD /ariya/phantomjs/downloads/phantomjs-1.9.8-macosx.zip HTTP/1.1
02:41:03.959 [DEBUG] [org.apache.http.headers] >> Accept-Encoding: gzip,deflate
02:41:03.959 [DEBUG] [org.apache.http.headers] >> Host: bitbucket.org
02:41:03.959 [DEBUG] [org.apache.http.headers] >> Connection: Keep-Alive
02:41:03.960 [DEBUG] [org.apache.http.headers] >> User-Agent: Gradle/2.1 (Mac OS X;10.10;x86_64) (Oracle Corporation;1.8.0_20;25.20-b23)
02:41:04.035 [DEBUG] [org.apache.http.impl.conn.DefaultClientConnection] Receiving response: HTTP/1.1 302 FOUND
02:41:04.035 [DEBUG] [org.apache.http.headers] << HTTP/1.1 302 FOUND
02:41:04.035 [DEBUG] [org.apache.http.headers] << Server: nginx/1.5.10
02:41:04.036 [DEBUG] [org.apache.http.headers] << Date: Wed, 05 Nov 2014 02:41:04 GMT
02:41:04.036 [DEBUG] [org.apache.http.headers] << Content-Type: text/html; charset=utf-8
02:41:04.036 [DEBUG] [org.apache.http.headers] << Content-Length: 0
02:41:04.036 [DEBUG] [org.apache.http.headers] << Connection: keep-alive
02:41:04.036 [DEBUG] [org.apache.http.headers] << X-Served-By: app15
02:41:04.036 [DEBUG] [org.apache.http.headers] << X-Render-Time: 0.0249421596527
02:41:04.036 [DEBUG] [org.apache.http.headers] << Content-Language: en
02:41:04.036 [DEBUG] [org.apache.http.headers] << ETag: "d41d8cd98f00b204e9800998ecf8427e"
02:41:04.037 [DEBUG] [org.apache.http.headers] << Location: https://bbuseruploads.s3.amazonaws.com/ariya/phantomjs/downloads/phantomjs-1.9.8-macosx.zip?Signature=T%2BZr8drwxe4E2lqiFzvE4d7LBUg%3D&Expires=1415155545&AWSAccessKeyId=0EMWEFSGA12Z1HF1TZ82
02:41:04.037 [DEBUG] [org.apache.http.headers] << Cache-Control: max-age=0
02:41:04.037 [DEBUG] [org.apache.http.headers] << X-Request-Count: 112
02:41:04.037 [DEBUG] [org.apache.http.headers] << Expires: Wed, 05 Nov 2014 02:41:04 GMT
02:41:04.037 [DEBUG] [org.apache.http.headers] << Vary: Accept-Language, Cookie
02:41:04.037 [DEBUG] [org.apache.http.headers] << X-Frame-Options: SAMEORIGIN
02:41:04.037 [DEBUG] [org.apache.http.headers] << Last-Modified: Wed, 05 Nov 2014 02:41:04 GMT
02:41:04.037 [DEBUG] [org.apache.http.headers] << X-Static-Version: 681cde0c9586
02:41:04.037 [DEBUG] [org.apache.http.headers] << X-Version: 0bb09755d479
02:41:04.038 [DEBUG] [org.apache.http.headers] << Strict-Transport-Security: max-age=31536000
02:41:04.038 [DEBUG] [org.apache.http.headers] << X-Content-Type-Options: nosniff
02:41:04.038 [DEBUG] [org.apache.http.impl.client.SystemDefaultHttpClient] Connection can be kept alive indefinitely
02:41:04.038 [DEBUG] [org.apache.http.impl.client.DefaultRedirectStrategy] Redirect requested to location 'https://bbuseruploads.s3.amazonaws.com/ariya/phantomjs/downloads/phantomjs-1.9.8-macosx.zip?Signature=T%2BZr8drwxe4E2lqiFzvE4d7LBUg%3D&Expires=1415155545&AWSAccessKeyId=0EMWEFSGA12Z1HF1TZ82'
02:41:04.039 [DEBUG] [org.apache.http.impl.client.SystemDefaultHttpClient] Resetting target auth state
02:41:04.039 [DEBUG] [org.apache.http.impl.client.SystemDefaultHttpClient] Redirecting to 'https://bbuseruploads.s3.amazonaws.com/ariya/phantomjs/downloads/phantomjs-1.9.8-macosx.zip?Signature=T%2BZr8drwxe4E2lqiFzvE4d7LBUg%3D&Expires=1415155545&AWSAccessKeyId=0EMWEFSGA12Z1HF1TZ82' via {s}->https://bbuseruploads.s3.amazonaws.com
02:41:04.039 [DEBUG] [org.apache.http.impl.conn.PoolingClientConnectionManager] Connection [id: 0][route: {s}->https://bitbucket.org] can be kept alive indefinitely
02:41:04.039 [DEBUG] [org.apache.http.impl.conn.PoolingClientConnectionManager] Connection released: [id: 0][route: {s}->https://bitbucket.org][total kept alive: 1; route allocated: 1 of 5; total allocated: 1 of 10]
02:41:04.040 [DEBUG] [org.apache.http.impl.conn.PoolingClientConnectionManager] Connection request: [route: {s}->https://bbuseruploads.s3.amazonaws.com][total kept alive: 1; route allocated: 0 of 5; total allocated: 1 of 10]
02:41:04.040 [DEBUG] [org.apache.http.impl.conn.PoolingClientConnectionManager] Connection leased: [id: 1][route: {s}->https://bbuseruploads.s3.amazonaws.com][total kept alive: 1; route allocated: 1 of 5; total allocated: 2 of 10]
02:41:04.062 [DEBUG] [org.apache.http.impl.conn.DefaultClientConnectionOperator] Connecting to bbuseruploads.s3.amazonaws.com:443
02:41:04.309 [DEBUG] [org.apache.http.client.protocol.RequestAddCookies] CookieSpec selected: best-match
02:41:04.309 [DEBUG] [org.apache.http.client.protocol.RequestAuthCache] Auth cache not set in the context
02:41:04.309 [DEBUG] [org.apache.http.client.protocol.RequestTargetAuthentication] Target auth state: UNCHALLENGED
02:41:04.309 [DEBUG] [org.apache.http.client.protocol.RequestProxyAuthentication] Proxy auth state: UNCHALLENGED
02:41:04.310 [DEBUG] [org.apache.http.impl.client.SystemDefaultHttpClient] Attempt 2 to execute request
02:41:04.310 [DEBUG] [org.apache.http.impl.conn.DefaultClientConnection] Sending request: HEAD /ariya/phantomjs/downloads/phantomjs-1.9.8-macosx.zip?Signature=T%2BZr8drwxe4E2lqiFzvE4d7LBUg%3D&Expires=1415155545&AWSAccessKeyId=0EMWEFSGA12Z1HF1TZ82 HTTP/1.1
02:41:04.310 [DEBUG] [org.apache.http.headers] >> HEAD /ariya/phantomjs/downloads/phantomjs-1.9.8-macosx.zip?Signature=T%2BZr8drwxe4E2lqiFzvE4d7LBUg%3D&Expires=1415155545&AWSAccessKeyId=0EMWEFSGA12Z1HF1TZ82 HTTP/1.1
02:41:04.310 [DEBUG] [org.apache.http.headers] >> Accept-Encoding: gzip,deflate
02:41:04.311 [DEBUG] [org.apache.http.headers] >> Host: bbuseruploads.s3.amazonaws.com
02:41:04.311 [DEBUG] [org.apache.http.headers] >> Connection: Keep-Alive
02:41:04.311 [DEBUG] [org.apache.http.headers] >> User-Agent: Gradle/2.1 (Mac OS X;10.10;x86_64) (Oracle Corporation;1.8.0_20;25.20-b23)
02:41:04.367 [DEBUG] [org.apache.http.impl.conn.DefaultClientConnection] Receiving response: HTTP/1.1 403 Forbidden
02:41:04.367 [DEBUG] [org.apache.http.headers] << HTTP/1.1 403 Forbidden
02:41:04.380 [DEBUG] [org.apache.http.headers] << x-amz-request-id: 2AAC48514C7EB428
02:41:04.381 [DEBUG] [org.apache.http.headers] << x-amz-id-2: iCSUO96iOC4hSpzFNeM4gLVoDVRGVxMJcjKtQQRXSrfHphzKMaxIsQMeE3j6Qz02
02:41:04.381 [DEBUG] [org.apache.http.headers] << Content-Type: application/xml
02:41:04.381 [DEBUG] [org.apache.http.headers] << Transfer-Encoding: chunked
02:41:04.381 [DEBUG] [org.apache.http.headers] << Date: Wed, 05 Nov 2014 02:41:03 GMT
02:41:04.382 [DEBUG] [org.apache.http.headers] << Server: AmazonS3
02:41:04.382 [DEBUG] [org.apache.http.impl.client.SystemDefaultHttpClient] Connection can be kept alive indefinitely
02:41:04.382 [DEBUG] [org.apache.http.impl.conn.PoolingClientConnectionManager] Connection [id: 1][route: {s}->https://bbuseruploads.s3.amazonaws.com] can be kept alive indefinitely
02:41:04.383 [DEBUG] [org.apache.http.impl.conn.PoolingClientConnectionManager] Connection released: [id: 1][route: {s}->https://bbuseruploads.s3.amazonaws.com][total kept alive: 2; route allocated: 1 of 5; total allocated: 2 of 10]
02:41:04.383 [INFO] [org.gradle.internal.resource.transport.http.HttpClientHelper] Failed to get resource: HEAD. [HTTP HTTP/1.1 403 Forbidden: https://bitbucket.org/ariya/phantomjs/downloads/phantomjs-1.9.8-macosx.zip]
02:41:04.385 [DEBUG] [org.gradle.api.internal.artifacts.ivyservice.resolveengine.graph.ResolvedConfigurationDependencyGraphVisitor] Attaching cellarhq:web:unspecified(phantomjs) to its parents.
02:41:04.386 [DEBUG] [org.gradle.api.internal.artifacts.ivyservice.resolveengine.oldresult.TransientConfigurationResultsBuilder] Flushing resolved configuration data in Binary store in /private/var/folders/wd/bt6km58d1g3ffqsg41hgmxp80000gn/T/gradle5929431189169522180.bin. Wrote root cellarhq:web:unspecified:phantomjs.
02:41:04.387 [DEBUG] [org.gradle.api.internal.tasks.execution.ExecuteAtMostOnceTaskExecuter] Finished executing task ':web:setupPhantom'
02:41:04.388 [INFO] [org.gradle.execution.taskgraph.AbstractTaskPlanExecutor] :web:setupPhantom (Thread[main,5,main]) completed. Took 1.204 secs.
02:41:04.388 [DEBUG] [org.gradle.execution.taskgraph.AbstractTaskPlanExecutor] Task worker [Thread[main,5,main]] finished, busy: 1.204 secs, idle: 0.002 secs
02:41:04.395 [ERROR] [org.gradle.BuildExceptionReporter]
02:41:04.396 [ERROR] [org.gradle.BuildExceptionReporter] FAILURE: Build failed with an exception.
02:41:04.397 [ERROR] [org.gradle.BuildExceptionReporter]
02:41:04.397 [ERROR] [org.gradle.BuildExceptionReporter] * What went wrong:
02:41:04.397 [ERROR] [org.gradle.BuildExceptionReporter] Could not resolve all dependencies for configuration ':web:phantomjs'.
02:41:04.397 [ERROR] [org.gradle.BuildExceptionReporter] > Could not resolve ariya:phantomjs:1.9.8.
02:41:04.398 [ERROR] [org.gradle.BuildExceptionReporter] Required by:
02:41:04.398 [ERROR] [org.gradle.BuildExceptionReporter] cellarhq:web:unspecified
02:41:04.398 [ERROR] [org.gradle.BuildExceptionReporter] > Could not HEAD 'https://bitbucket.org/ariya/phantomjs/downloads/phantomjs-1.9.8-macosx.zip'. Received status code 403 from server: Forbidden
02:41:04.398 [ERROR] [org.gradle.BuildExceptionReporter]
02:41:04.399 [ERROR] [org.gradle.BuildExceptionReporter] * Try:
02:41:04.399 [ERROR] [org.gradle.BuildExceptionReporter] Run with --stacktrace option to get the stack trace.
02:41:04.399 [LIFECYCLE] [org.gradle.BuildResultLogger]
02:41:04.400 [LIFECYCLE] [org.gradle.BuildResultLogger] BUILD FAILED
02:41:04.400 [LIFECYCLE] [org.gradle.BuildResultLogger]
02:41:04.400 [LIFECYCLE] [org.gradle.BuildResultLogger] Total time: 7.786 secs
02:41:04.401 [DEBUG] [org.gradle.api.internal.tasks.compile.daemon.CompilerDaemonManager] Stopping 0 compiler daemon(s).
02:41:04.401 [INFO] [org.gradle.api.internal.tasks.compile.daemon.CompilerDaemonManager] Stopped 0 compiler daemon(s).
02:41:04.402 [DEBUG] [org.gradle.cache.internal.DefaultFileLockManager] Releasing lock on buildscript class cache for settings file '/Users/john/workspace/cellarhq.com/settings.gradle' (/Users/john/.gradle/caches/2.1/scripts/settings_6528ljld43usu9vod9ismt3eja/SettingsScript/buildscript).
02:41:04.402 [DEBUG] [org.gradle.cache.internal.DefaultFileLockManager] Releasing lock on no_buildscript class cache for settings file '/Users/john/workspace/cellarhq.com/settings.gradle' (/Users/john/.gradle/caches/2.1/scripts/settings_6528ljld43usu9vod9ismt3eja/SettingsScript/no_buildscript).
02:41:04.403 [DEBUG] [org.gradle.cache.internal.DefaultFileLockManager] Releasing lock on buildscript class cache for build file '/Users/john/workspace/cellarhq.com/cellarhq.gradle' (/Users/john/.gradle/caches/2.1/scripts/cellarhq_7ukouaogngu428sssgdtuec7mu/ProjectScript/buildscript).
02:41:04.403 [DEBUG] [org.gradle.cache.internal.DefaultFileLockManager] Releasing lock on no_buildscript class cache for build file '/Users/john/workspace/cellarhq.com/cellarhq.gradle' (/Users/john/.gradle/caches/2.1/scripts/cellarhq_7ukouaogngu428sssgdtuec7mu/ProjectScript/no_buildscript).
02:41:04.403 [DEBUG] [org.gradle.cache.internal.DefaultFileLockManager] Releasing lock on buildscript class cache for build file '/Users/john/workspace/cellarhq.com/jobs/jobs.gradle' (/Users/john/.gradle/caches/2.1/scripts/jobs_59gtgr1irfteju1bbfcru1ujus/ProjectScript/buildscript).
02:41:04.403 [DEBUG] [org.gradle.cache.internal.DefaultFileLockManager] Releasing lock on no_buildscript class cache for build file '/Users/john/workspace/cellarhq.com/jobs/jobs.gradle' (/Users/john/.gradle/caches/2.1/scripts/jobs_59gtgr1irfteju1bbfcru1ujus/ProjectScript/no_buildscript).
02:41:04.404 [DEBUG] [org.gradle.cache.internal.DefaultFileLockManager] Releasing lock on buildscript class cache for build file '/Users/john/workspace/cellarhq.com/model/model.gradle' (/Users/john/.gradle/caches/2.1/scripts/model_5toev6mho8mri6s3ktunmeur26/ProjectScript/buildscript).
02:41:04.404 [DEBUG] [org.gradle.cache.internal.DefaultFileLockManager] Releasing lock on no_buildscript class cache for build file '/Users/john/workspace/cellarhq.com/model/model.gradle' (/Users/john/.gradle/caches/2.1/scripts/model_5toev6mho8mri6s3ktunmeur26/ProjectScript/no_buildscript).
02:41:04.404 [DEBUG] [org.gradle.cache.internal.DefaultFileLockManager] Releasing lock on buildscript class cache for build file '/Users/john/workspace/cellarhq.com/perf/perf.gradle' (/Users/john/.gradle/caches/2.1/scripts/perf_aco2o7mvj808dskt8f0a68css/ProjectScript/buildscript).
02:41:04.404 [DEBUG] [org.gradle.cache.internal.DefaultFileLockManager] Releasing lock on no_buildscript class cache for build file '/Users/john/workspace/cellarhq.com/perf/perf.gradle' (/Users/john/.gradle/caches/2.1/scripts/perf_aco2o7mvj808dskt8f0a68css/ProjectScript/no_buildscript).
02:41:04.405 [DEBUG] [org.gradle.cache.internal.DefaultFileLockManager] Releasing lock on buildscript class cache for build file '/Users/john/workspace/cellarhq.com/web/web.gradle' (/Users/john/.gradle/caches/2.1/scripts/web_1jhp12n020250j6uc864pcuh1h/ProjectScript/buildscript).
02:41:04.405 [DEBUG] [org.gradle.cache.internal.DefaultFileLockManager] Releasing lock on no_buildscript class cache for build file '/Users/john/workspace/cellarhq.com/web/web.gradle' (/Users/john/.gradle/caches/2.1/scripts/web_1jhp12n020250j6uc864pcuh1h/ProjectScript/no_buildscript).
02:41:04.405 [DEBUG] [org.gradle.cache.internal.DefaultFileLockManager] Releasing lock on buildscript class cache for script '/Users/john/workspace/cellarhq.com/gradle/codenarc.gradle' (/Users/john/.gradle/caches/2.1/scripts/codenarc_36eevkg491jkaibvtvi8ugl5o5/DefaultScript/buildscript).
02:41:04.405 [DEBUG] [org.gradle.cache.internal.DefaultFileLockManager] Releasing lock on no_buildscript class cache for script '/Users/john/workspace/cellarhq.com/gradle/codenarc.gradle' (/Users/john/.gradle/caches/2.1/scripts/codenarc_36eevkg491jkaibvtvi8ugl5o5/DefaultScript/no_buildscript).
02:41:04.406 [DEBUG] [org.gradle.cache.internal.btree.BTreePersistentIndexedCache] Closing cache artifact-at-url.bin (/Users/john/.gradle/caches/modules-2/metadata-2.13/artifact-at-url.bin)
02:41:04.406 [DEBUG] [org.gradle.cache.internal.btree.BTreePersistentIndexedCache] Closing cache module-artifacts.bin (/Users/john/.gradle/caches/modules-2/metadata-2.13/module-artifacts.bin)
02:41:04.407 [DEBUG] [org.gradle.cache.internal.btree.BTreePersistentIndexedCache] Closing cache artifact-at-repository.bin (/Users/john/.gradle/caches/modules-2/metadata-2.13/artifact-at-repository.bin)
02:41:04.407 [DEBUG] [org.gradle.cache.internal.btree.BTreePersistentIndexedCache] Closing cache module-versions.bin (/Users/john/.gradle/caches/modules-2/metadata-2.13/module-versions.bin)
02:41:04.407 [DEBUG] [org.gradle.cache.internal.btree.BTreePersistentIndexedCache] Closing cache module-metadata.bin (/Users/john/.gradle/caches/modules-2/metadata-2.13/module-metadata.bin)
02:41:04.407 [DEBUG] [org.gradle.cache.internal.DefaultFileLockManager] Releasing lock on artifact cache (/Users/john/.gradle/caches/modules-2).
02:41:04.408 [DEBUG] [org.gradle.cache.internal.btree.BTreePersistentIndexedCache] Closing cache plugin-use-metadata.bin (/Users/john/.gradle/caches/2.1/plugin-resolution/plugin-use-metadata.bin)
02:41:04.408 [DEBUG] [org.gradle.cache.internal.DefaultFileLockManager] Releasing lock on Plugin Resolution Cache (/Users/john/.gradle/caches/2.1/plugin-resolution).
02:41:04.409 [DEBUG] [org.gradle.cache.internal.btree.BTreePersistentIndexedCache] Closing cache outputFileStates.bin (/Users/john/workspace/cellarhq.com/.gradle/2.1/taskArtifacts/outputFileStates.bin)
02:41:04.409 [DEBUG] [org.gradle.cache.internal.btree.BTreePersistentIndexedCache] Closing cache taskArtifacts.bin (/Users/john/workspace/cellarhq.com/.gradle/2.1/taskArtifacts/taskArtifacts.bin)
02:41:04.410 [DEBUG] [org.gradle.cache.internal.DefaultFileLockManager] Releasing lock on task history cache (/Users/john/workspace/cellarhq.com/.gradle/2.1/taskArtifacts).
02:41:04.410 [DEBUG] [org.gradle.api.internal.artifacts.ivyservice.ivyresolve.memcache.InMemoryCachedRepositoryFactory] In-memory dependency metadata cache closed. Repos cached: 6, cache instances: 3, modules served from cache: 14, artifacts: 12
02:41:04.411 [DEBUG] [org.gradle.api.internal.artifacts.ivyservice.resolveengine.store.CachedStoreFactory] Resolution result cache closed. Cache reads: 0, disk reads: 0 (avg: 0.0 secs, total: 0.0 secs)
02:41:04.412 [DEBUG] [org.gradle.api.internal.artifacts.ivyservice.resolveengine.store.CachedStoreFactory] Resolved configuration cache closed. Cache reads: 0, disk reads: 0 (avg: 0.0 secs, total: 0.0 secs)
02:41:04.413 [DEBUG] [org.gradle.api.internal.artifacts.ivyservice.resolveengine.store.ResolutionResultsStoreFactory] Deleted 2 resolution results binary files in 0.001 secs
web git:(master) ✗ gradle setupPhantom -i
Starting Build
Settings evaluated using settings file '/Users/john/workspace/cellarhq.com/settings.gradle'.
Projects loaded. Root project using build file '/Users/john/workspace/cellarhq.com/cellarhq.gradle'.
Included projects: [root project 'cellarhq', project ':jobs', project ':model', project ':perf', project ':web']
Evaluating root project 'cellarhq' using build file '/Users/john/workspace/cellarhq.com/cellarhq.gradle'.
Evaluating project ':jobs' using build file '/Users/john/workspace/cellarhq.com/jobs/jobs.gradle'.
Evaluating project ':model' using build file '/Users/john/workspace/cellarhq.com/model/model.gradle'.
Evaluating project ':perf' using build file '/Users/john/workspace/cellarhq.com/perf/perf.gradle'.
Evaluating project ':web' using build file '/Users/john/workspace/cellarhq.com/web/web.gradle'.
Adding docker extension
Adding docker task type
Adding docker task 'distDocker'
Applying docker defaults to tasks of type 'Docker'
All projects evaluated.
Selected primary task 'setupPhantom' from project :web
Tasks to be executed: [task ':web:setupPhantom']
:web:setupPhantom (Thread[main,5,main]) started.
:web:setupPhantom
Resource missing. [HTTP GET: https://bitbucket.org/ariya/ivy/downloads/ivy-1.9.8-%5Bclassifier%5D.xml]
Failed to get resource: HEAD. [HTTP HTTP/1.1 403 Forbidden: https://bitbucket.org/ariya/phantomjs/downloads/phantomjs-1.9.8-macosx.zip]
:web:setupPhantom (Thread[main,5,main]) completed. Took 1.311 secs.
FAILURE: Build failed with an exception.
* What went wrong:
Could not resolve all dependencies for configuration ':web:phantomjs'.
> Could not resolve ariya:phantomjs:1.9.8.
Required by:
cellarhq:web:unspecified
> Could not HEAD 'https://bitbucket.org/ariya/phantomjs/downloads/phantomjs-1.9.8-macosx.zip'. Received status code 403 from server: Forbidden
* Try:
Run with --stacktrace option to get the stack trace. Run with --debug option to get more log output.
BUILD FAILED
Sign up for free to join this conversation on GitHub. Already have an account? Sign in to comment