Skip to content

Instantly share code, notes, and snippets.

Embed
What would you like to do?
incr. comp. ICEs on glium
Compiling glob v0.2.11
Compiling khronos_api v1.0.0
Compiling inflate v0.1.1
Compiling log v0.3.6
Compiling x11-dl v2.7.0
Compiling lzw v0.10.0
Compiling libc v0.2.14
Compiling bitflags v0.7.0
Compiling xml-rs v0.3.4
Compiling winapi-build v0.1.1
Compiling backtrace v0.2.2
Compiling serde v0.7.14
Compiling dbghelp-sys v0.2.0
Compiling kernel32-sys v0.2.2
thread 'rustc' panicked at 'assertion failed: def_id.is_local()', ../src/librustc_incremental/persist/hash.rs:46
stack backtrace:
1: 0x7fc3eb19d5ee - std::sys::backtrace::tracing::imp::write::hf504bc08f2a3011f
at /home/jonas/dev/rust/build/../src/libstd/sys/unix/backtrace/tracing/gcc_s.rs:42
2: 0x7fc3eb1bb401 - std::panicking::default_hook::_{{closure}}::h49b28af2d05b6140
at /home/jonas/dev/rust/build/../src/libstd/panicking.rs:211
3: 0x7fc3eb1b970c - std::panicking::default_hook::hf5d79ad4f1ead81e
at /home/jonas/dev/rust/build/../src/libstd/panicking.rs:220
4: 0x7fc3eb1b9e9e - std::panicking::rust_panic_with_hook::h9a3925e37821d434
at /home/jonas/dev/rust/build/../src/libstd/panicking.rs:370
5: 0x7fc3e96b7964 - std::panicking::begin_panic::hf0f914ab539f4b11
at /home/jonas/dev/rust/build/../src/libstd/panicking.rs:328
6: 0x7fc3e96bbae4 - rustc_incremental::persist::hash::HashContext::hash::h9e8e32d88bfdee9b
at /home/jonas/dev/rust/build/<std macros>:3
7: 0x7fc3e9707b43 - rustc_incremental::persist::load::initial_dirty_nodes::h6aa4da1f29a6da1a
at /home/jonas/dev/rust/build/../src/librustc_incremental/persist/load.rs:173
8: 0x7fc3e9704cf9 - rustc_incremental::persist::load::decode_dep_graph::h1955b5e73d4bad78
at /home/jonas/dev/rust/build/../src/librustc_incremental/persist/load.rs:120
9: 0x7fc3e970404f - rustc_incremental::persist::load::load_dep_graph_if_exists::h73ce93f2505c00c5
at /home/jonas/dev/rust/build/../src/librustc_incremental/persist/load.rs:64
10: 0x7fc3e9703e79 - rustc_incremental::persist::load::load_dep_graph::h7253598c0093526a
at /home/jonas/dev/rust/build/../src/librustc_incremental/persist/load.rs:47
11: 0x7fc3eb7b5a18 - rustc_driver::driver::phase_3_run_analysis_passes::_{{closure}}::h58d639cefbed8f65
at /home/jonas/dev/rust/build/../src/librustc_driver/driver.rs:868
at /home/jonas/dev/rust/build/../src/librustc/util/common.rs:38
at /home/jonas/dev/rust/build/../src/librustc_driver/driver.rs:866
12: 0x7fc3eb7b4acc - rustc::ty::context::tls::enter::_{{closure}}::ha2bd9f5c311d0a28
13: 0x7fc3eb7b4f1a - rustc::ty::context::tls::enter_global::_{{closure}}::h07899291426b66b8
14: 0x7fc3eb78056d - rustc::ty::context::TyCtxt::create_and_enter::h903f5209af5105c8
at /home/jonas/dev/rust/build/../src/libstd/thread/local.rs:245
at /home/jonas/dev/rust/build/../src/librustc/ty/context.rs:886
at /home/jonas/dev/rust/build/../src/librustc/ty/context.rs:685
15: 0x7fc3eb79fe57 - rustc_driver::driver::compile_input::h2d1b58b831f06a86
at /home/jonas/dev/rust/build/../src/librustc_driver/driver.rs:854
at /home/jonas/dev/rust/build/../src/librustc_driver/driver.rs:169
16: 0x7fc3eb88f1f6 - rustc_driver::run_compiler::h833483649bdaa9c3
at /home/jonas/dev/rust/build/../src/librustc_driver/lib.rs:226
at /home/jonas/dev/rust/build/../src/librustc_driver/lib.rs:163
17: 0x7fc3eb89f2f7 - rustc_driver::run::_{{closure}}::hf976882a071eba86
at /home/jonas/dev/rust/build/../src/librustc_driver/lib.rs:136
18: 0x7fc3eb89f25b - rustc_driver::monitor::_{{closure}}::hd347b359cf4c5640
at /home/jonas/dev/rust/build/../src/librustc_driver/lib.rs:1052
19: 0x7fc3eb87ed8e - std::panicking::try::call::hd16aacc09eeeaf9e
at /home/jonas/dev/rust/build/../src/libstd/panic.rs:256
at /home/jonas/dev/rust/build/../src/libstd/panicking.rs:272
20: 0x7fc3eb1f8427 - __rust_maybe_catch_panic
at /home/jonas/dev/rust/build/../src/libpanic_unwind/lib.rs:91
21: 0x7fc3eb89e198 - std::thread::Builder::spawn::_{{closure}}::hf8ba3712412ac8f6
22: 0x7fc3eb8888b0 - _<F as alloc..boxed..FnBox<A>>::call_box::hbf614b3f826456b6
at /home/jonas/dev/rust/build/../src/liballoc/boxed.rs:587
23: 0x7fc3eb1b3ea8 - std::sys_common::thread::start_thread::h88aa5d9761413c7f
at /home/jonas/dev/rust/build/../src/liballoc/boxed.rs:597
at /home/jonas/dev/rust/build/../src/libstd/sys/common/thread.rs:23
24: 0x7fc3eb1cdc08 - std::sys::thread::Thread::new::thread_start::h2e98425c7fffa990
at /home/jonas/dev/rust/build/../src/libstd/sys/unix/thread.rs:73
25: 0x7fc3e2635483 - start_thread
26: 0x7fc3eade26dc - clone
27: 0x0 - <unknown>
error: internal compiler error: unexpected panic
note: the compiler unexpectedly panicked. this is a bug.
note: we would appreciate a bug report: https://github.com/rust-lang/rust/blob/master/CONTRIBUTING.md#bug-reports
note: run with `RUST_BACKTRACE=1` for a backtrace
Build failed, waiting for other jobs to finish...
thread 'rustc' panicked at 'assertion failed: def_id.is_local()', ../src/librustc_incremental/persist/hash.rs:46
stack backtrace:
1: 0x7f2ecdfb85ee - std::sys::backtrace::tracing::imp::write::hf504bc08f2a3011f
at /home/jonas/dev/rust/build/../src/libstd/sys/unix/backtrace/tracing/gcc_s.rs:42
2: 0x7f2ecdfd6401 - std::panicking::default_hook::_{{closure}}::h49b28af2d05b6140
at /home/jonas/dev/rust/build/../src/libstd/panicking.rs:211
3: 0x7f2ecdfd470c - std::panicking::default_hook::hf5d79ad4f1ead81e
at /home/jonas/dev/rust/build/../src/libstd/panicking.rs:220
4: 0x7f2ecdfd4e9e - std::panicking::rust_panic_with_hook::h9a3925e37821d434
at /home/jonas/dev/rust/build/../src/libstd/panicking.rs:370
5: 0x7f2ecc4d2964 - std::panicking::begin_panic::hf0f914ab539f4b11
at /home/jonas/dev/rust/build/../src/libstd/panicking.rs:328
6: 0x7f2ecc4d6ae4 - rustc_incremental::persist::hash::HashContext::hash::h9e8e32d88bfdee9b
at /home/jonas/dev/rust/build/<std macros>:3
7: 0x7f2ecc522b43 - rustc_incremental::persist::load::initial_dirty_nodes::h6aa4da1f29a6da1a
at /home/jonas/dev/rust/build/../src/librustc_incremental/persist/load.rs:173
8: 0x7f2ecc51fcf9 - rustc_incremental::persist::load::decode_dep_graph::h1955b5e73d4bad78
at /home/jonas/dev/rust/build/../src/librustc_incremental/persist/load.rs:120
9: 0x7f2ecc51f04f - rustc_incremental::persist::load::load_dep_graph_if_exists::h73ce93f2505c00c5
at /home/jonas/dev/rust/build/../src/librustc_incremental/persist/load.rs:64
10: 0x7f2ecc51ee79 - rustc_incremental::persist::load::load_dep_graph::h7253598c0093526a
at /home/jonas/dev/rust/build/../src/librustc_incremental/persist/load.rs:47
11: 0x7f2ece5d0a18 - rustc_driver::driver::phase_3_run_analysis_passes::_{{closure}}::h58d639cefbed8f65
at /home/jonas/dev/rust/build/../src/librustc_driver/driver.rs:868
at /home/jonas/dev/rust/build/../src/librustc/util/common.rs:38
at /home/jonas/dev/rust/build/../src/librustc_driver/driver.rs:866
12: 0x7f2ece5cfacc - rustc::ty::context::tls::enter::_{{closure}}::ha2bd9f5c311d0a28
13: 0x7f2ece5cff1a - rustc::ty::context::tls::enter_global::_{{closure}}::h07899291426b66b8
14: 0x7f2ece59b56d - rustc::ty::context::TyCtxt::create_and_enter::h903f5209af5105c8
at /home/jonas/dev/rust/build/../src/libstd/thread/local.rs:245
at /home/jonas/dev/rust/build/../src/librustc/ty/context.rs:886
at /home/jonas/dev/rust/build/../src/librustc/ty/context.rs:685
15: 0x7f2ece5bae57 - rustc_driver::driver::compile_input::h2d1b58b831f06a86
at /home/jonas/dev/rust/build/../src/librustc_driver/driver.rs:854
at /home/jonas/dev/rust/build/../src/librustc_driver/driver.rs:169
16: 0x7f2ece6aa1f6 - rustc_driver::run_compiler::h833483649bdaa9c3
at /home/jonas/dev/rust/build/../src/librustc_driver/lib.rs:226
at /home/jonas/dev/rust/build/../src/librustc_driver/lib.rs:163
17: 0x7f2ece6ba2f7 - rustc_driver::run::_{{closure}}::hf976882a071eba86
at /home/jonas/dev/rust/build/../src/librustc_driver/lib.rs:136
18: 0x7f2ece6ba25b - rustc_driver::monitor::_{{closure}}::hd347b359cf4c5640
at /home/jonas/dev/rust/build/../src/librustc_driver/lib.rs:1052
19: 0x7f2ece699d8e - std::panicking::try::call::hd16aacc09eeeaf9e
at /home/jonas/dev/rust/build/../src/libstd/panic.rs:256
at /home/jonas/dev/rust/build/../src/libstd/panicking.rs:272
20: 0x7f2ece013427 - __rust_maybe_catch_panic
at /home/jonas/dev/rust/build/../src/libpanic_unwind/lib.rs:91
21: 0x7f2ece6b9198 - std::thread::Builder::spawn::_{{closure}}::hf8ba3712412ac8f6
22: 0x7f2ece6a38b0 - _<F as alloc..boxed..FnBox<A>>::call_box::hbf614b3f826456b6
at /home/jonas/dev/rust/build/../src/liballoc/boxed.rs:587
23: 0x7f2ecdfceea8 - std::sys_common::thread::start_thread::h88aa5d9761413c7f
at /home/jonas/dev/rust/build/../src/liballoc/boxed.rs:597
at /home/jonas/dev/rust/build/../src/libstd/sys/common/thread.rs:23
24: 0x7f2ecdfe8c08 - std::sys::thread::Thread::new::thread_start::h2e98425c7fffa990
at /home/jonas/dev/rust/build/../src/libstd/sys/unix/thread.rs:73
25: 0x7f2ec5450483 - start_thread
26: 0x7f2ecdbfd6dc - clone
27: 0x0 - <unknown>
error: internal compiler error: unexpected panic
note: the compiler unexpectedly panicked. this is a bug.
note: we would appreciate a bug report: https://github.com/rust-lang/rust/blob/master/CONTRIBUTING.md#bug-reports
note: run with `RUST_BACKTRACE=1` for a backtrace
Build failed, waiting for other jobs to finish...
thread 'rustc' panicked at 'assertion failed: def_id.is_local()', ../src/librustc_incremental/persist/hash.rs:46
stack backtrace:
1: 0x7f207ff595ee - std::sys::backtrace::tracing::imp::write::hf504bc08f2a3011f
at /home/jonas/dev/rust/build/../src/libstd/sys/unix/backtrace/tracing/gcc_s.rs:42
2: 0x7f207ff77401 - std::panicking::default_hook::_{{closure}}::h49b28af2d05b6140
at /home/jonas/dev/rust/build/../src/libstd/panicking.rs:211
3: 0x7f207ff7570c - std::panicking::default_hook::hf5d79ad4f1ead81e
at /home/jonas/dev/rust/build/../src/libstd/panicking.rs:220
4: 0x7f207ff75e9e - std::panicking::rust_panic_with_hook::h9a3925e37821d434
at /home/jonas/dev/rust/build/../src/libstd/panicking.rs:370
5: 0x7f207e473964 - std::panicking::begin_panic::hf0f914ab539f4b11
at /home/jonas/dev/rust/build/../src/libstd/panicking.rs:328
6: 0x7f207e477ae4 - rustc_incremental::persist::hash::HashContext::hash::h9e8e32d88bfdee9b
at /home/jonas/dev/rust/build/<std macros>:3
7: 0x7f207e490fa1 - rustc_incremental::persist::save::encode_dep_graph::h394c6e3e2c7a145b
at /home/jonas/dev/rust/build/../src/librustc_incremental/persist/save.rs:110
at /home/jonas/dev/rust/build/../src/libcore/iter/mod.rs:1015
at /home/jonas/dev/rust/build/../src/libcollections/vec.rs:1450
at /home/jonas/dev/rust/build/../src/libcollections/vec.rs:1358
at /home/jonas/dev/rust/build/../src/libcore/iter/iterator.rs:1207
at /home/jonas/dev/rust/build/../src/librustc_incremental/persist/save.rs:107
8: 0x7f207e48f21b - rustc_incremental::persist::save::save_dep_graph::h2c7f137260043f58
at /home/jonas/dev/rust/build/../src/librustc_incremental/persist/save.rs:32
at /home/jonas/dev/rust/build/../src/librustc_incremental/persist/save.rs:70
at /home/jonas/dev/rust/build/../src/librustc_incremental/persist/save.rs:32
9: 0x7f2080568874 - rustc_driver::driver::phase_4_translate_to_llvm::hc95fd2db30f21bfa
at /home/jonas/dev/rust/build/../src/librustc_driver/driver.rs:1019
at /home/jonas/dev/rust/build/../src/librustc/util/common.rs:38
at /home/jonas/dev/rust/build/../src/librustc_driver/driver.rs:1017
10: 0x7f20805a8abb - rustc_driver::driver::compile_input::_{{closure}}::h85c16c9210e90d8f
at /home/jonas/dev/rust/build/../src/librustc_driver/driver.rs:203
11: 0x7f2080576161 - rustc_driver::driver::phase_3_run_analysis_passes::_{{closure}}::h58d639cefbed8f65
at /home/jonas/dev/rust/build/../src/librustc_driver/driver.rs:972
12: 0x7f2080570acc - rustc::ty::context::tls::enter::_{{closure}}::ha2bd9f5c311d0a28
13: 0x7f2080570f1a - rustc::ty::context::tls::enter_global::_{{closure}}::h07899291426b66b8
14: 0x7f208053c56d - rustc::ty::context::TyCtxt::create_and_enter::h903f5209af5105c8
at /home/jonas/dev/rust/build/../src/libstd/thread/local.rs:245
at /home/jonas/dev/rust/build/../src/librustc/ty/context.rs:886
at /home/jonas/dev/rust/build/../src/librustc/ty/context.rs:685
15: 0x7f208055be57 - rustc_driver::driver::compile_input::h2d1b58b831f06a86
at /home/jonas/dev/rust/build/../src/librustc_driver/driver.rs:854
at /home/jonas/dev/rust/build/../src/librustc_driver/driver.rs:169
16: 0x7f208064b1f6 - rustc_driver::run_compiler::h833483649bdaa9c3
at /home/jonas/dev/rust/build/../src/librustc_driver/lib.rs:226
at /home/jonas/dev/rust/build/../src/librustc_driver/lib.rs:163
17: 0x7f208065b2f7 - rustc_driver::run::_{{closure}}::hf976882a071eba86
at /home/jonas/dev/rust/build/../src/librustc_driver/lib.rs:136
18: 0x7f208065b25b - rustc_driver::monitor::_{{closure}}::hd347b359cf4c5640
at /home/jonas/dev/rust/build/../src/librustc_driver/lib.rs:1052
19: 0x7f208063ad8e - std::panicking::try::call::hd16aacc09eeeaf9e
at /home/jonas/dev/rust/build/../src/libstd/panic.rs:256
at /home/jonas/dev/rust/build/../src/libstd/panicking.rs:272
20: 0x7f207ffb4427 - __rust_maybe_catch_panic
at /home/jonas/dev/rust/build/../src/libpanic_unwind/lib.rs:91
21: 0x7f208065a198 - std::thread::Builder::spawn::_{{closure}}::hf8ba3712412ac8f6
22: 0x7f20806448b0 - _<F as alloc..boxed..FnBox<A>>::call_box::hbf614b3f826456b6
at /home/jonas/dev/rust/build/../src/liballoc/boxed.rs:587
23: 0x7f207ff6fea8 - std::sys_common::thread::start_thread::h88aa5d9761413c7f
at /home/jonas/dev/rust/build/../src/liballoc/boxed.rs:597
at /home/jonas/dev/rust/build/../src/libstd/sys/common/thread.rs:23
24: 0x7f207ff89c08 - std::sys::thread::Thread::new::thread_start::h2e98425c7fffa990
at /home/jonas/dev/rust/build/../src/libstd/sys/unix/thread.rs:73
25: 0x7f20773f1483 - start_thread
26: 0x7f207fb9e6dc - clone
27: 0x0 - <unknown>
error: internal compiler error: unexpected panic
note: the compiler unexpectedly panicked. this is a bug.
note: we would appreciate a bug report: https://github.com/rust-lang/rust/blob/master/CONTRIBUTING.md#bug-reports
note: run with `RUST_BACKTRACE=1` for a backtrace
Build failed, waiting for other jobs to finish...
thread 'rustc' panicked at 'Box<Any>', ../src/librustc_errors/lib.rs:634
stack backtrace:
1: 0x7fb7d01b75ee - std::sys::backtrace::tracing::imp::write::hf504bc08f2a3011f
at /home/jonas/dev/rust/build/../src/libstd/sys/unix/backtrace/tracing/gcc_s.rs:42
2: 0x7fb7d01d5401 - std::panicking::default_hook::_{{closure}}::h49b28af2d05b6140
at /home/jonas/dev/rust/build/../src/libstd/panicking.rs:211
3: 0x7fb7d01d370c - std::panicking::default_hook::hf5d79ad4f1ead81e
at /home/jonas/dev/rust/build/../src/libstd/panicking.rs:220
4: 0x7fb7d01d3e9e - std::panicking::rust_panic_with_hook::h9a3925e37821d434
at /home/jonas/dev/rust/build/../src/libstd/panicking.rs:370
5: 0x7fb7c7f7527a - std::panicking::begin_panic::hdf32e6f0d48da313
at /home/jonas/dev/rust/build/../src/libstd/panicking.rs:328
6: 0x7fb7c7f79664 - rustc_errors::Handler::bug::h70543a8999cbd314
at /home/jonas/dev/rust/build/<std macros>:3
7: 0x7fb7cf721c49 - rustc::session::opt_span_bug_fmt::_{{closure}}::hfbd05ef01f930389
8: 0x7fb7cf7219ea - rustc::ty::context::tls::with_opt::_{{closure}}::hf052d4aa2a56d43a
9: 0x7fb7cf7202c9 - rustc::ty::context::tls::with::_{{closure}}::hb3938faea4e67369
10: 0x7fb7cc2b16bc - rustc::session::opt_span_bug_fmt::he49e515088fa8437
at /home/jonas/dev/rust/build/../src/libstd/thread/local.rs:245
at /home/jonas/dev/rust/build/../src/librustc/ty/context.rs:917
at /home/jonas/dev/rust/build/../src/librustc/ty/context.rs:932
at /home/jonas/dev/rust/build/../src/librustc/session/mod.rs:643
11: 0x7fb7cc2b1446 - rustc::session::bug_fmt::h142e2dae8ab0314e
at /home/jonas/dev/rust/build/../src/librustc/session/mod.rs:627
12: 0x7fb7cc0abebb - rustc::hir::map::Map::expect_item::h8166d05dbc6368f1
at /home/jonas/dev/rust/build/../src/librustc/macros.rs:52
13: 0x7fb7ce6d5450 - _<rustc..ty..context..TyCtxt<'a, 'tcx, 'tcx> as rustc_incremental..calculate_svh..SvhCalculate>::calculate_item_hash::h722c63e63668fd84
at /home/jonas/dev/rust/build/../src/librustc_incremental/calculate_svh.rs:94
14: 0x7fb7ce6d5aa2 - rustc_incremental::persist::hash::HashContext::hash::h9e8e32d88bfdee9b
at /home/jonas/dev/rust/build/../src/librustc_incremental/persist/hash.rs:71
at /home/jonas/dev/rust/build/../src/librustc_incremental/persist/hash.rs:47
15: 0x7fb7ce6eefa1 - rustc_incremental::persist::save::encode_dep_graph::h394c6e3e2c7a145b
at /home/jonas/dev/rust/build/../src/librustc_incremental/persist/save.rs:110
at /home/jonas/dev/rust/build/../src/libcore/iter/mod.rs:1015
at /home/jonas/dev/rust/build/../src/libcollections/vec.rs:1450
at /home/jonas/dev/rust/build/../src/libcollections/vec.rs:1358
at /home/jonas/dev/rust/build/../src/libcore/iter/iterator.rs:1207
at /home/jonas/dev/rust/build/../src/librustc_incremental/persist/save.rs:107
16: 0x7fb7ce6ed21b - rustc_incremental::persist::save::save_dep_graph::h2c7f137260043f58
at /home/jonas/dev/rust/build/../src/librustc_incremental/persist/save.rs:32
at /home/jonas/dev/rust/build/../src/librustc_incremental/persist/save.rs:70
at /home/jonas/dev/rust/build/../src/librustc_incremental/persist/save.rs:32
17: 0x7fb7d07c6874 - rustc_driver::driver::phase_4_translate_to_llvm::hc95fd2db30f21bfa
at /home/jonas/dev/rust/build/../src/librustc_driver/driver.rs:1019
at /home/jonas/dev/rust/build/../src/librustc/util/common.rs:38
at /home/jonas/dev/rust/build/../src/librustc_driver/driver.rs:1017
18: 0x7fb7d0806abb - rustc_driver::driver::compile_input::_{{closure}}::h85c16c9210e90d8f
at /home/jonas/dev/rust/build/../src/librustc_driver/driver.rs:203
19: 0x7fb7d07d4161 - rustc_driver::driver::phase_3_run_analysis_passes::_{{closure}}::h58d639cefbed8f65
at /home/jonas/dev/rust/build/../src/librustc_driver/driver.rs:972
20: 0x7fb7d07ceacc - rustc::ty::context::tls::enter::_{{closure}}::ha2bd9f5c311d0a28
21: 0x7fb7d07cef1a - rustc::ty::context::tls::enter_global::_{{closure}}::h07899291426b66b8
22: 0x7fb7d079a56d - rustc::ty::context::TyCtxt::create_and_enter::h903f5209af5105c8
at /home/jonas/dev/rust/build/../src/libstd/thread/local.rs:245
at /home/jonas/dev/rust/build/../src/librustc/ty/context.rs:886
at /home/jonas/dev/rust/build/../src/librustc/ty/context.rs:685
23: 0x7fb7d07b9e57 - rustc_driver::driver::compile_input::h2d1b58b831f06a86
at /home/jonas/dev/rust/build/../src/librustc_driver/driver.rs:854
at /home/jonas/dev/rust/build/../src/librustc_driver/driver.rs:169
24: 0x7fb7d08a91f6 - rustc_driver::run_compiler::h833483649bdaa9c3
at /home/jonas/dev/rust/build/../src/librustc_driver/lib.rs:226
at /home/jonas/dev/rust/build/../src/librustc_driver/lib.rs:163
25: 0x7fb7d08b92f7 - rustc_driver::run::_{{closure}}::hf976882a071eba86
at /home/jonas/dev/rust/build/../src/librustc_driver/lib.rs:136
26: 0x7fb7d08b925b - rustc_driver::monitor::_{{closure}}::hd347b359cf4c5640
at /home/jonas/dev/rust/build/../src/librustc_driver/lib.rs:1052
27: 0x7fb7d0898d8e - std::panicking::try::call::hd16aacc09eeeaf9e
at /home/jonas/dev/rust/build/../src/libstd/panic.rs:256
at /home/jonas/dev/rust/build/../src/libstd/panicking.rs:272
28: 0x7fb7d0212427 - __rust_maybe_catch_panic
at /home/jonas/dev/rust/build/../src/libpanic_unwind/lib.rs:91
29: 0x7fb7d08b8198 - std::thread::Builder::spawn::_{{closure}}::hf8ba3712412ac8f6
30: 0x7fb7d08a28b0 - _<F as alloc..boxed..FnBox<A>>::call_box::hbf614b3f826456b6
at /home/jonas/dev/rust/build/../src/liballoc/boxed.rs:587
31: 0x7fb7d01cdea8 - std::sys_common::thread::start_thread::h88aa5d9761413c7f
at /home/jonas/dev/rust/build/../src/liballoc/boxed.rs:597
at /home/jonas/dev/rust/build/../src/libstd/sys/common/thread.rs:23
32: 0x7fb7d01e7c08 - std::sys::thread::Thread::new::thread_start::h2e98425c7fffa990
at /home/jonas/dev/rust/build/../src/libstd/sys/unix/thread.rs:73
33: 0x7fb7c764f483 - start_thread
34: 0x7fb7cfdfc6dc - clone
35: 0x0 - <unknown>
error: internal compiler error: ../src/librustc/hir/map/mod.rs:502: expected item, found foreign item isalnum (id=97)
note: the compiler unexpectedly panicked. this is a bug.
note: we would appreciate a bug report: https://github.com/rust-lang/rust/blob/master/CONTRIBUTING.md#bug-reports
note: run with `RUST_BACKTRACE=1` for a backtrace
Build failed, waiting for other jobs to finish...
error: Could not compile `dbghelp-sys`.
To learn more, run the command again with --verbose.
Sign up for free to join this conversation on GitHub. Already have an account? Sign in to comment