Skip to content

Instantly share code, notes, and snippets.

@kesh5 kesh5/pyenv.log Secret
Created May 28, 2019

Embed
What would you like to do?
pyenv verbose log
/var/folders/mw/0ddksqyn4x18lbwftnc5dg0w0000gn/T/python-build.20190529102900.38780 ~/Documents/Repo/ezra
/var/folders/mw/0ddksqyn4x18lbwftnc5dg0w0000gn/T/python-build.20190529102900.38780/Python-3.7.0 /var/folders/mw/0ddksqyn4x18lbwftnc5dg0w0000gn/T/python-build.20190529102900.38780 ~/Documents/Repo/ezra
checking build system type... x86_64-apple-darwin18.5.0
checking host system type... x86_64-apple-darwin18.5.0
checking for python3.7... python3.7
checking for --enable-universalsdk... no
checking for --with-universal-archs... no
checking MACHDEP... checking for --without-gcc... no
checking for --with-icc... no
checking for gcc... clang
checking whether the C compiler works... yes
checking for C compiler default output file name... a.out
checking for suffix of executables...
checking whether we are cross compiling... no
checking for suffix of object files... o
checking whether we are using the GNU C compiler... yes
checking whether clang accepts -g... yes
checking for clang option to accept ISO C89... none needed
checking how to run the C preprocessor... clang -E
checking for grep that handles long lines and -e... /usr/bin/grep
checking for a sed that does not truncate output... /usr/bin/sed
checking for --with-cxx-main=<compiler>... no
checking for clang++... no
configure:
By default, distutils will build C++ extension modules with "clang++".
If this is not intended, then set CXX on the configure command line.
checking for the platform triplet based on compiler characteristics... darwin
checking for -Wl,--no-as-needed... no
checking for egrep... /usr/bin/grep -E
checking for ANSI C header files... yes
checking for sys/types.h... yes
checking for sys/stat.h... yes
checking for stdlib.h... yes
checking for string.h... yes
checking for memory.h... yes
checking for strings.h... yes
checking for inttypes.h... yes
checking for stdint.h... yes
checking for unistd.h... yes
checking minix/config.h usability... no
checking minix/config.h presence... no
checking for minix/config.h... no
checking whether it is safe to define __EXTENSIONS__... yes
checking for the Android API level... not Android
checking for --with-suffix...
checking for case-insensitive build directory... yes
checking LIBRARY... libpython$(VERSION)$(ABIFLAGS).a
checking LINKCC... $(PURIFY) $(MAINCC)
checking for GNU ld... no
checking for --enable-shared... no
checking for --enable-profiling... no
checking LDLIBRARY... libpython$(VERSION)$(ABIFLAGS).a
checking for ar... ar
checking for readelf... no
checking for a BSD-compatible install... /usr/bin/install -c
checking for a thread-safe mkdir -p... ./install-sh -c -d
checking for --with-pydebug... no
checking for --with-assertions... no
checking for --enable-optimizations... no
checking for --with-lto... no
checking target system type... x86_64-apple-darwin18.5.0
checking for -llvm-profdata... no
checking for llvm-profdata... ''
configure: llvm-profdata found via xcrun: /usr/bin/xcrun llvm-profdata
checking for -Wextra... yes
checking whether clang accepts and needs -fno-strict-aliasing... no
checking if we can turn off clang unused result warning... yes
checking if we can turn off clang unused parameter warning... yes
checking if we can turn off clang missing field initializers warning... yes
checking if we can turn off clang invalid function cast warning... no
checking if we can turn on clang mixed sign comparison warning... yes
checking if we can turn on clang unreachable code warning... yes
checking if we can turn on clang strict-prototypes warning... yes
checking if we can make implicit function declaration an error in clang... yes
checking which MACOSX_DEPLOYMENT_TARGET to use... 10.14
checking whether pthreads are available without options... yes
checking whether clang++ also accepts flags for thread support... no
checking for ANSI C header files... (cached) yes
checking asm/types.h usability... no
checking asm/types.h presence... no
checking for asm/types.h... no
checking crypt.h usability... no
checking crypt.h presence... no
checking for crypt.h... no
checking conio.h usability... no
checking conio.h presence... no
checking for conio.h... no
checking direct.h usability... no
checking direct.h presence... no
checking for direct.h... no
checking dlfcn.h usability... yes
checking dlfcn.h presence... yes
checking for dlfcn.h... yes
checking errno.h usability... yes
checking errno.h presence... yes
checking for errno.h... yes
checking fcntl.h usability... yes
checking fcntl.h presence... yes
checking for fcntl.h... yes
checking grp.h usability... yes
checking grp.h presence... yes
checking for grp.h... yes
checking ieeefp.h usability... no
checking ieeefp.h presence... no
checking for ieeefp.h... no
checking io.h usability... no
checking io.h presence... no
checking for io.h... no
checking langinfo.h usability... yes
checking langinfo.h presence... yes
checking for langinfo.h... yes
checking libintl.h usability... no
checking libintl.h presence... no
checking for libintl.h... no
checking process.h usability... no
checking process.h presence... no
checking for process.h... no
checking pthread.h usability... yes
checking pthread.h presence... yes
checking for pthread.h... yes
checking sched.h usability... yes
checking sched.h presence... yes
checking for sched.h... yes
checking shadow.h usability... no
checking shadow.h presence... no
checking for shadow.h... no
checking signal.h usability... yes
checking signal.h presence... yes
checking for signal.h... yes
checking stropts.h usability... no
checking stropts.h presence... no
checking for stropts.h... no
checking termios.h usability... yes
checking termios.h presence... yes
checking for termios.h... yes
checking for unistd.h... (cached) yes
checking utime.h usability... yes
checking utime.h presence... yes
checking for utime.h... yes
checking poll.h usability... yes
checking poll.h presence... yes
checking for poll.h... yes
checking sys/devpoll.h usability... no
checking sys/devpoll.h presence... no
checking for sys/devpoll.h... no
checking sys/epoll.h usability... no
checking sys/epoll.h presence... no
checking for sys/epoll.h... no
checking sys/poll.h usability... yes
checking sys/poll.h presence... yes
checking for sys/poll.h... yes
checking sys/audioio.h usability... no
checking sys/audioio.h presence... no
checking for sys/audioio.h... no
checking sys/xattr.h usability... yes
checking sys/xattr.h presence... yes
checking for sys/xattr.h... yes
checking sys/bsdtty.h usability... no
checking sys/bsdtty.h presence... no
checking for sys/bsdtty.h... no
checking sys/event.h usability... yes
checking sys/event.h presence... yes
checking for sys/event.h... yes
checking sys/file.h usability... yes
checking sys/file.h presence... yes
checking for sys/file.h... yes
checking sys/ioctl.h usability... yes
checking sys/ioctl.h presence... yes
checking for sys/ioctl.h... yes
checking sys/kern_control.h usability... yes
checking sys/kern_control.h presence... yes
checking for sys/kern_control.h... yes
checking sys/loadavg.h usability... no
checking sys/loadavg.h presence... no
checking for sys/loadavg.h... no
checking sys/lock.h usability... yes
checking sys/lock.h presence... yes
checking for sys/lock.h... yes
checking sys/mkdev.h usability... no
checking sys/mkdev.h presence... no
checking for sys/mkdev.h... no
checking sys/modem.h usability... no
checking sys/modem.h presence... no
checking for sys/modem.h... no
checking sys/param.h usability... yes
checking sys/param.h presence... yes
checking for sys/param.h... yes
checking sys/random.h usability... yes
checking sys/random.h presence... yes
checking for sys/random.h... yes
checking sys/select.h usability... yes
checking sys/select.h presence... yes
checking for sys/select.h... yes
checking sys/sendfile.h usability... no
checking sys/sendfile.h presence... no
checking for sys/sendfile.h... no
checking sys/socket.h usability... yes
checking sys/socket.h presence... yes
checking for sys/socket.h... yes
checking sys/statvfs.h usability... yes
checking sys/statvfs.h presence... yes
checking for sys/statvfs.h... yes
checking for sys/stat.h... (cached) yes
checking sys/syscall.h usability... yes
checking sys/syscall.h presence... yes
checking for sys/syscall.h... yes
checking sys/sys_domain.h usability... yes
checking sys/sys_domain.h presence... yes
checking for sys/sys_domain.h... yes
checking sys/termio.h usability... no
checking sys/termio.h presence... no
checking for sys/termio.h... no
checking sys/time.h usability... yes
checking sys/time.h presence... yes
checking for sys/time.h... yes
checking sys/times.h usability... yes
checking sys/times.h presence... yes
checking for sys/times.h... yes
checking for sys/types.h... (cached) yes
checking sys/uio.h usability... yes
checking sys/uio.h presence... yes
checking for sys/uio.h... yes
checking sys/un.h usability... yes
checking sys/un.h presence... yes
checking for sys/un.h... yes
checking sys/utsname.h usability... yes
checking sys/utsname.h presence... yes
checking for sys/utsname.h... yes
checking sys/wait.h usability... yes
checking sys/wait.h presence... yes
checking for sys/wait.h... yes
checking pty.h usability... no
checking pty.h presence... no
checking for pty.h... no
checking libutil.h usability... no
checking libutil.h presence... no
checking for libutil.h... no
checking sys/resource.h usability... yes
checking sys/resource.h presence... yes
checking for sys/resource.h... yes
checking netpacket/packet.h usability... no
checking netpacket/packet.h presence... no
checking for netpacket/packet.h... no
checking sysexits.h usability... yes
checking sysexits.h presence... yes
checking for sysexits.h... yes
checking bluetooth.h usability... no
checking bluetooth.h presence... no
checking for bluetooth.h... no
checking linux/tipc.h usability... no
checking linux/tipc.h presence... no
checking for linux/tipc.h... no
checking linux/random.h usability... no
checking linux/random.h presence... no
checking for linux/random.h... no
checking spawn.h usability... yes
checking spawn.h presence... yes
checking for spawn.h... yes
checking util.h usability... no
checking util.h presence... no
checking for util.h... no
checking alloca.h usability... yes
checking alloca.h presence... yes
checking for alloca.h... yes
checking endian.h usability... no
checking endian.h presence... no
checking for endian.h... no
checking sys/endian.h usability... no
checking sys/endian.h presence... no
checking for sys/endian.h... no
checking sys/sysmacros.h usability... no
checking sys/sysmacros.h presence... no
checking for sys/sysmacros.h... no
checking for dirent.h that defines DIR... yes
checking for library containing opendir... none required
checking whether sys/types.h defines makedev... yes
checking bluetooth/bluetooth.h usability... no
checking bluetooth/bluetooth.h presence... no
checking for bluetooth/bluetooth.h... no
checking for net/if.h... yes
checking for linux/netlink.h... no
checking for linux/vm_sockets.h... no
checking for linux/can.h... no
checking for linux/can/raw.h... no
checking for linux/can/bcm.h... no
checking for clock_t in time.h... yes
checking for makedev... yes
checking for le64toh... no
checking for mode_t... yes
checking for off_t... yes
checking for pid_t... yes
checking for size_t... yes
checking for uid_t in sys/types.h... yes
checking for ssize_t... yes
checking for __uint128_t... yes
checking size of int... 4
checking size of long... 8
checking size of long long... 8
checking size of void *... 8
checking size of short... 2
checking size of float... 4
checking size of double... 8
checking size of fpos_t... 8
checking size of size_t... 8
checking size of pid_t... 4
checking size of uintptr_t... 8
checking for long double support... yes
checking size of long double... 16
checking size of _Bool... 1
checking size of off_t... 8
checking whether to enable large file support... no
checking size of time_t... 8
checking for pthread_t... yes
checking size of pthread_t... 8
checking size of pthread_key_t... 8
checking whether pthread_key_t is compatible with int... no
checking for --enable-framework... no
checking for dyld... always on for Darwin
checking the extension of shared libraries... .so
checking LDSHARED... $(CC) -bundle -undefined dynamic_lookup
checking CCSHARED...
checking LINKFORSHARED... -Wl,-stack_size,1000000 -framework CoreFoundation
checking CFLAGSFORSHARED...
checking SHLIBS... $(LIBS)
checking for sendfile in -lsendfile... no
checking for dlopen in -ldl... yes
checking for shl_load in -ldld... no
checking uuid/uuid.h usability... yes
checking uuid/uuid.h presence... yes
checking for uuid/uuid.h... yes
checking uuid.h usability... no
checking uuid.h presence... no
checking for uuid.h... no
checking for uuid_generate_time_safe... no
checking for uuid_create... no
checking for uuid_enc_be... no
checking for library containing sem_init... none required
checking for textdomain in -lintl... no
checking aligned memory access is required... no
checking for --with-hash-algorithm... default
checking for --with-address-sanitizer... no
checking for t_open in -lnsl... no
checking for socket in -lsocket... no
checking for --with-libs... no
checking for pkg-config... /usr/local/bin/pkg-config
checking pkg-config is at least version 0.9.0... yes
checking for --with-system-expat... no
checking for --with-system-ffi... no
checking for --with-system-libmpdec... no
checking for --enable-loadable-sqlite-extensions... no
checking for --with-tcltk-includes... default
checking for --with-tcltk-libs... default
checking for --with-dbmliborder...
checking if PTHREAD_SCOPE_SYSTEM is supported... yes
checking for pthread_sigmask... yes
checking for pthread_getcpuclockid... no
checking if --enable-ipv6 is specified... yes
checking if RFC2553 API is available... yes
checking ipv6 stack type... kame
using libc
checking for CAN_RAW_FD_FRAMES... no
checking for --with-doc-strings... yes
checking for --with-pymalloc... yes
checking for --with-c-locale-coercion... yes
checking for --with-c-locale-warning... yes
checking for --with-valgrind... no
checking for --with-dtrace... no
checking for dlopen... yes
checking DYNLOADFILE... dynload_shlib.o
checking MACHDEP_OBJS... none
checking for alarm... yes
checking for accept4... no
checking for setitimer... yes
checking for getitimer... yes
checking for bind_textdomain_codeset... no
checking for chown... yes
checking for clock... yes
checking for confstr... yes
checking for ctermid... yes
checking for dup3... no
checking for execv... yes
checking for faccessat... yes
checking for fchmod... yes
checking for fchmodat... yes
checking for fchown... yes
checking for fchownat... yes
checking for fexecve... no
checking for fdopendir... yes
checking for fork... yes
checking for fpathconf... yes
checking for fstatat... yes
checking for ftime... yes
checking for ftruncate... yes
checking for futimesat... no
checking for futimens... yes
checking for futimes... yes
checking for gai_strerror... yes
checking for getentropy... yes
checking for getgrouplist... yes
checking for getgroups... yes
checking for getlogin... yes
checking for getloadavg... yes
checking for getpeername... yes
checking for getpgid... yes
checking for getpid... yes
checking for getpriority... yes
checking for getresuid... no
checking for getresgid... no
checking for getpwent... yes
checking for getspnam... no
checking for getspent... no
checking for getsid... yes
checking for getwd... yes
checking for if_nameindex... yes
checking for initgroups... yes
checking for kill... yes
checking for killpg... yes
checking for lchmod... yes
checking for lchown... yes
checking for lockf... yes
checking for linkat... yes
checking for lstat... yes
checking for lutimes... yes
checking for mmap... yes
checking for memrchr... no
checking for mbrtowc... yes
checking for mkdirat... yes
checking for mkfifo... yes
checking for mkfifoat... no
checking for mknod... yes
checking for mknodat... no
checking for mktime... yes
checking for mremap... no
checking for nice... yes
checking for openat... yes
checking for pathconf... yes
checking for pause... yes
checking for pipe2... no
checking for plock... no
checking for poll... yes
checking for posix_fallocate... no
checking for posix_fadvise... no
checking for posix_spawn... yes
checking for pread... yes
checking for preadv... no
checking for preadv2... no
checking for pthread_init... no
checking for pthread_kill... yes
checking for putenv... yes
checking for pwrite... yes
checking for pwritev... no
checking for pwritev2... no
checking for readlink... yes
checking for readlinkat... yes
checking for readv... yes
checking for realpath... yes
checking for renameat... yes
checking for sem_open... yes
checking for sem_timedwait... no
checking for sem_getvalue... yes
checking for sem_unlink... yes
checking for sendfile... yes
checking for setegid... yes
checking for seteuid... yes
checking for setgid... yes
checking for sethostname... yes
checking for setlocale... yes
checking for setregid... yes
checking for setreuid... yes
checking for setresuid... no
checking for setresgid... no
checking for setsid... yes
checking for setpgid... yes
checking for setpgrp... yes
checking for setpriority... yes
checking for setuid... yes
checking for setvbuf... yes
checking for sched_get_priority_max... yes
checking for sched_setaffinity... no
checking for sched_setscheduler... no
checking for sched_setparam... no
checking for sched_rr_get_interval... no
checking for sigaction... yes
checking for sigaltstack... yes
checking for siginterrupt... yes
checking for sigpending... yes
checking for sigrelse... yes
checking for sigtimedwait... no
checking for sigwait... yes
checking for sigwaitinfo... no
checking for snprintf... yes
checking for strftime... yes
checking for strlcpy... yes
checking for symlinkat... yes
checking for sync... yes
checking for sysconf... yes
checking for tcgetpgrp... yes
checking for tcsetpgrp... yes
checking for tempnam... yes
checking for timegm... yes
checking for times... yes
checking for tmpfile... yes
checking for tmpnam... yes
checking for tmpnam_r... no
checking for truncate... yes
checking for uname... yes
checking for unlinkat... yes
checking for unsetenv... yes
checking for utimensat... yes
checking for utimes... yes
checking for waitid... yes
checking for waitpid... yes
checking for wait3... yes
checking for wait4... yes
checking for wcscoll... yes
checking for wcsftime... yes
checking for wcsxfrm... yes
checking for wmemcmp... yes
checking for writev... yes
checking for _getpty... no
checking whether dirfd is declared... yes
checking for chroot... yes
checking for link... yes
checking for symlink... yes
checking for fchdir... yes
checking for fsync... yes
checking for fdatasync... no
checking for epoll... no
checking for epoll_create1... no
checking for kqueue... yes
checking for prlimit... no
checking for ctermid_r... yes
checking for flock declaration... yes
checking for flock... yes
checking for getpagesize... yes
checking for broken unsetenv... no
checking for true... true
checking for inet_aton in -lc... yes
checking for chflags... yes
checking for lchflags... yes
checking for inflateCopy in -lz... yes
checking for hstrerror... yes
checking for inet_aton... yes
checking for inet_pton... yes
checking for setgroups... yes
checking for openpty... yes
checking for forkpty... yes
checking for fseek64... no
checking for fseeko... yes
checking for fstatvfs... yes
checking for ftell64... no
checking for ftello... yes
checking for statvfs... yes
checking for dup2... yes
checking for strdup... yes
checking for getpgrp... yes
checking for setpgrp... (cached) yes
checking for gettimeofday... yes
checking for clock_gettime... yes
checking for clock_getres... yes
checking for clock_settime... yes
checking for major... yes
checking for getaddrinfo... yes
checking getaddrinfo bug... no
checking for getnameinfo... yes
checking whether time.h and sys/time.h may both be included... yes
checking whether struct tm is in sys/time.h or time.h... time.h
checking for struct tm.tm_zone... yes
checking for struct stat.st_rdev... yes
checking for struct stat.st_blksize... yes
checking for struct stat.st_flags... yes
checking for struct stat.st_gen... yes
checking for struct stat.st_birthtime... yes
checking for struct stat.st_blocks... yes
checking for struct passwd.pw_gecos... yes
checking for struct passwd.pw_passwd... yes
checking for siginfo_t.si_band... yes
checking for time.h that defines altzone... no
checking whether sys/select.h and sys/time.h may both be included... yes
checking for addrinfo... yes
checking for sockaddr_storage... yes
checking for sockaddr_alg... no
checking whether char is unsigned... no
checking for an ANSI C-conforming const... yes
checking for working signed char... yes
checking for prototypes... yes
checking for variable length prototypes and stdarg.h... yes
checking for socketpair... yes
checking if sockaddr has sa_len member... yes
checking for gethostbyname_r... no
checking for gethostbyname... yes
checking for __fpu_control... no
checking for __fpu_control in -lieee... no
checking for --with-libm=STRING... default LIBM=""
checking for --with-libc=STRING... default LIBC=""
checking for x64 gcc inline assembler... yes
checking whether C doubles are little-endian IEEE 754 binary64... yes
checking whether C doubles are big-endian IEEE 754 binary64... no
checking whether C doubles are ARM mixed-endian IEEE 754 binary64... no
checking whether we can use gcc inline assembler to get and set x87 control word... yes
checking whether we can use gcc inline assembler to get and set mc68881 fpcr... no
checking for x87-style double rounding... no
checking for acosh... yes
checking for asinh... yes
checking for atanh... yes
checking for copysign... yes
checking for erf... yes
checking for erfc... yes
checking for expm1... yes
checking for finite... yes
checking for gamma... yes
checking for hypot... yes
checking for lgamma... yes
checking for log1p... yes
checking for log2... yes
checking for round... yes
checking for tgamma... yes
checking whether isinf is declared... yes
checking whether isnan is declared... yes
checking whether isfinite is declared... yes
checking whether tanh preserves the sign of zero... yes
checking whether log1p drops the sign of negative zero... no
checking whether POSIX semaphores are enabled... yes
checking for broken sem_getvalue... yes
checking whether RTLD_LAZY is declared... yes
checking whether RTLD_NOW is declared... yes
checking whether RTLD_GLOBAL is declared... yes
checking whether RTLD_LOCAL is declared... yes
checking whether RTLD_NODELETE is declared... yes
checking whether RTLD_NOLOAD is declared... yes
checking whether RTLD_DEEPBIND is declared... no
checking whether RTLD_MEMBER is declared... no
checking digit size for Python's longs... no value specified
checking wchar.h usability... yes
checking wchar.h presence... yes
checking for wchar.h... yes
checking size of wchar_t... 4
checking for UCS-4 tcl... no
checking whether wchar_t is signed... yes
no usable wchar_t found
checking whether byte ordering is bigendian... no
checking ABIFLAGS... m
checking SOABI... cpython-37m-darwin
checking LDVERSION... $(VERSION)$(ABIFLAGS)
checking whether right shift extends the sign bit... yes
checking for getc_unlocked() and friends... yes
checking how to link readline libs... -lreadline
checking for rl_pre_input_hook in -lreadline... yes
checking for rl_completion_display_matches_hook in -lreadline... yes
checking for rl_resize_terminal in -lreadline... yes
checking for rl_completion_matches in -lreadline... yes
checking for append_history in -lreadline... yes
checking for broken nice()... no
checking for broken poll()... no
checking for struct tm.tm_zone... (cached) yes
checking for working tzset()... yes
checking for tv_nsec in struct stat... no
checking for tv_nsec2 in struct stat... yes
checking curses.h usability... yes
checking curses.h presence... yes
checking for curses.h... yes
checking ncurses.h usability... yes
checking ncurses.h presence... yes
checking for ncurses.h... yes
checking for term.h... yes
checking whether mvwdelch is an expression... yes
checking whether WINDOW has _flags... yes
checking for is_pad... no
checking for is_term_resized... yes
checking for resize_term... yes
checking for resizeterm... yes
checking for immedok... yes
checking for syncok... yes
checking for wchgat... yes
checking for filter... yes
checking for has_key... yes
checking for typeahead... yes
checking for use_env... yes
configure: checking for device files
checking for /dev/ptmx... yes
checking for /dev/ptc... no
checking for %zd printf() format support... yes
checking for socklen_t... yes
checking for broken mbstowcs... no
checking for --with-computed-gotos... no value specified
checking whether clang supports computed gotos... yes
checking for build directories... done
checking for -O2... yes
checking for glibc _FORTIFY_SOURCE/memmove bug... no
checking for stdatomic.h... no
checking for GCC >= 4.7 __atomic builtins... yes
checking for ensurepip... upgrade
checking if the dirent structure of a d_type field... yes
checking for the Linux getrandom() syscall... no
checking for the getrandom() function... no
checking for openssl/ssl.h in /usr/local/opt/openssl... yes
checking whether compiling and linking against OpenSSL works... yes
checking for X509_VERIFY_PARAM_set1_host in libssl... yes
checking for --with-ssl-default-suites... python
configure: creating ./config.status
config.status: creating Makefile.pre
config.status: creating Misc/python.pc
config.status: creating Misc/python-config.sh
config.status: creating Modules/ld_so_aix
config.status: creating pyconfig.h
creating Modules/Setup
creating Modules/Setup.local
creating Makefile
If you want a release build with all stable optimizations active (PGO, etc),
please run ./configure --enable-optimizations
clang -c -Wno-unused-result -Wsign-compare -Wunreachable-code -DNDEBUG -g -fwrapv -O3 -Wall -std=c99 -Wextra -Wno-unused-result -Wno-unused-parameter -Wno-missing-field-initializers -Wstrict-prototypes -Werror=implicit-function-declaration -I. -I./Include -I/usr/local/opt/readline/include -I/usr/local/opt/readline/include -I/Users/hetal/.pyenv/versions/3.7.0/include -I/usr/local/opt/readline/include -I/usr/local/opt/readline/include -I/Users/hetal/.pyenv/versions/3.7.0/include -DPy_BUILD_CORE -o Programs/python.o ./Programs/python.c
clang -c -Wno-unused-result -Wsign-compare -Wunreachable-code -DNDEBUG -g -fwrapv -O3 -Wall -std=c99 -Wextra -Wno-unused-result -Wno-unused-parameter -Wno-missing-field-initializers -Wstrict-prototypes -Werror=implicit-function-declaration -I. -I./Include -I/usr/local/opt/readline/include -I/usr/local/opt/readline/include -I/Users/hetal/.pyenv/versions/3.7.0/include -I/usr/local/opt/readline/include -I/usr/local/opt/readline/include -I/Users/hetal/.pyenv/versions/3.7.0/include -DPy_BUILD_CORE -o Parser/acceler.o Parser/acceler.c
clang -c -Wno-unused-result -Wsign-compare -Wunreachable-code -DNDEBUG -g -fwrapv -O3 -Wall -std=c99 -Wextra -Wno-unused-result -Wno-unused-parameter -Wno-missing-field-initializers -Wstrict-prototypes -Werror=implicit-function-declaration -I. -I./Include -I/usr/local/opt/readline/include -I/usr/local/opt/readline/include -I/Users/hetal/.pyenv/versions/3.7.0/include -I/usr/local/opt/readline/include -I/usr/local/opt/readline/include -I/Users/hetal/.pyenv/versions/3.7.0/include -DPy_BUILD_CORE -o Parser/grammar1.o Parser/grammar1.c
clang -c -Wno-unused-result -Wsign-compare -Wunreachable-code -DNDEBUG -g -fwrapv -O3 -Wall -std=c99 -Wextra -Wno-unused-result -Wno-unused-parameter -Wno-missing-field-initializers -Wstrict-prototypes -Werror=implicit-function-declaration -I. -I./Include -I/usr/local/opt/readline/include -I/usr/local/opt/readline/include -I/Users/hetal/.pyenv/versions/3.7.0/include -I/usr/local/opt/readline/include -I/usr/local/opt/readline/include -I/Users/hetal/.pyenv/versions/3.7.0/include -DPy_BUILD_CORE -o Parser/listnode.o Parser/listnode.c
clang -c -Wno-unused-result -Wsign-compare -Wunreachable-code -DNDEBUG -g -fwrapv -O3 -Wall -std=c99 -Wextra -Wno-unused-result -Wno-unused-parameter -Wno-missing-field-initializers -Wstrict-prototypes -Werror=implicit-function-declaration -I. -I./Include -I/usr/local/opt/readline/include -I/usr/local/opt/readline/include -I/Users/hetal/.pyenv/versions/3.7.0/include -I/usr/local/opt/readline/include -I/usr/local/opt/readline/include -I/Users/hetal/.pyenv/versions/3.7.0/include -DPy_BUILD_CORE -o Parser/node.o Parser/node.c
clang -c -Wno-unused-result -Wsign-compare -Wunreachable-code -DNDEBUG -g -fwrapv -O3 -Wall -std=c99 -Wextra -Wno-unused-result -Wno-unused-parameter -Wno-missing-field-initializers -Wstrict-prototypes -Werror=implicit-function-declaration -I. -I./Include -I/usr/local/opt/readline/include -I/usr/local/opt/readline/include -I/Users/hetal/.pyenv/versions/3.7.0/include -I/usr/local/opt/readline/include -I/usr/local/opt/readline/include -I/Users/hetal/.pyenv/versions/3.7.0/include -DPy_BUILD_CORE -o Parser/parser.o Parser/parser.c
clang -c -Wno-unused-result -Wsign-compare -Wunreachable-code -DNDEBUG -g -fwrapv -O3 -Wall -std=c99 -Wextra -Wno-unused-result -Wno-unused-parameter -Wno-missing-field-initializers -Wstrict-prototypes -Werror=implicit-function-declaration -I. -I./Include -I/usr/local/opt/readline/include -I/usr/local/opt/readline/include -I/Users/hetal/.pyenv/versions/3.7.0/include -I/usr/local/opt/readline/include -I/usr/local/opt/readline/include -I/Users/hetal/.pyenv/versions/3.7.0/include -DPy_BUILD_CORE -o Parser/bitset.o Parser/bitset.c
clang -c -Wno-unused-result -Wsign-compare -Wunreachable-code -DNDEBUG -g -fwrapv -O3 -Wall -std=c99 -Wextra -Wno-unused-result -Wno-unused-parameter -Wno-missing-field-initializers -Wstrict-prototypes -Werror=implicit-function-declaration -I. -I./Include -I/usr/local/opt/readline/include -I/usr/local/opt/readline/include -I/Users/hetal/.pyenv/versions/3.7.0/include -I/usr/local/opt/readline/include -I/usr/local/opt/readline/include -I/Users/hetal/.pyenv/versions/3.7.0/include -DPy_BUILD_CORE -o Parser/metagrammar.o Parser/metagrammar.c
clang -c -Wno-unused-result -Wsign-compare -Wunreachable-code -DNDEBUG -g -fwrapv -O3 -Wall -std=c99 -Wextra -Wno-unused-result -Wno-unused-parameter -Wno-missing-field-initializers -Wstrict-prototypes -Werror=implicit-function-declaration -I. -I./Include -I/usr/local/opt/readline/include -I/usr/local/opt/readline/include -I/Users/hetal/.pyenv/versions/3.7.0/include -I/usr/local/opt/readline/include -I/usr/local/opt/readline/include -I/Users/hetal/.pyenv/versions/3.7.0/include -DPy_BUILD_CORE -o Parser/firstsets.o Parser/firstsets.c
clang -c -Wno-unused-result -Wsign-compare -Wunreachable-code -DNDEBUG -g -fwrapv -O3 -Wall -std=c99 -Wextra -Wno-unused-result -Wno-unused-parameter -Wno-missing-field-initializers -Wstrict-prototypes -Werror=implicit-function-declaration -I. -I./Include -I/usr/local/opt/readline/include -I/usr/local/opt/readline/include -I/Users/hetal/.pyenv/versions/3.7.0/include -I/usr/local/opt/readline/include -I/usr/local/opt/readline/include -I/Users/hetal/.pyenv/versions/3.7.0/include -DPy_BUILD_CORE -o Parser/grammar.o Parser/grammar.c
clang -c -Wno-unused-result -Wsign-compare -Wunreachable-code -DNDEBUG -g -fwrapv -O3 -Wall -std=c99 -Wextra -Wno-unused-result -Wno-unused-parameter -Wno-missing-field-initializers -Wstrict-prototypes -Werror=implicit-function-declaration -I. -I./Include -I/usr/local/opt/readline/include -I/usr/local/opt/readline/include -I/Users/hetal/.pyenv/versions/3.7.0/include -I/usr/local/opt/readline/include -I/usr/local/opt/readline/include -I/Users/hetal/.pyenv/versions/3.7.0/include -DPy_BUILD_CORE -o Parser/pgen.o Parser/pgen.c
clang -c -Wno-unused-result -Wsign-compare -Wunreachable-code -DNDEBUG -g -fwrapv -O3 -Wall -std=c99 -Wextra -Wno-unused-result -Wno-unused-parameter -Wno-missing-field-initializers -Wstrict-prototypes -Werror=implicit-function-declaration -I. -I./Include -I/usr/local/opt/readline/include -I/usr/local/opt/readline/include -I/Users/hetal/.pyenv/versions/3.7.0/include -I/usr/local/opt/readline/include -I/usr/local/opt/readline/include -I/Users/hetal/.pyenv/versions/3.7.0/include -DPy_BUILD_CORE -o Parser/myreadline.o Parser/myreadline.c
clang -c -Wno-unused-result -Wsign-compare -Wunreachable-code -DNDEBUG -g -fwrapv -O3 -Wall -std=c99 -Wextra -Wno-unused-result -Wno-unused-parameter -Wno-missing-field-initializers -Wstrict-prototypes -Werror=implicit-function-declaration -I. -I./Include -I/usr/local/opt/readline/include -I/usr/local/opt/readline/include -I/Users/hetal/.pyenv/versions/3.7.0/include -I/usr/local/opt/readline/include -I/usr/local/opt/readline/include -I/Users/hetal/.pyenv/versions/3.7.0/include -DPy_BUILD_CORE -o Parser/parsetok.o Parser/parsetok.c
clang -c -Wno-unused-result -Wsign-compare -Wunreachable-code -DNDEBUG -g -fwrapv -O3 -Wall -std=c99 -Wextra -Wno-unused-result -Wno-unused-parameter -Wno-missing-field-initializers -Wstrict-prototypes -Werror=implicit-function-declaration -I. -I./Include -I/usr/local/opt/readline/include -I/usr/local/opt/readline/include -I/Users/hetal/.pyenv/versions/3.7.0/include -I/usr/local/opt/readline/include -I/usr/local/opt/readline/include -I/Users/hetal/.pyenv/versions/3.7.0/include -DPy_BUILD_CORE -o Parser/tokenizer.o Parser/tokenizer.c
clang -c -Wno-unused-result -Wsign-compare -Wunreachable-code -DNDEBUG -g -fwrapv -O3 -Wall -std=c99 -Wextra -Wno-unused-result -Wno-unused-parameter -Wno-missing-field-initializers -Wstrict-prototypes -Werror=implicit-function-declaration -I. -I./Include -I/usr/local/opt/readline/include -I/usr/local/opt/readline/include -I/Users/hetal/.pyenv/versions/3.7.0/include -I/usr/local/opt/readline/include -I/usr/local/opt/readline/include -I/Users/hetal/.pyenv/versions/3.7.0/include -DPy_BUILD_CORE -o Objects/abstract.o Objects/abstract.c
clang -c -Wno-unused-result -Wsign-compare -Wunreachable-code -DNDEBUG -g -fwrapv -O3 -Wall -std=c99 -Wextra -Wno-unused-result -Wno-unused-parameter -Wno-missing-field-initializers -Wstrict-prototypes -Werror=implicit-function-declaration -I. -I./Include -I/usr/local/opt/readline/include -I/usr/local/opt/readline/include -I/Users/hetal/.pyenv/versions/3.7.0/include -I/usr/local/opt/readline/include -I/usr/local/opt/readline/include -I/Users/hetal/.pyenv/versions/3.7.0/include -DPy_BUILD_CORE -o Objects/accu.o Objects/accu.c
clang -c -Wno-unused-result -Wsign-compare -Wunreachable-code -DNDEBUG -g -fwrapv -O3 -Wall -std=c99 -Wextra -Wno-unused-result -Wno-unused-parameter -Wno-missing-field-initializers -Wstrict-prototypes -Werror=implicit-function-declaration -I. -I./Include -I/usr/local/opt/readline/include -I/usr/local/opt/readline/include -I/Users/hetal/.pyenv/versions/3.7.0/include -I/usr/local/opt/readline/include -I/usr/local/opt/readline/include -I/Users/hetal/.pyenv/versions/3.7.0/include -DPy_BUILD_CORE -o Objects/boolobject.o Objects/boolobject.c
clang -c -Wno-unused-result -Wsign-compare -Wunreachable-code -DNDEBUG -g -fwrapv -O3 -Wall -std=c99 -Wextra -Wno-unused-result -Wno-unused-parameter -Wno-missing-field-initializers -Wstrict-prototypes -Werror=implicit-function-declaration -I. -I./Include -I/usr/local/opt/readline/include -I/usr/local/opt/readline/include -I/Users/hetal/.pyenv/versions/3.7.0/include -I/usr/local/opt/readline/include -I/usr/local/opt/readline/include -I/Users/hetal/.pyenv/versions/3.7.0/include -DPy_BUILD_CORE -o Objects/bytes_methods.o Objects/bytes_methods.c
clang -c -Wno-unused-result -Wsign-compare -Wunreachable-code -DNDEBUG -g -fwrapv -O3 -Wall -std=c99 -Wextra -Wno-unused-result -Wno-unused-parameter -Wno-missing-field-initializers -Wstrict-prototypes -Werror=implicit-function-declaration -I. -I./Include -I/usr/local/opt/readline/include -I/usr/local/opt/readline/include -I/Users/hetal/.pyenv/versions/3.7.0/include -I/usr/local/opt/readline/include -I/usr/local/opt/readline/include -I/Users/hetal/.pyenv/versions/3.7.0/include -DPy_BUILD_CORE -o Objects/bytearrayobject.o Objects/bytearrayobject.c
clang -c -Wno-unused-result -Wsign-compare -Wunreachable-code -DNDEBUG -g -fwrapv -O3 -Wall -std=c99 -Wextra -Wno-unused-result -Wno-unused-parameter -Wno-missing-field-initializers -Wstrict-prototypes -Werror=implicit-function-declaration -I. -I./Include -I/usr/local/opt/readline/include -I/usr/local/opt/readline/include -I/Users/hetal/.pyenv/versions/3.7.0/include -I/usr/local/opt/readline/include -I/usr/local/opt/readline/include -I/Users/hetal/.pyenv/versions/3.7.0/include -DPy_BUILD_CORE -o Objects/bytesobject.o Objects/bytesobject.c
clang -c -Wno-unused-result -Wsign-compare -Wunreachable-code -DNDEBUG -g -fwrapv -O3 -Wall -std=c99 -Wextra -Wno-unused-result -Wno-unused-parameter -Wno-missing-field-initializers -Wstrict-prototypes -Werror=implicit-function-declaration -I. -I./Include -I/usr/local/opt/readline/include -I/usr/local/opt/readline/include -I/Users/hetal/.pyenv/versions/3.7.0/include -I/usr/local/opt/readline/include -I/usr/local/opt/readline/include -I/Users/hetal/.pyenv/versions/3.7.0/include -DPy_BUILD_CORE -o Objects/call.o Objects/call.c
clang -c -Wno-unused-result -Wsign-compare -Wunreachable-code -DNDEBUG -g -fwrapv -O3 -Wall -std=c99 -Wextra -Wno-unused-result -Wno-unused-parameter -Wno-missing-field-initializers -Wstrict-prototypes -Werror=implicit-function-declaration -I. -I./Include -I/usr/local/opt/readline/include -I/usr/local/opt/readline/include -I/Users/hetal/.pyenv/versions/3.7.0/include -I/usr/local/opt/readline/include -I/usr/local/opt/readline/include -I/Users/hetal/.pyenv/versions/3.7.0/include -DPy_BUILD_CORE -o Objects/cellobject.o Objects/cellobject.c
clang -c -Wno-unused-result -Wsign-compare -Wunreachable-code -DNDEBUG -g -fwrapv -O3 -Wall -std=c99 -Wextra -Wno-unused-result -Wno-unused-parameter -Wno-missing-field-initializers -Wstrict-prototypes -Werror=implicit-function-declaration -I. -I./Include -I/usr/local/opt/readline/include -I/usr/local/opt/readline/include -I/Users/hetal/.pyenv/versions/3.7.0/include -I/usr/local/opt/readline/include -I/usr/local/opt/readline/include -I/Users/hetal/.pyenv/versions/3.7.0/include -DPy_BUILD_CORE -o Objects/classobject.o Objects/classobject.c
clang -c -Wno-unused-result -Wsign-compare -Wunreachable-code -DNDEBUG -g -fwrapv -O3 -Wall -std=c99 -Wextra -Wno-unused-result -Wno-unused-parameter -Wno-missing-field-initializers -Wstrict-prototypes -Werror=implicit-function-declaration -I. -I./Include -I/usr/local/opt/readline/include -I/usr/local/opt/readline/include -I/Users/hetal/.pyenv/versions/3.7.0/include -I/usr/local/opt/readline/include -I/usr/local/opt/readline/include -I/Users/hetal/.pyenv/versions/3.7.0/include -DPy_BUILD_CORE -o Objects/codeobject.o Objects/codeobject.c
clang -c -Wno-unused-result -Wsign-compare -Wunreachable-code -DNDEBUG -g -fwrapv -O3 -Wall -std=c99 -Wextra -Wno-unused-result -Wno-unused-parameter -Wno-missing-field-initializers -Wstrict-prototypes -Werror=implicit-function-declaration -I. -I./Include -I/usr/local/opt/readline/include -I/usr/local/opt/readline/include -I/Users/hetal/.pyenv/versions/3.7.0/include -I/usr/local/opt/readline/include -I/usr/local/opt/readline/include -I/Users/hetal/.pyenv/versions/3.7.0/include -DPy_BUILD_CORE -o Objects/complexobject.o Objects/complexobject.c
clang -c -Wno-unused-result -Wsign-compare -Wunreachable-code -DNDEBUG -g -fwrapv -O3 -Wall -std=c99 -Wextra -Wno-unused-result -Wno-unused-parameter -Wno-missing-field-initializers -Wstrict-prototypes -Werror=implicit-function-declaration -I. -I./Include -I/usr/local/opt/readline/include -I/usr/local/opt/readline/include -I/Users/hetal/.pyenv/versions/3.7.0/include -I/usr/local/opt/readline/include -I/usr/local/opt/readline/include -I/Users/hetal/.pyenv/versions/3.7.0/include -DPy_BUILD_CORE -o Objects/descrobject.o Objects/descrobject.c
clang -c -Wno-unused-result -Wsign-compare -Wunreachable-code -DNDEBUG -g -fwrapv -O3 -Wall -std=c99 -Wextra -Wno-unused-result -Wno-unused-parameter -Wno-missing-field-initializers -Wstrict-prototypes -Werror=implicit-function-declaration -I. -I./Include -I/usr/local/opt/readline/include -I/usr/local/opt/readline/include -I/Users/hetal/.pyenv/versions/3.7.0/include -I/usr/local/opt/readline/include -I/usr/local/opt/readline/include -I/Users/hetal/.pyenv/versions/3.7.0/include -DPy_BUILD_CORE -o Objects/enumobject.o Objects/enumobject.c
clang -c -Wno-unused-result -Wsign-compare -Wunreachable-code -DNDEBUG -g -fwrapv -O3 -Wall -std=c99 -Wextra -Wno-unused-result -Wno-unused-parameter -Wno-missing-field-initializers -Wstrict-prototypes -Werror=implicit-function-declaration -I. -I./Include -I/usr/local/opt/readline/include -I/usr/local/opt/readline/include -I/Users/hetal/.pyenv/versions/3.7.0/include -I/usr/local/opt/readline/include -I/usr/local/opt/readline/include -I/Users/hetal/.pyenv/versions/3.7.0/include -DPy_BUILD_CORE -o Objects/exceptions.o Objects/exceptions.c
clang -c -Wno-unused-result -Wsign-compare -Wunreachable-code -DNDEBUG -g -fwrapv -O3 -Wall -std=c99 -Wextra -Wno-unused-result -Wno-unused-parameter -Wno-missing-field-initializers -Wstrict-prototypes -Werror=implicit-function-declaration -I. -I./Include -I/usr/local/opt/readline/include -I/usr/local/opt/readline/include -I/Users/hetal/.pyenv/versions/3.7.0/include -I/usr/local/opt/readline/include -I/usr/local/opt/readline/include -I/Users/hetal/.pyenv/versions/3.7.0/include -DPy_BUILD_CORE -o Objects/genobject.o Objects/genobject.c
clang -c -Wno-unused-result -Wsign-compare -Wunreachable-code -DNDEBUG -g -fwrapv -O3 -Wall -std=c99 -Wextra -Wno-unused-result -Wno-unused-parameter -Wno-missing-field-initializers -Wstrict-prototypes -Werror=implicit-function-declaration -I. -I./Include -I/usr/local/opt/readline/include -I/usr/local/opt/readline/include -I/Users/hetal/.pyenv/versions/3.7.0/include -I/usr/local/opt/readline/include -I/usr/local/opt/readline/include -I/Users/hetal/.pyenv/versions/3.7.0/include -DPy_BUILD_CORE -o Objects/fileobject.o Objects/fileobject.c
clang -c -Wno-unused-result -Wsign-compare -Wunreachable-code -DNDEBUG -g -fwrapv -O3 -Wall -std=c99 -Wextra -Wno-unused-result -Wno-unused-parameter -Wno-missing-field-initializers -Wstrict-prototypes -Werror=implicit-function-declaration -I. -I./Include -I/usr/local/opt/readline/include -I/usr/local/opt/readline/include -I/Users/hetal/.pyenv/versions/3.7.0/include -I/usr/local/opt/readline/include -I/usr/local/opt/readline/include -I/Users/hetal/.pyenv/versions/3.7.0/include -DPy_BUILD_CORE -o Objects/floatobject.o Objects/floatobject.c
clang -c -Wno-unused-result -Wsign-compare -Wunreachable-code -DNDEBUG -g -fwrapv -O3 -Wall -std=c99 -Wextra -Wno-unused-result -Wno-unused-parameter -Wno-missing-field-initializers -Wstrict-prototypes -Werror=implicit-function-declaration -I. -I./Include -I/usr/local/opt/readline/include -I/usr/local/opt/readline/include -I/Users/hetal/.pyenv/versions/3.7.0/include -I/usr/local/opt/readline/include -I/usr/local/opt/readline/include -I/Users/hetal/.pyenv/versions/3.7.0/include -DPy_BUILD_CORE -o Objects/frameobject.o Objects/frameobject.c
clang -c -Wno-unused-result -Wsign-compare -Wunreachable-code -DNDEBUG -g -fwrapv -O3 -Wall -std=c99 -Wextra -Wno-unused-result -Wno-unused-parameter -Wno-missing-field-initializers -Wstrict-prototypes -Werror=implicit-function-declaration -I. -I./Include -I/usr/local/opt/readline/include -I/usr/local/opt/readline/include -I/Users/hetal/.pyenv/versions/3.7.0/include -I/usr/local/opt/readline/include -I/usr/local/opt/readline/include -I/Users/hetal/.pyenv/versions/3.7.0/include -DPy_BUILD_CORE -o Objects/funcobject.o Objects/funcobject.c
clang -c -Wno-unused-result -Wsign-compare -Wunreachable-code -DNDEBUG -g -fwrapv -O3 -Wall -std=c99 -Wextra -Wno-unused-result -Wno-unused-parameter -Wno-missing-field-initializers -Wstrict-prototypes -Werror=implicit-function-declaration -I. -I./Include -I/usr/local/opt/readline/include -I/usr/local/opt/readline/include -I/Users/hetal/.pyenv/versions/3.7.0/include -I/usr/local/opt/readline/include -I/usr/local/opt/readline/include -I/Users/hetal/.pyenv/versions/3.7.0/include -DPy_BUILD_CORE -o Objects/iterobject.o Objects/iterobject.c
clang -c -Wno-unused-result -Wsign-compare -Wunreachable-code -DNDEBUG -g -fwrapv -O3 -Wall -std=c99 -Wextra -Wno-unused-result -Wno-unused-parameter -Wno-missing-field-initializers -Wstrict-prototypes -Werror=implicit-function-declaration -I. -I./Include -I/usr/local/opt/readline/include -I/usr/local/opt/readline/include -I/Users/hetal/.pyenv/versions/3.7.0/include -I/usr/local/opt/readline/include -I/usr/local/opt/readline/include -I/Users/hetal/.pyenv/versions/3.7.0/include -DPy_BUILD_CORE -o Objects/listobject.o Objects/listobject.c
clang -c -Wno-unused-result -Wsign-compare -Wunreachable-code -DNDEBUG -g -fwrapv -O3 -Wall -std=c99 -Wextra -Wno-unused-result -Wno-unused-parameter -Wno-missing-field-initializers -Wstrict-prototypes -Werror=implicit-function-declaration -I. -I./Include -I/usr/local/opt/readline/include -I/usr/local/opt/readline/include -I/Users/hetal/.pyenv/versions/3.7.0/include -I/usr/local/opt/readline/include -I/usr/local/opt/readline/include -I/Users/hetal/.pyenv/versions/3.7.0/include -DPy_BUILD_CORE -o Objects/longobject.o Objects/longobject.c
clang -c -Wno-unused-result -Wsign-compare -Wunreachable-code -DNDEBUG -g -fwrapv -O3 -Wall -std=c99 -Wextra -Wno-unused-result -Wno-unused-parameter -Wno-missing-field-initializers -Wstrict-prototypes -Werror=implicit-function-declaration -I. -I./Include -I/usr/local/opt/readline/include -I/usr/local/opt/readline/include -I/Users/hetal/.pyenv/versions/3.7.0/include -I/usr/local/opt/readline/include -I/usr/local/opt/readline/include -I/Users/hetal/.pyenv/versions/3.7.0/include -DPy_BUILD_CORE -o Objects/dictobject.o Objects/dictobject.c
clang -c -Wno-unused-result -Wsign-compare -Wunreachable-code -DNDEBUG -g -fwrapv -O3 -Wall -std=c99 -Wextra -Wno-unused-result -Wno-unused-parameter -Wno-missing-field-initializers -Wstrict-prototypes -Werror=implicit-function-declaration -I. -I./Include -I/usr/local/opt/readline/include -I/usr/local/opt/readline/include -I/Users/hetal/.pyenv/versions/3.7.0/include -I/usr/local/opt/readline/include -I/usr/local/opt/readline/include -I/Users/hetal/.pyenv/versions/3.7.0/include -DPy_BUILD_CORE -o Objects/odictobject.o Objects/odictobject.c
clang -c -Wno-unused-result -Wsign-compare -Wunreachable-code -DNDEBUG -g -fwrapv -O3 -Wall -std=c99 -Wextra -Wno-unused-result -Wno-unused-parameter -Wno-missing-field-initializers -Wstrict-prototypes -Werror=implicit-function-declaration -I. -I./Include -I/usr/local/opt/readline/include -I/usr/local/opt/readline/include -I/Users/hetal/.pyenv/versions/3.7.0/include -I/usr/local/opt/readline/include -I/usr/local/opt/readline/include -I/Users/hetal/.pyenv/versions/3.7.0/include -DPy_BUILD_CORE -o Objects/memoryobject.o Objects/memoryobject.c
clang -c -Wno-unused-result -Wsign-compare -Wunreachable-code -DNDEBUG -g -fwrapv -O3 -Wall -std=c99 -Wextra -Wno-unused-result -Wno-unused-parameter -Wno-missing-field-initializers -Wstrict-prototypes -Werror=implicit-function-declaration -I. -I./Include -I/usr/local/opt/readline/include -I/usr/local/opt/readline/include -I/Users/hetal/.pyenv/versions/3.7.0/include -I/usr/local/opt/readline/include -I/usr/local/opt/readline/include -I/Users/hetal/.pyenv/versions/3.7.0/include -DPy_BUILD_CORE -o Objects/methodobject.o Objects/methodobject.c
clang -c -Wno-unused-result -Wsign-compare -Wunreachable-code -DNDEBUG -g -fwrapv -O3 -Wall -std=c99 -Wextra -Wno-unused-result -Wno-unused-parameter -Wno-missing-field-initializers -Wstrict-prototypes -Werror=implicit-function-declaration -I. -I./Include -I/usr/local/opt/readline/include -I/usr/local/opt/readline/include -I/Users/hetal/.pyenv/versions/3.7.0/include -I/usr/local/opt/readline/include -I/usr/local/opt/readline/include -I/Users/hetal/.pyenv/versions/3.7.0/include -DPy_BUILD_CORE -o Objects/moduleobject.o Objects/moduleobject.c
clang -c -Wno-unused-result -Wsign-compare -Wunreachable-code -DNDEBUG -g -fwrapv -O3 -Wall -std=c99 -Wextra -Wno-unused-result -Wno-unused-parameter -Wno-missing-field-initializers -Wstrict-prototypes -Werror=implicit-function-declaration -I. -I./Include -I/usr/local/opt/readline/include -I/usr/local/opt/readline/include -I/Users/hetal/.pyenv/versions/3.7.0/include -I/usr/local/opt/readline/include -I/usr/local/opt/readline/include -I/Users/hetal/.pyenv/versions/3.7.0/include -DPy_BUILD_CORE -o Objects/namespaceobject.o Objects/namespaceobject.c
clang -c -Wno-unused-result -Wsign-compare -Wunreachable-code -DNDEBUG -g -fwrapv -O3 -Wall -std=c99 -Wextra -Wno-unused-result -Wno-unused-parameter -Wno-missing-field-initializers -Wstrict-prototypes -Werror=implicit-function-declaration -I. -I./Include -I/usr/local/opt/readline/include -I/usr/local/opt/readline/include -I/Users/hetal/.pyenv/versions/3.7.0/include -I/usr/local/opt/readline/include -I/usr/local/opt/readline/include -I/Users/hetal/.pyenv/versions/3.7.0/include -DPy_BUILD_CORE -o Objects/object.o Objects/object.c
clang -c -Wno-unused-result -Wsign-compare -Wunreachable-code -DNDEBUG -g -fwrapv -O3 -Wall -std=c99 -Wextra -Wno-unused-result -Wno-unused-parameter -Wno-missing-field-initializers -Wstrict-prototypes -Werror=implicit-function-declaration -I. -I./Include -I/usr/local/opt/readline/include -I/usr/local/opt/readline/include -I/Users/hetal/.pyenv/versions/3.7.0/include -I/usr/local/opt/readline/include -I/usr/local/opt/readline/include -I/Users/hetal/.pyenv/versions/3.7.0/include -DPy_BUILD_CORE -o Objects/obmalloc.o Objects/obmalloc.c
clang -c -Wno-unused-result -Wsign-compare -Wunreachable-code -DNDEBUG -g -fwrapv -O3 -Wall -std=c99 -Wextra -Wno-unused-result -Wno-unused-parameter -Wno-missing-field-initializers -Wstrict-prototypes -Werror=implicit-function-declaration -I. -I./Include -I/usr/local/opt/readline/include -I/usr/local/opt/readline/include -I/Users/hetal/.pyenv/versions/3.7.0/include -I/usr/local/opt/readline/include -I/usr/local/opt/readline/include -I/Users/hetal/.pyenv/versions/3.7.0/include -DPy_BUILD_CORE -o Objects/capsule.o Objects/capsule.c
clang -c -Wno-unused-result -Wsign-compare -Wunreachable-code -DNDEBUG -g -fwrapv -O3 -Wall -std=c99 -Wextra -Wno-unused-result -Wno-unused-parameter -Wno-missing-field-initializers -Wstrict-prototypes -Werror=implicit-function-declaration -I. -I./Include -I/usr/local/opt/readline/include -I/usr/local/opt/readline/include -I/Users/hetal/.pyenv/versions/3.7.0/include -I/usr/local/opt/readline/include -I/usr/local/opt/readline/include -I/Users/hetal/.pyenv/versions/3.7.0/include -DPy_BUILD_CORE -o Objects/rangeobject.o Objects/rangeobject.c
clang -c -Wno-unused-result -Wsign-compare -Wunreachable-code -DNDEBUG -g -fwrapv -O3 -Wall -std=c99 -Wextra -Wno-unused-result -Wno-unused-parameter -Wno-missing-field-initializers -Wstrict-prototypes -Werror=implicit-function-declaration -I. -I./Include -I/usr/local/opt/readline/include -I/usr/local/opt/readline/include -I/Users/hetal/.pyenv/versions/3.7.0/include -I/usr/local/opt/readline/include -I/usr/local/opt/readline/include -I/Users/hetal/.pyenv/versions/3.7.0/include -DPy_BUILD_CORE -o Objects/setobject.o Objects/setobject.c
clang -c -Wno-unused-result -Wsign-compare -Wunreachable-code -DNDEBUG -g -fwrapv -O3 -Wall -std=c99 -Wextra -Wno-unused-result -Wno-unused-parameter -Wno-missing-field-initializers -Wstrict-prototypes -Werror=implicit-function-declaration -I. -I./Include -I/usr/local/opt/readline/include -I/usr/local/opt/readline/include -I/Users/hetal/.pyenv/versions/3.7.0/include -I/usr/local/opt/readline/include -I/usr/local/opt/readline/include -I/Users/hetal/.pyenv/versions/3.7.0/include -DPy_BUILD_CORE -o Objects/sliceobject.o Objects/sliceobject.c
clang -c -Wno-unused-result -Wsign-compare -Wunreachable-code -DNDEBUG -g -fwrapv -O3 -Wall -std=c99 -Wextra -Wno-unused-result -Wno-unused-parameter -Wno-missing-field-initializers -Wstrict-prototypes -Werror=implicit-function-declaration -I. -I./Include -I/usr/local/opt/readline/include -I/usr/local/opt/readline/include -I/Users/hetal/.pyenv/versions/3.7.0/include -I/usr/local/opt/readline/include -I/usr/local/opt/readline/include -I/Users/hetal/.pyenv/versions/3.7.0/include -DPy_BUILD_CORE -o Objects/structseq.o Objects/structseq.c
clang -c -Wno-unused-result -Wsign-compare -Wunreachable-code -DNDEBUG -g -fwrapv -O3 -Wall -std=c99 -Wextra -Wno-unused-result -Wno-unused-parameter -Wno-missing-field-initializers -Wstrict-prototypes -Werror=implicit-function-declaration -I. -I./Include -I/usr/local/opt/readline/include -I/usr/local/opt/readline/include -I/Users/hetal/.pyenv/versions/3.7.0/include -I/usr/local/opt/readline/include -I/usr/local/opt/readline/include -I/Users/hetal/.pyenv/versions/3.7.0/include -DPy_BUILD_CORE -o Objects/tupleobject.o Objects/tupleobject.c
clang -c -Wno-unused-result -Wsign-compare -Wunreachable-code -DNDEBUG -g -fwrapv -O3 -Wall -std=c99 -Wextra -Wno-unused-result -Wno-unused-parameter -Wno-missing-field-initializers -Wstrict-prototypes -Werror=implicit-function-declaration -I. -I./Include -I/usr/local/opt/readline/include -I/usr/local/opt/readline/include -I/Users/hetal/.pyenv/versions/3.7.0/include -I/usr/local/opt/readline/include -I/usr/local/opt/readline/include -I/Users/hetal/.pyenv/versions/3.7.0/include -DPy_BUILD_CORE -o Objects/typeobject.o Objects/typeobject.c
clang -c -Wno-unused-result -Wsign-compare -Wunreachable-code -DNDEBUG -g -fwrapv -O3 -Wall -std=c99 -Wextra -Wno-unused-result -Wno-unused-parameter -Wno-missing-field-initializers -Wstrict-prototypes -Werror=implicit-function-declaration -I. -I./Include -I/usr/local/opt/readline/include -I/usr/local/opt/readline/include -I/Users/hetal/.pyenv/versions/3.7.0/include -I/usr/local/opt/readline/include -I/usr/local/opt/readline/include -I/Users/hetal/.pyenv/versions/3.7.0/include -DPy_BUILD_CORE -o Objects/unicodeobject.o Objects/unicodeobject.c
clang -c -Wno-unused-result -Wsign-compare -Wunreachable-code -DNDEBUG -g -fwrapv -O3 -Wall -std=c99 -Wextra -Wno-unused-result -Wno-unused-parameter -Wno-missing-field-initializers -Wstrict-prototypes -Werror=implicit-function-declaration -I. -I./Include -I/usr/local/opt/readline/include -I/usr/local/opt/readline/include -I/Users/hetal/.pyenv/versions/3.7.0/include -I/usr/local/opt/readline/include -I/usr/local/opt/readline/include -I/Users/hetal/.pyenv/versions/3.7.0/include -DPy_BUILD_CORE -o Objects/unicodectype.o Objects/unicodectype.c
clang -c -Wno-unused-result -Wsign-compare -Wunreachable-code -DNDEBUG -g -fwrapv -O3 -Wall -std=c99 -Wextra -Wno-unused-result -Wno-unused-parameter -Wno-missing-field-initializers -Wstrict-prototypes -Werror=implicit-function-declaration -I. -I./Include -I/usr/local/opt/readline/include -I/usr/local/opt/readline/include -I/Users/hetal/.pyenv/versions/3.7.0/include -I/usr/local/opt/readline/include -I/usr/local/opt/readline/include -I/Users/hetal/.pyenv/versions/3.7.0/include -DPy_BUILD_CORE -o Objects/weakrefobject.o Objects/weakrefobject.c
clang -c -Wno-unused-result -Wsign-compare -Wunreachable-code -DNDEBUG -g -fwrapv -O3 -Wall -std=c99 -Wextra -Wno-unused-result -Wno-unused-parameter -Wno-missing-field-initializers -Wstrict-prototypes -Werror=implicit-function-declaration -I. -I./Include -I/usr/local/opt/readline/include -I/usr/local/opt/readline/include -I/Users/hetal/.pyenv/versions/3.7.0/include -I/usr/local/opt/readline/include -I/usr/local/opt/readline/include -I/Users/hetal/.pyenv/versions/3.7.0/include -DPy_BUILD_CORE -o Python/_warnings.o Python/_warnings.c
clang -c -Wno-unused-result -Wsign-compare -Wunreachable-code -DNDEBUG -g -fwrapv -O3 -Wall -std=c99 -Wextra -Wno-unused-result -Wno-unused-parameter -Wno-missing-field-initializers -Wstrict-prototypes -Werror=implicit-function-declaration -I. -I./Include -I/usr/local/opt/readline/include -I/usr/local/opt/readline/include -I/Users/hetal/.pyenv/versions/3.7.0/include -I/usr/local/opt/readline/include -I/usr/local/opt/readline/include -I/Users/hetal/.pyenv/versions/3.7.0/include -DPy_BUILD_CORE -o Python/Python-ast.o Python/Python-ast.c
clang -c -Wno-unused-result -Wsign-compare -Wunreachable-code -DNDEBUG -g -fwrapv -O3 -Wall -std=c99 -Wextra -Wno-unused-result -Wno-unused-parameter -Wno-missing-field-initializers -Wstrict-prototypes -Werror=implicit-function-declaration -I. -I./Include -I/usr/local/opt/readline/include -I/usr/local/opt/readline/include -I/Users/hetal/.pyenv/versions/3.7.0/include -I/usr/local/opt/readline/include -I/usr/local/opt/readline/include -I/Users/hetal/.pyenv/versions/3.7.0/include -DPy_BUILD_CORE -o Python/asdl.o Python/asdl.c
clang -c -Wno-unused-result -Wsign-compare -Wunreachable-code -DNDEBUG -g -fwrapv -O3 -Wall -std=c99 -Wextra -Wno-unused-result -Wno-unused-parameter -Wno-missing-field-initializers -Wstrict-prototypes -Werror=implicit-function-declaration -I. -I./Include -I/usr/local/opt/readline/include -I/usr/local/opt/readline/include -I/Users/hetal/.pyenv/versions/3.7.0/include -I/usr/local/opt/readline/include -I/usr/local/opt/readline/include -I/Users/hetal/.pyenv/versions/3.7.0/include -DPy_BUILD_CORE -o Python/ast.o Python/ast.c
clang -c -Wno-unused-result -Wsign-compare -Wunreachable-code -DNDEBUG -g -fwrapv -O3 -Wall -std=c99 -Wextra -Wno-unused-result -Wno-unused-parameter -Wno-missing-field-initializers -Wstrict-prototypes -Werror=implicit-function-declaration -I. -I./Include -I/usr/local/opt/readline/include -I/usr/local/opt/readline/include -I/Users/hetal/.pyenv/versions/3.7.0/include -I/usr/local/opt/readline/include -I/usr/local/opt/readline/include -I/Users/hetal/.pyenv/versions/3.7.0/include -DPy_BUILD_CORE -o Python/ast_opt.o Python/ast_opt.c
clang -c -Wno-unused-result -Wsign-compare -Wunreachable-code -DNDEBUG -g -fwrapv -O3 -Wall -std=c99 -Wextra -Wno-unused-result -Wno-unused-parameter -Wno-missing-field-initializers -Wstrict-prototypes -Werror=implicit-function-declaration -I. -I./Include -I/usr/local/opt/readline/include -I/usr/local/opt/readline/include -I/Users/hetal/.pyenv/versions/3.7.0/include -I/usr/local/opt/readline/include -I/usr/local/opt/readline/include -I/Users/hetal/.pyenv/versions/3.7.0/include -DPy_BUILD_CORE -o Python/ast_unparse.o Python/ast_unparse.c
clang -c -Wno-unused-result -Wsign-compare -Wunreachable-code -DNDEBUG -g -fwrapv -O3 -Wall -std=c99 -Wextra -Wno-unused-result -Wno-unused-parameter -Wno-missing-field-initializers -Wstrict-prototypes -Werror=implicit-function-declaration -I. -I./Include -I/usr/local/opt/readline/include -I/usr/local/opt/readline/include -I/Users/hetal/.pyenv/versions/3.7.0/include -I/usr/local/opt/readline/include -I/usr/local/opt/readline/include -I/Users/hetal/.pyenv/versions/3.7.0/include -DPy_BUILD_CORE -o Python/bltinmodule.o Python/bltinmodule.c
clang -c -Wno-unused-result -Wsign-compare -Wunreachable-code -DNDEBUG -g -fwrapv -O3 -Wall -std=c99 -Wextra -Wno-unused-result -Wno-unused-parameter -Wno-missing-field-initializers -Wstrict-prototypes -Werror=implicit-function-declaration -I. -I./Include -I/usr/local/opt/readline/include -I/usr/local/opt/readline/include -I/Users/hetal/.pyenv/versions/3.7.0/include -I/usr/local/opt/readline/include -I/usr/local/opt/readline/include -I/Users/hetal/.pyenv/versions/3.7.0/include -DPy_BUILD_CORE -o Python/ceval.o Python/ceval.c
clang -c -Wno-unused-result -Wsign-compare -Wunreachable-code -DNDEBUG -g -fwrapv -O3 -Wall -std=c99 -Wextra -Wno-unused-result -Wno-unused-parameter -Wno-missing-field-initializers -Wstrict-prototypes -Werror=implicit-function-declaration -I. -I./Include -I/usr/local/opt/readline/include -I/usr/local/opt/readline/include -I/Users/hetal/.pyenv/versions/3.7.0/include -I/usr/local/opt/readline/include -I/usr/local/opt/readline/include -I/Users/hetal/.pyenv/versions/3.7.0/include -DPy_BUILD_CORE -o Python/compile.o Python/compile.c
clang -c -Wno-unused-result -Wsign-compare -Wunreachable-code -DNDEBUG -g -fwrapv -O3 -Wall -std=c99 -Wextra -Wno-unused-result -Wno-unused-parameter -Wno-missing-field-initializers -Wstrict-prototypes -Werror=implicit-function-declaration -I. -I./Include -I/usr/local/opt/readline/include -I/usr/local/opt/readline/include -I/Users/hetal/.pyenv/versions/3.7.0/include -I/usr/local/opt/readline/include -I/usr/local/opt/readline/include -I/Users/hetal/.pyenv/versions/3.7.0/include -DPy_BUILD_CORE -o Python/codecs.o Python/codecs.c
clang -c -Wno-unused-result -Wsign-compare -Wunreachable-code -DNDEBUG -g -fwrapv -O3 -Wall -std=c99 -Wextra -Wno-unused-result -Wno-unused-parameter -Wno-missing-field-initializers -Wstrict-prototypes -Werror=implicit-function-declaration -I. -I./Include -I/usr/local/opt/readline/include -I/usr/local/opt/readline/include -I/Users/hetal/.pyenv/versions/3.7.0/include -I/usr/local/opt/readline/include -I/usr/local/opt/readline/include -I/Users/hetal/.pyenv/versions/3.7.0/include -DPy_BUILD_CORE -o Python/dynamic_annotations.o Python/dynamic_annotations.c
clang -c -Wno-unused-result -Wsign-compare -Wunreachable-code -DNDEBUG -g -fwrapv -O3 -Wall -std=c99 -Wextra -Wno-unused-result -Wno-unused-parameter -Wno-missing-field-initializers -Wstrict-prototypes -Werror=implicit-function-declaration -I. -I./Include -I/usr/local/opt/readline/include -I/usr/local/opt/readline/include -I/Users/hetal/.pyenv/versions/3.7.0/include -I/usr/local/opt/readline/include -I/usr/local/opt/readline/include -I/Users/hetal/.pyenv/versions/3.7.0/include -DPy_BUILD_CORE -o Python/errors.o Python/errors.c
clang -c -Wno-unused-result -Wsign-compare -Wunreachable-code -DNDEBUG -g -fwrapv -O3 -Wall -std=c99 -Wextra -Wno-unused-result -Wno-unused-parameter -Wno-missing-field-initializers -Wstrict-prototypes -Werror=implicit-function-declaration -I. -I./Include -I/usr/local/opt/readline/include -I/usr/local/opt/readline/include -I/Users/hetal/.pyenv/versions/3.7.0/include -I/usr/local/opt/readline/include -I/usr/local/opt/readline/include -I/Users/hetal/.pyenv/versions/3.7.0/include -DPy_BUILD_CORE -o Python/frozenmain.o Python/frozenmain.c
clang -c -Wno-unused-result -Wsign-compare -Wunreachable-code -DNDEBUG -g -fwrapv -O3 -Wall -std=c99 -Wextra -Wno-unused-result -Wno-unused-parameter -Wno-missing-field-initializers -Wstrict-prototypes -Werror=implicit-function-declaration -I. -I./Include -I/usr/local/opt/readline/include -I/usr/local/opt/readline/include -I/Users/hetal/.pyenv/versions/3.7.0/include -I/usr/local/opt/readline/include -I/usr/local/opt/readline/include -I/Users/hetal/.pyenv/versions/3.7.0/include -DPy_BUILD_CORE -o Python/future.o Python/future.c
clang -c -Wno-unused-result -Wsign-compare -Wunreachable-code -DNDEBUG -g -fwrapv -O3 -Wall -std=c99 -Wextra -Wno-unused-result -Wno-unused-parameter -Wno-missing-field-initializers -Wstrict-prototypes -Werror=implicit-function-declaration -I. -I./Include -I/usr/local/opt/readline/include -I/usr/local/opt/readline/include -I/Users/hetal/.pyenv/versions/3.7.0/include -I/usr/local/opt/readline/include -I/usr/local/opt/readline/include -I/Users/hetal/.pyenv/versions/3.7.0/include -DPy_BUILD_CORE -o Python/getargs.o Python/getargs.c
clang -c -Wno-unused-result -Wsign-compare -Wunreachable-code -DNDEBUG -g -fwrapv -O3 -Wall -std=c99 -Wextra -Wno-unused-result -Wno-unused-parameter -Wno-missing-field-initializers -Wstrict-prototypes -Werror=implicit-function-declaration -I. -I./Include -I/usr/local/opt/readline/include -I/usr/local/opt/readline/include -I/Users/hetal/.pyenv/versions/3.7.0/include -I/usr/local/opt/readline/include -I/usr/local/opt/readline/include -I/Users/hetal/.pyenv/versions/3.7.0/include -DPy_BUILD_CORE -o Python/getcompiler.o Python/getcompiler.c
clang -c -Wno-unused-result -Wsign-compare -Wunreachable-code -DNDEBUG -g -fwrapv -O3 -Wall -std=c99 -Wextra -Wno-unused-result -Wno-unused-parameter -Wno-missing-field-initializers -Wstrict-prototypes -Werror=implicit-function-declaration -I. -I./Include -I/usr/local/opt/readline/include -I/usr/local/opt/readline/include -I/Users/hetal/.pyenv/versions/3.7.0/include -I/usr/local/opt/readline/include -I/usr/local/opt/readline/include -I/Users/hetal/.pyenv/versions/3.7.0/include -DPy_BUILD_CORE -o Python/getcopyright.o Python/getcopyright.c
clang -c -Wno-unused-result -Wsign-compare -Wunreachable-code -DNDEBUG -g -fwrapv -O3 -Wall -std=c99 -Wextra -Wno-unused-result -Wno-unused-parameter -Wno-missing-field-initializers -Wstrict-prototypes -Werror=implicit-function-declaration -I. -I./Include -I/usr/local/opt/readline/include -I/usr/local/opt/readline/include -I/Users/hetal/.pyenv/versions/3.7.0/include -I/usr/local/opt/readline/include -I/usr/local/opt/readline/include -I/Users/hetal/.pyenv/versions/3.7.0/include -DPy_BUILD_CORE -DPLATFORM='"darwin"' -o Python/getplatform.o ./Python/getplatform.c
clang -c -Wno-unused-result -Wsign-compare -Wunreachable-code -DNDEBUG -g -fwrapv -O3 -Wall -std=c99 -Wextra -Wno-unused-result -Wno-unused-parameter -Wno-missing-field-initializers -Wstrict-prototypes -Werror=implicit-function-declaration -I. -I./Include -I/usr/local/opt/readline/include -I/usr/local/opt/readline/include -I/Users/hetal/.pyenv/versions/3.7.0/include -I/usr/local/opt/readline/include -I/usr/local/opt/readline/include -I/Users/hetal/.pyenv/versions/3.7.0/include -DPy_BUILD_CORE -o Python/getversion.o Python/getversion.c
clang -c -Wno-unused-result -Wsign-compare -Wunreachable-code -DNDEBUG -g -fwrapv -O3 -Wall -std=c99 -Wextra -Wno-unused-result -Wno-unused-parameter -Wno-missing-field-initializers -Wstrict-prototypes -Werror=implicit-function-declaration -I. -I./Include -I/usr/local/opt/readline/include -I/usr/local/opt/readline/include -I/Users/hetal/.pyenv/versions/3.7.0/include -I/usr/local/opt/readline/include -I/usr/local/opt/readline/include -I/Users/hetal/.pyenv/versions/3.7.0/include -DPy_BUILD_CORE -o Python/graminit.o Python/graminit.c
clang -c -Wno-unused-result -Wsign-compare -Wunreachable-code -DNDEBUG -g -fwrapv -O3 -Wall -std=c99 -Wextra -Wno-unused-result -Wno-unused-parameter -Wno-missing-field-initializers -Wstrict-prototypes -Werror=implicit-function-declaration -I. -I./Include -I/usr/local/opt/readline/include -I/usr/local/opt/readline/include -I/Users/hetal/.pyenv/versions/3.7.0/include -I/usr/local/opt/readline/include -I/usr/local/opt/readline/include -I/Users/hetal/.pyenv/versions/3.7.0/include -DPy_BUILD_CORE -o Python/import.o Python/import.c
clang -c -Wno-unused-result -Wsign-compare -Wunreachable-code -DNDEBUG -g -fwrapv -O3 -Wall -std=c99 -Wextra -Wno-unused-result -Wno-unused-parameter -Wno-missing-field-initializers -Wstrict-prototypes -Werror=implicit-function-declaration -I. -I./Include -I/usr/local/opt/readline/include -I/usr/local/opt/readline/include -I/Users/hetal/.pyenv/versions/3.7.0/include -I/usr/local/opt/readline/include -I/usr/local/opt/readline/include -I/Users/hetal/.pyenv/versions/3.7.0/include -DPy_BUILD_CORE -I. -o Python/importdl.o ./Python/importdl.c
clang -c -Wno-unused-result -Wsign-compare -Wunreachable-code -DNDEBUG -g -fwrapv -O3 -Wall -std=c99 -Wextra -Wno-unused-result -Wno-unused-parameter -Wno-missing-field-initializers -Wstrict-prototypes -Werror=implicit-function-declaration -I. -I./Include -I/usr/local/opt/readline/include -I/usr/local/opt/readline/include -I/Users/hetal/.pyenv/versions/3.7.0/include -I/usr/local/opt/readline/include -I/usr/local/opt/readline/include -I/Users/hetal/.pyenv/versions/3.7.0/include -DPy_BUILD_CORE -o Python/marshal.o Python/marshal.c
clang -c -Wno-unused-result -Wsign-compare -Wunreachable-code -DNDEBUG -g -fwrapv -O3 -Wall -std=c99 -Wextra -Wno-unused-result -Wno-unused-parameter -Wno-missing-field-initializers -Wstrict-prototypes -Werror=implicit-function-declaration -I. -I./Include -I/usr/local/opt/readline/include -I/usr/local/opt/readline/include -I/Users/hetal/.pyenv/versions/3.7.0/include -I/usr/local/opt/readline/include -I/usr/local/opt/readline/include -I/Users/hetal/.pyenv/versions/3.7.0/include -DPy_BUILD_CORE -o Python/modsupport.o Python/modsupport.c
clang -c -Wno-unused-result -Wsign-compare -Wunreachable-code -DNDEBUG -g -fwrapv -O3 -Wall -std=c99 -Wextra -Wno-unused-result -Wno-unused-parameter -Wno-missing-field-initializers -Wstrict-prototypes -Werror=implicit-function-declaration -I. -I./Include -I/usr/local/opt/readline/include -I/usr/local/opt/readline/include -I/Users/hetal/.pyenv/versions/3.7.0/include -I/usr/local/opt/readline/include -I/usr/local/opt/readline/include -I/Users/hetal/.pyenv/versions/3.7.0/include -DPy_BUILD_CORE -o Python/mysnprintf.o Python/mysnprintf.c
clang -c -Wno-unused-result -Wsign-compare -Wunreachable-code -DNDEBUG -g -fwrapv -O3 -Wall -std=c99 -Wextra -Wno-unused-result -Wno-unused-parameter -Wno-missing-field-initializers -Wstrict-prototypes -Werror=implicit-function-declaration -I. -I./Include -I/usr/local/opt/readline/include -I/usr/local/opt/readline/include -I/Users/hetal/.pyenv/versions/3.7.0/include -I/usr/local/opt/readline/include -I/usr/local/opt/readline/include -I/Users/hetal/.pyenv/versions/3.7.0/include -DPy_BUILD_CORE -o Python/mystrtoul.o Python/mystrtoul.c
clang -c -Wno-unused-result -Wsign-compare -Wunreachable-code -DNDEBUG -g -fwrapv -O3 -Wall -std=c99 -Wextra -Wno-unused-result -Wno-unused-parameter -Wno-missing-field-initializers -Wstrict-prototypes -Werror=implicit-function-declaration -I. -I./Include -I/usr/local/opt/readline/include -I/usr/local/opt/readline/include -I/Users/hetal/.pyenv/versions/3.7.0/include -I/usr/local/opt/readline/include -I/usr/local/opt/readline/include -I/Users/hetal/.pyenv/versions/3.7.0/include -DPy_BUILD_CORE -o Python/pathconfig.o Python/pathconfig.c
clang -c -Wno-unused-result -Wsign-compare -Wunreachable-code -DNDEBUG -g -fwrapv -O3 -Wall -std=c99 -Wextra -Wno-unused-result -Wno-unused-parameter -Wno-missing-field-initializers -Wstrict-prototypes -Werror=implicit-function-declaration -I. -I./Include -I/usr/local/opt/readline/include -I/usr/local/opt/readline/include -I/Users/hetal/.pyenv/versions/3.7.0/include -I/usr/local/opt/readline/include -I/usr/local/opt/readline/include -I/Users/hetal/.pyenv/versions/3.7.0/include -DPy_BUILD_CORE -o Python/peephole.o Python/peephole.c
clang -c -Wno-unused-result -Wsign-compare -Wunreachable-code -DNDEBUG -g -fwrapv -O3 -Wall -std=c99 -Wextra -Wno-unused-result -Wno-unused-parameter -Wno-missing-field-initializers -Wstrict-prototypes -Werror=implicit-function-declaration -I. -I./Include -I/usr/local/opt/readline/include -I/usr/local/opt/readline/include -I/Users/hetal/.pyenv/versions/3.7.0/include -I/usr/local/opt/readline/include -I/usr/local/opt/readline/include -I/Users/hetal/.pyenv/versions/3.7.0/include -DPy_BUILD_CORE -o Python/pyarena.o Python/pyarena.c
clang -c -Wno-unused-result -Wsign-compare -Wunreachable-code -DNDEBUG -g -fwrapv -O3 -Wall -std=c99 -Wextra -Wno-unused-result -Wno-unused-parameter -Wno-missing-field-initializers -Wstrict-prototypes -Werror=implicit-function-declaration -I. -I./Include -I/usr/local/opt/readline/include -I/usr/local/opt/readline/include -I/Users/hetal/.pyenv/versions/3.7.0/include -I/usr/local/opt/readline/include -I/usr/local/opt/readline/include -I/Users/hetal/.pyenv/versions/3.7.0/include -DPy_BUILD_CORE -o Python/pyctype.o Python/pyctype.c
clang -c -Wno-unused-result -Wsign-compare -Wunreachable-code -DNDEBUG -g -fwrapv -O3 -Wall -std=c99 -Wextra -Wno-unused-result -Wno-unused-parameter -Wno-missing-field-initializers -Wstrict-prototypes -Werror=implicit-function-declaration -I. -I./Include -I/usr/local/opt/readline/include -I/usr/local/opt/readline/include -I/Users/hetal/.pyenv/versions/3.7.0/include -I/usr/local/opt/readline/include -I/usr/local/opt/readline/include -I/Users/hetal/.pyenv/versions/3.7.0/include -DPy_BUILD_CORE -o Python/pyfpe.o Python/pyfpe.c
clang -c -Wno-unused-result -Wsign-compare -Wunreachable-code -DNDEBUG -g -fwrapv -O3 -Wall -std=c99 -Wextra -Wno-unused-result -Wno-unused-parameter -Wno-missing-field-initializers -Wstrict-prototypes -Werror=implicit-function-declaration -I. -I./Include -I/usr/local/opt/readline/include -I/usr/local/opt/readline/include -I/Users/hetal/.pyenv/versions/3.7.0/include -I/usr/local/opt/readline/include -I/usr/local/opt/readline/include -I/Users/hetal/.pyenv/versions/3.7.0/include -DPy_BUILD_CORE -o Python/pyhash.o Python/pyhash.c
clang -c -Wno-unused-result -Wsign-compare -Wunreachable-code -DNDEBUG -g -fwrapv -O3 -Wall -std=c99 -Wextra -Wno-unused-result -Wno-unused-parameter -Wno-missing-field-initializers -Wstrict-prototypes -Werror=implicit-function-declaration -I. -I./Include -I/usr/local/opt/readline/include -I/usr/local/opt/readline/include -I/Users/hetal/.pyenv/versions/3.7.0/include -I/usr/local/opt/readline/include -I/usr/local/opt/readline/include -I/Users/hetal/.pyenv/versions/3.7.0/include -DPy_BUILD_CORE -o Python/pylifecycle.o Python/pylifecycle.c
clang -c -Wno-unused-result -Wsign-compare -Wunreachable-code -DNDEBUG -g -fwrapv -O3 -Wall -std=c99 -Wextra -Wno-unused-result -Wno-unused-parameter -Wno-missing-field-initializers -Wstrict-prototypes -Werror=implicit-function-declaration -I. -I./Include -I/usr/local/opt/readline/include -I/usr/local/opt/readline/include -I/Users/hetal/.pyenv/versions/3.7.0/include -I/usr/local/opt/readline/include -I/usr/local/opt/readline/include -I/Users/hetal/.pyenv/versions/3.7.0/include -DPy_BUILD_CORE -o Python/pymath.o Python/pymath.c
clang -c -Wno-unused-result -Wsign-compare -Wunreachable-code -DNDEBUG -g -fwrapv -O3 -Wall -std=c99 -Wextra -Wno-unused-result -Wno-unused-parameter -Wno-missing-field-initializers -Wstrict-prototypes -Werror=implicit-function-declaration -I. -I./Include -I/usr/local/opt/readline/include -I/usr/local/opt/readline/include -I/Users/hetal/.pyenv/versions/3.7.0/include -I/usr/local/opt/readline/include -I/usr/local/opt/readline/include -I/Users/hetal/.pyenv/versions/3.7.0/include -DPy_BUILD_CORE -o Python/pystate.o Python/pystate.c
clang -c -Wno-unused-result -Wsign-compare -Wunreachable-code -DNDEBUG -g -fwrapv -O3 -Wall -std=c99 -Wextra -Wno-unused-result -Wno-unused-parameter -Wno-missing-field-initializers -Wstrict-prototypes -Werror=implicit-function-declaration -I. -I./Include -I/usr/local/opt/readline/include -I/usr/local/opt/readline/include -I/Users/hetal/.pyenv/versions/3.7.0/include -I/usr/local/opt/readline/include -I/usr/local/opt/readline/include -I/Users/hetal/.pyenv/versions/3.7.0/include -DPy_BUILD_CORE -o Python/context.o Python/context.c
clang -c -Wno-unused-result -Wsign-compare -Wunreachable-code -DNDEBUG -g -fwrapv -O3 -Wall -std=c99 -Wextra -Wno-unused-result -Wno-unused-parameter -Wno-missing-field-initializers -Wstrict-prototypes -Werror=implicit-function-declaration -I. -I./Include -I/usr/local/opt/readline/include -I/usr/local/opt/readline/include -I/Users/hetal/.pyenv/versions/3.7.0/include -I/usr/local/opt/readline/include -I/usr/local/opt/readline/include -I/Users/hetal/.pyenv/versions/3.7.0/include -DPy_BUILD_CORE -o Python/hamt.o Python/hamt.c
clang -c -Wno-unused-result -Wsign-compare -Wunreachable-code -DNDEBUG -g -fwrapv -O3 -Wall -std=c99 -Wextra -Wno-unused-result -Wno-unused-parameter -Wno-missing-field-initializers -Wstrict-prototypes -Werror=implicit-function-declaration -I. -I./Include -I/usr/local/opt/readline/include -I/usr/local/opt/readline/include -I/Users/hetal/.pyenv/versions/3.7.0/include -I/usr/local/opt/readline/include -I/usr/local/opt/readline/include -I/Users/hetal/.pyenv/versions/3.7.0/include -DPy_BUILD_CORE -o Python/pythonrun.o Python/pythonrun.c
clang -c -Wno-unused-result -Wsign-compare -Wunreachable-code -DNDEBUG -g -fwrapv -O3 -Wall -std=c99 -Wextra -Wno-unused-result -Wno-unused-parameter -Wno-missing-field-initializers -Wstrict-prototypes -Werror=implicit-function-declaration -I. -I./Include -I/usr/local/opt/readline/include -I/usr/local/opt/readline/include -I/Users/hetal/.pyenv/versions/3.7.0/include -I/usr/local/opt/readline/include -I/usr/local/opt/readline/include -I/Users/hetal/.pyenv/versions/3.7.0/include -DPy_BUILD_CORE -o Python/pytime.o Python/pytime.c
clang -c -Wno-unused-result -Wsign-compare -Wunreachable-code -DNDEBUG -g -fwrapv -O3 -Wall -std=c99 -Wextra -Wno-unused-result -Wno-unused-parameter -Wno-missing-field-initializers -Wstrict-prototypes -Werror=implicit-function-declaration -I. -I./Include -I/usr/local/opt/readline/include -I/usr/local/opt/readline/include -I/Users/hetal/.pyenv/versions/3.7.0/include -I/usr/local/opt/readline/include -I/usr/local/opt/readline/include -I/Users/hetal/.pyenv/versions/3.7.0/include -DPy_BUILD_CORE -o Python/bootstrap_hash.o Python/bootstrap_hash.c
clang -c -Wno-unused-result -Wsign-compare -Wunreachable-code -DNDEBUG -g -fwrapv -O3 -Wall -std=c99 -Wextra -Wno-unused-result -Wno-unused-parameter -Wno-missing-field-initializers -Wstrict-prototypes -Werror=implicit-function-declaration -I. -I./Include -I/usr/local/opt/readline/include -I/usr/local/opt/readline/include -I/Users/hetal/.pyenv/versions/3.7.0/include -I/usr/local/opt/readline/include -I/usr/local/opt/readline/include -I/Users/hetal/.pyenv/versions/3.7.0/include -DPy_BUILD_CORE -o Python/structmember.o Python/structmember.c
clang -c -Wno-unused-result -Wsign-compare -Wunreachable-code -DNDEBUG -g -fwrapv -O3 -Wall -std=c99 -Wextra -Wno-unused-result -Wno-unused-parameter -Wno-missing-field-initializers -Wstrict-prototypes -Werror=implicit-function-declaration -I. -I./Include -I/usr/local/opt/readline/include -I/usr/local/opt/readline/include -I/Users/hetal/.pyenv/versions/3.7.0/include -I/usr/local/opt/readline/include -I/usr/local/opt/readline/include -I/Users/hetal/.pyenv/versions/3.7.0/include -DPy_BUILD_CORE -o Python/symtable.o Python/symtable.c
clang -c -Wno-unused-result -Wsign-compare -Wunreachable-code -DNDEBUG -g -fwrapv -O3 -Wall -std=c99 -Wextra -Wno-unused-result -Wno-unused-parameter -Wno-missing-field-initializers -Wstrict-prototypes -Werror=implicit-function-declaration -I. -I./Include -I/usr/local/opt/readline/include -I/usr/local/opt/readline/include -I/Users/hetal/.pyenv/versions/3.7.0/include -I/usr/local/opt/readline/include -I/usr/local/opt/readline/include -I/Users/hetal/.pyenv/versions/3.7.0/include -DPy_BUILD_CORE \
-DABIFLAGS='"m"' \
-DMULTIARCH=\"darwin\" \
-o Python/sysmodule.o ./Python/sysmodule.c
clang -c -Wno-unused-result -Wsign-compare -Wunreachable-code -DNDEBUG -g -fwrapv -O3 -Wall -std=c99 -Wextra -Wno-unused-result -Wno-unused-parameter -Wno-missing-field-initializers -Wstrict-prototypes -Werror=implicit-function-declaration -I. -I./Include -I/usr/local/opt/readline/include -I/usr/local/opt/readline/include -I/Users/hetal/.pyenv/versions/3.7.0/include -I/usr/local/opt/readline/include -I/usr/local/opt/readline/include -I/Users/hetal/.pyenv/versions/3.7.0/include -DPy_BUILD_CORE -o Python/thread.o Python/thread.c
clang -c -Wno-unused-result -Wsign-compare -Wunreachable-code -DNDEBUG -g -fwrapv -O3 -Wall -std=c99 -Wextra -Wno-unused-result -Wno-unused-parameter -Wno-missing-field-initializers -Wstrict-prototypes -Werror=implicit-function-declaration -I. -I./Include -I/usr/local/opt/readline/include -I/usr/local/opt/readline/include -I/Users/hetal/.pyenv/versions/3.7.0/include -I/usr/local/opt/readline/include -I/usr/local/opt/readline/include -I/Users/hetal/.pyenv/versions/3.7.0/include -DPy_BUILD_CORE -o Python/traceback.o Python/traceback.c
clang -c -Wno-unused-result -Wsign-compare -Wunreachable-code -DNDEBUG -g -fwrapv -O3 -Wall -std=c99 -Wextra -Wno-unused-result -Wno-unused-parameter -Wno-missing-field-initializers -Wstrict-prototypes -Werror=implicit-function-declaration -I. -I./Include -I/usr/local/opt/readline/include -I/usr/local/opt/readline/include -I/Users/hetal/.pyenv/versions/3.7.0/include -I/usr/local/opt/readline/include -I/usr/local/opt/readline/include -I/Users/hetal/.pyenv/versions/3.7.0/include -DPy_BUILD_CORE -o Python/getopt.o Python/getopt.c
clang -c -Wno-unused-result -Wsign-compare -Wunreachable-code -DNDEBUG -g -fwrapv -O3 -Wall -std=c99 -Wextra -Wno-unused-result -Wno-unused-parameter -Wno-missing-field-initializers -Wstrict-prototypes -Werror=implicit-function-declaration -I. -I./Include -I/usr/local/opt/readline/include -I/usr/local/opt/readline/include -I/Users/hetal/.pyenv/versions/3.7.0/include -I/usr/local/opt/readline/include -I/usr/local/opt/readline/include -I/Users/hetal/.pyenv/versions/3.7.0/include -DPy_BUILD_CORE -o Python/pystrcmp.o Python/pystrcmp.c
clang -c -Wno-unused-result -Wsign-compare -Wunreachable-code -DNDEBUG -g -fwrapv -O3 -Wall -std=c99 -Wextra -Wno-unused-result -Wno-unused-parameter -Wno-missing-field-initializers -Wstrict-prototypes -Werror=implicit-function-declaration -I. -I./Include -I/usr/local/opt/readline/include -I/usr/local/opt/readline/include -I/Users/hetal/.pyenv/versions/3.7.0/include -I/usr/local/opt/readline/include -I/usr/local/opt/readline/include -I/Users/hetal/.pyenv/versions/3.7.0/include -DPy_BUILD_CORE -o Python/pystrtod.o Python/pystrtod.c
clang -c -Wno-unused-result -Wsign-compare -Wunreachable-code -DNDEBUG -g -fwrapv -O3 -Wall -std=c99 -Wextra -Wno-unused-result -Wno-unused-parameter -Wno-missing-field-initializers -Wstrict-prototypes -Werror=implicit-function-declaration -I. -I./Include -I/usr/local/opt/readline/include -I/usr/local/opt/readline/include -I/Users/hetal/.pyenv/versions/3.7.0/include -I/usr/local/opt/readline/include -I/usr/local/opt/readline/include -I/Users/hetal/.pyenv/versions/3.7.0/include -DPy_BUILD_CORE -o Python/pystrhex.o Python/pystrhex.c
clang -c -Wno-unused-result -Wsign-compare -Wunreachable-code -DNDEBUG -g -fwrapv -O3 -Wall -std=c99 -Wextra -Wno-unused-result -Wno-unused-parameter -Wno-missing-field-initializers -Wstrict-prototypes -Werror=implicit-function-declaration -I. -I./Include -I/usr/local/opt/readline/include -I/usr/local/opt/readline/include -I/Users/hetal/.pyenv/versions/3.7.0/include -I/usr/local/opt/readline/include -I/usr/local/opt/readline/include -I/Users/hetal/.pyenv/versions/3.7.0/include -DPy_BUILD_CORE -fno-strict-aliasing -o Python/dtoa.o Python/dtoa.c
clang -c -Wno-unused-result -Wsign-compare -Wunreachable-code -DNDEBUG -g -fwrapv -O3 -Wall -std=c99 -Wextra -Wno-unused-result -Wno-unused-parameter -Wno-missing-field-initializers -Wstrict-prototypes -Werror=implicit-function-declaration -I. -I./Include -I/usr/local/opt/readline/include -I/usr/local/opt/readline/include -I/Users/hetal/.pyenv/versions/3.7.0/include -I/usr/local/opt/readline/include -I/usr/local/opt/readline/include -I/Users/hetal/.pyenv/versions/3.7.0/include -DPy_BUILD_CORE -o Python/formatter_unicode.o Python/formatter_unicode.c
clang -c -Wno-unused-result -Wsign-compare -Wunreachable-code -DNDEBUG -g -fwrapv -O3 -Wall -std=c99 -Wextra -Wno-unused-result -Wno-unused-parameter -Wno-missing-field-initializers -Wstrict-prototypes -Werror=implicit-function-declaration -I. -I./Include -I/usr/local/opt/readline/include -I/usr/local/opt/readline/include -I/Users/hetal/.pyenv/versions/3.7.0/include -I/usr/local/opt/readline/include -I/usr/local/opt/readline/include -I/Users/hetal/.pyenv/versions/3.7.0/include -DPy_BUILD_CORE -o Python/fileutils.o Python/fileutils.c
clang -c -Wno-unused-result -Wsign-compare -Wunreachable-code -DNDEBUG -g -fwrapv -O3 -Wall -std=c99 -Wextra -Wno-unused-result -Wno-unused-parameter -Wno-missing-field-initializers -Wstrict-prototypes -Werror=implicit-function-declaration -I. -I./Include -I/usr/local/opt/readline/include -I/usr/local/opt/readline/include -I/Users/hetal/.pyenv/versions/3.7.0/include -I/usr/local/opt/readline/include -I/usr/local/opt/readline/include -I/Users/hetal/.pyenv/versions/3.7.0/include -DPy_BUILD_CORE \
-DSOABI='"cpython-37m-darwin"' \
-o Python/dynload_shlib.o ./Python/dynload_shlib.c
clang -c -Wno-unused-result -Wsign-compare -Wunreachable-code -DNDEBUG -g -fwrapv -O3 -Wall -std=c99 -Wextra -Wno-unused-result -Wno-unused-parameter -Wno-missing-field-initializers -Wstrict-prototypes -Werror=implicit-function-declaration -I. -I./Include -I/usr/local/opt/readline/include -I/usr/local/opt/readline/include -I/Users/hetal/.pyenv/versions/3.7.0/include -I/usr/local/opt/readline/include -I/usr/local/opt/readline/include -I/Users/hetal/.pyenv/versions/3.7.0/include -DPy_BUILD_CORE -o Modules/config.o Modules/config.c
clang -c -Wno-unused-result -Wsign-compare -Wunreachable-code -DNDEBUG -g -fwrapv -O3 -Wall -std=c99 -Wextra -Wno-unused-result -Wno-unused-parameter -Wno-missing-field-initializers -Wstrict-prototypes -Werror=implicit-function-declaration -I. -I./Include -I/usr/local/opt/readline/include -I/usr/local/opt/readline/include -I/Users/hetal/.pyenv/versions/3.7.0/include -I/usr/local/opt/readline/include -I/usr/local/opt/readline/include -I/Users/hetal/.pyenv/versions/3.7.0/include -DPy_BUILD_CORE -DPYTHONPATH='""' \
-DPREFIX='"/Users/hetal/.pyenv/versions/3.7.0"' \
-DEXEC_PREFIX='"/Users/hetal/.pyenv/versions/3.7.0"' \
-DVERSION='"3.7"' \
-DVPATH='""' \
-o Modules/getpath.o ./Modules/getpath.c
clang -c -Wno-unused-result -Wsign-compare -Wunreachable-code -DNDEBUG -g -fwrapv -O3 -Wall -std=c99 -Wextra -Wno-unused-result -Wno-unused-parameter -Wno-missing-field-initializers -Wstrict-prototypes -Werror=implicit-function-declaration -I. -I./Include -I/usr/local/opt/readline/include -I/usr/local/opt/readline/include -I/Users/hetal/.pyenv/versions/3.7.0/include -I/usr/local/opt/readline/include -I/usr/local/opt/readline/include -I/Users/hetal/.pyenv/versions/3.7.0/include -DPy_BUILD_CORE -o Modules/main.o Modules/main.c
clang -c -Wno-unused-result -Wsign-compare -Wunreachable-code -DNDEBUG -g -fwrapv -O3 -Wall -std=c99 -Wextra -Wno-unused-result -Wno-unused-parameter -Wno-missing-field-initializers -Wstrict-prototypes -Werror=implicit-function-declaration -I. -I./Include -I/usr/local/opt/readline/include -I/usr/local/opt/readline/include -I/Users/hetal/.pyenv/versions/3.7.0/include -I/usr/local/opt/readline/include -I/usr/local/opt/readline/include -I/Users/hetal/.pyenv/versions/3.7.0/include -DPy_BUILD_CORE -o Modules/gcmodule.o Modules/gcmodule.c
clang -Wno-unused-result -Wsign-compare -Wunreachable-code -DNDEBUG -g -fwrapv -O3 -Wall -std=c99 -Wextra -Wno-unused-result -Wno-unused-parameter -Wno-missing-field-initializers -Wstrict-prototypes -Werror=implicit-function-declaration -I. -I./Include -I/usr/local/opt/readline/include -I/usr/local/opt/readline/include -I/Users/hetal/.pyenv/versions/3.7.0/include -I/usr/local/opt/readline/include -I/usr/local/opt/readline/include -I/Users/hetal/.pyenv/versions/3.7.0/include -DPy_BUILD_CORE -c ./Modules/posixmodule.c -o Modules/posixmodule.o
./Modules/posixmodule.c:5924:9: error: implicit declaration of function 'openpty' is invalid in C99 [-Werror,-Wimplicit-function-declaration]
if (openpty(&master_fd, &slave_fd, NULL, NULL, NULL) != 0)
^
./Modules/posixmodule.c:5924:9: note: did you mean 'openat'?
/usr/include/sys/fcntl.h:516:9: note: 'openat' declared here
int openat(int, const char *, int, ...) __DARWIN_NOCANCEL(openat) __OSX_AVAILABLE_STARTING(__MAC_10_10, __IPHONE_8_0);
^
./Modules/posixmodule.c:5924:9: warning: this function declaration is not a prototype [-Wstrict-prototypes]
if (openpty(&master_fd, &slave_fd, NULL, NULL, NULL) != 0)
^
./Modules/posixmodule.c:6018:11: error: implicit declaration of function 'forkpty' is invalid in C99 [-Werror,-Wimplicit-function-declaration]
pid = forkpty(&master_fd, NULL, NULL, NULL);
^
./Modules/posixmodule.c:6018:11: warning: this function declaration is not a prototype [-Wstrict-prototypes]
clang -Wno-unused-result -Wsign-compare -Wunreachable-code -DNDEBUG -g -fwrapv -O3 -Wall -std=c99 -Wextra -Wno-unused-result -Wno-unused-parameter -Wno-missing-field-initializers -Wstrict-prototypes -Werror=implicit-function-declaration -I. -I./Include -I/usr/local/opt/readline/include -I/usr/local/opt/readline/include -I/Users/hetal/.pyenv/versions/3.7.0/include -I/usr/local/opt/readline/include -I/usr/local/opt/readline/include -I/Users/hetal/.pyenv/versions/3.7.0/include -c ./Modules/errnomodule.c -o Modules/errnomodule.o
2 warnings and 2 errors generated.
make: *** [Modules/posixmodule.o] Error 1
make: *** Waiting for unfinished jobs....
Sign up for free to join this conversation on GitHub. Already have an account? Sign in to comment
You can’t perform that action at this time.