Skip to content

Instantly share code, notes, and snippets.

@keybounce
Created Dec 5, 2020
Embed
What would you like to do?
compilation failure for libomp, mac 10.9.5.
version:1
:debug:sysinfo OS X 10.9 (darwin/13.4.0) arch i386
:debug:sysinfo MacPorts 2.6.4
:debug:sysinfo Xcode 6.2
:debug:sysinfo SDK 10.9
:debug:sysinfo MACOSX_DEPLOYMENT_TARGET: 10.9
:debug:clean Attempting ln -sf /opt/local/var/macports/build/_opt_local_var_macports_sources_rsync.macports.org_release_tarballs_ports_lang_libomp/libomp/work /opt/local/var/macports/sources/rsync.macports.org/release/tarballs/ports/lang/libomp/work
:debug:clean dropping privileges: euid changed to 503, egid changed to 501.
:debug:main Executing org.macports.main (libomp)
:debug:main Privilege de-escalation not attempted as not running as root.
:debug:archivefetch archivefetch phase started at Fri Dec 4 19:39:06 PST 2020
:msg:archivefetch ---> Fetching archive for libomp
:debug:archivefetch Executing org.macports.archivefetch (libomp)
:debug:archivefetch euid/egid changed to: 0/0
:debug:archivefetch chowned /opt/local/var/macports/incoming to macports
:debug:archivefetch euid/egid changed to: 503/501
:info:archivefetch ---> libomp-11.0.0_0+universal.darwin_13.i386-x86_64.tbz2 doesn't seem to exist in /opt/local/var/macports/incoming/verified
:msg:archivefetch ---> Attempting to fetch libomp-11.0.0_0+universal.darwin_13.i386-x86_64.tbz2 from https://ywg.ca.packages.macports.org/mirror/macports/packages/libomp
:debug:archivefetch Fetching archive failed: The requested URL returned error: 404 Not Found
:msg:archivefetch ---> Attempting to fetch libomp-11.0.0_0+universal.darwin_13.i386-x86_64.tbz2 from https://kmq.jp.packages.macports.org/libomp
:debug:archivefetch Fetching archive failed: The requested URL returned error: 404 Not Found
:msg:archivefetch ---> Attempting to fetch libomp-11.0.0_0+universal.darwin_13.i386-x86_64.tbz2 from https://mse.uk.packages.macports.org/libomp
:debug:archivefetch Fetching archive failed: Unknown SSL protocol error in connection to mse.uk.packages.macports.org:-9824
:debug:archivefetch Privilege de-escalation not attempted as not running as root.
:debug:fetch fetch phase started at Fri Dec 4 19:39:08 PST 2020
:notice:fetch ---> Fetching distfiles for libomp
:debug:fetch Executing org.macports.fetch (libomp)
:debug:fetch Privilege de-escalation not attempted as not running as root.
:debug:checksum checksum phase started at Fri Dec 4 19:39:08 PST 2020
:notice:checksum ---> Verifying checksums for libomp
:debug:checksum Executing org.macports.checksum (libomp)
:info:checksum ---> Checksumming openmp-11.0.0.src.tar.xz
:debug:checksum Calculated (rmd160) is 24d25065c3ccff430995a903d62843f0bcd63670
:debug:checksum Correct (rmd160) checksum for openmp-11.0.0.src.tar.xz
:debug:checksum Calculated (sha256) is 2d704df8ca67b77d6d94ebf79621b0f773d5648963dd19e0f78efef4404b684c
:debug:checksum Correct (sha256) checksum for openmp-11.0.0.src.tar.xz
:debug:checksum Calculated (size) is 975108
:debug:checksum Correct (size) checksum for openmp-11.0.0.src.tar.xz
:debug:checksum Privilege de-escalation not attempted as not running as root.
:debug:extract extract phase started at Fri Dec 4 19:39:08 PST 2020
:notice:extract ---> Extracting libomp
:debug:extract setting option extract.cmd to /opt/local/bin/xz
:debug:extract Executing org.macports.extract (libomp)
:info:extract ---> Extracting openmp-11.0.0.src.tar.xz
:debug:extract setting option extract.args to '/opt/local/var/macports/distfiles/openmp-release/openmp-11.0.0.src.tar.xz'
:debug:extract Environment:
:debug:extract CC_PRINT_OPTIONS='YES'
:debug:extract CC_PRINT_OPTIONS_FILE='/opt/local/var/macports/build/_opt_local_var_macports_sources_rsync.macports.org_release_tarballs_ports_lang_libomp/libomp/work/.CC_PRINT_OPTIONS'
:debug:extract CPATH='/opt/local/include'
:debug:extract DEVELOPER_DIR='/Library/Developer/CommandLineTools'
:debug:extract LIBRARY_PATH='/opt/local/lib'
:debug:extract MACOSX_DEPLOYMENT_TARGET='10.9'
:info:extract Executing: cd "/opt/local/var/macports/build/_opt_local_var_macports_sources_rsync.macports.org_release_tarballs_ports_lang_libomp/libomp/work" && /opt/local/bin/xz -dc '/opt/local/var/macports/distfiles/openmp-release/openmp-11.0.0.src.tar.xz' | /usr/bin/tar -xf -
:debug:extract system: cd "/opt/local/var/macports/build/_opt_local_var_macports_sources_rsync.macports.org_release_tarballs_ports_lang_libomp/libomp/work" && /opt/local/bin/xz -dc '/opt/local/var/macports/distfiles/openmp-release/openmp-11.0.0.src.tar.xz' | /usr/bin/tar -xf -
:debug:extract euid/egid changed to: 0/0
:debug:extract chowned /opt/local/var/macports/build/_opt_local_var_macports_sources_rsync.macports.org_release_tarballs_ports_lang_libomp/libomp/work to macports
:debug:extract euid/egid changed to: 503/501
:debug:extract Executing proc-post-org.macports.extract-extract-0
:info:extract ---> Patching check-depends.pl: /bulk.*compatibility/s/s+/s+.*/
:debug:extract Executing reinplace: /usr/bin/sed /bulk.*compatibility/s/s+/s+.*/ </opt/local/var/macports/build/_opt_local_var_macports_sources_rsync.macports.org_release_tarballs_ports_lang_libomp/libomp/work/openmp-11.0.0.src/runtime/tools/check-depends.pl >@file15
:debug:extract euid/egid changed to: 0/0
:debug:extract chowned /opt/local/var/macports/build/_opt_local_var_macports_sources_rsync.macports.org_release_tarballs_ports_lang_libomp/libomp/work/openmp-11.0.0.src/runtime/tools/check-depends.pl to macports
:debug:extract euid/egid changed to: 503/501
:debug:extract euid/egid changed to: 0/0
:debug:extract setting attributes on /opt/local/var/macports/build/_opt_local_var_macports_sources_rsync.macports.org_release_tarballs_ports_lang_libomp/libomp/work/openmp-11.0.0.src/runtime/tools/check-depends.pl
:debug:extract euid/egid changed to: 503/501
:debug:extract Privilege de-escalation not attempted as not running as root.
:debug:patch patch phase started at Fri Dec 4 19:39:08 PST 2020
:debug:patch Executing org.macports.patch (libomp)
:notice:patch ---> Applying patches to libomp
:info:patch ---> Applying patch-libomp-use-gettid-on-Leopard.diff
:debug:patch Environment:
:debug:patch CC_PRINT_OPTIONS='YES'
:debug:patch CC_PRINT_OPTIONS_FILE='/opt/local/var/macports/build/_opt_local_var_macports_sources_rsync.macports.org_release_tarballs_ports_lang_libomp/libomp/work/.CC_PRINT_OPTIONS'
:debug:patch CPATH='/opt/local/include'
:debug:patch DEVELOPER_DIR='/Library/Developer/CommandLineTools'
:debug:patch LIBRARY_PATH='/opt/local/lib'
:debug:patch MACOSX_DEPLOYMENT_TARGET='10.9'
:info:patch Executing: cd "/opt/local/var/macports/build/_opt_local_var_macports_sources_rsync.macports.org_release_tarballs_ports_lang_libomp/libomp/work/openmp-11.0.0.src" && /usr/bin/patch -p0 < '/opt/local/var/macports/sources/rsync.macports.org/release/tarballs/ports/lang/libomp/files/patch-libomp-use-gettid-on-Leopard.diff'
:debug:patch system: cd "/opt/local/var/macports/build/_opt_local_var_macports_sources_rsync.macports.org_release_tarballs_ports_lang_libomp/libomp/work/openmp-11.0.0.src" && /usr/bin/patch -p0 < '/opt/local/var/macports/sources/rsync.macports.org/release/tarballs/ports/lang/libomp/files/patch-libomp-use-gettid-on-Leopard.diff'
:info:patch patching file runtime/src/kmp_wrapper_getpid.h
:info:patch ---> Applying reviews.llvm.org_D88252.diff
:debug:patch Environment:
:debug:patch CC_PRINT_OPTIONS='YES'
:debug:patch CC_PRINT_OPTIONS_FILE='/opt/local/var/macports/build/_opt_local_var_macports_sources_rsync.macports.org_release_tarballs_ports_lang_libomp/libomp/work/.CC_PRINT_OPTIONS'
:debug:patch CPATH='/opt/local/include'
:debug:patch DEVELOPER_DIR='/Library/Developer/CommandLineTools'
:debug:patch LIBRARY_PATH='/opt/local/lib'
:debug:patch MACOSX_DEPLOYMENT_TARGET='10.9'
:info:patch Executing: cd "/opt/local/var/macports/build/_opt_local_var_macports_sources_rsync.macports.org_release_tarballs_ports_lang_libomp/libomp/work/openmp-11.0.0.src" && /usr/bin/patch -p0 < '/opt/local/var/macports/sources/rsync.macports.org/release/tarballs/ports/lang/libomp/files/reviews.llvm.org_D88252.diff'
:debug:patch system: cd "/opt/local/var/macports/build/_opt_local_var_macports_sources_rsync.macports.org_release_tarballs_ports_lang_libomp/libomp/work/openmp-11.0.0.src" && /usr/bin/patch -p0 < '/opt/local/var/macports/sources/rsync.macports.org/release/tarballs/ports/lang/libomp/files/reviews.llvm.org_D88252.diff'
:info:patch patching file runtime/src/z_Linux_asm.S
:debug:patch Privilege de-escalation not attempted as not running as root.
:debug:configure configure phase started at Fri Dec 4 19:39:08 PST 2020
:notice:configure ---> Configuring libomp
:debug:configure Preferred compilers: clang macports-clang-9.0 macports-clang-8.0 macports-clang-7.0 macports-clang-6.0 macports-clang-5.0 macports-clang-3.7 macports-clang-3.4
:debug:configure Using compiler 'Xcode Clang'
:debug:configure Executing proc-pre-org.macports.configure-configure-0
:debug:configure Executing proc-pre-org.macports.configure-configure-1
:debug:configure Executing proc-pre-org.macports.configure-configure-2
:debug:configure Executing org.macports.configure (libomp)
:info:configure ---> Configuring libomp for architecture x86_64
:debug:configure setting option configure.dir to /opt/local/var/macports/build/_opt_local_var_macports_sources_rsync.macports.org_release_tarballs_ports_lang_libomp/libomp/work/build-x86_64
:debug:configure setting option autoreconf.dir to /opt/local/var/macports/build/_opt_local_var_macports_sources_rsync.macports.org_release_tarballs_ports_lang_libomp/libomp/work/openmp-11.0.0.src-x86_64
:debug:configure setting option autoconf.dir to /opt/local/var/macports/build/_opt_local_var_macports_sources_rsync.macports.org_release_tarballs_ports_lang_libomp/libomp/work/openmp-11.0.0.src-x86_64
:debug:configure Environment:
:debug:configure CC='/usr/bin/clang'
:debug:configure CC_PRINT_OPTIONS='YES'
:debug:configure CC_PRINT_OPTIONS_FILE='/opt/local/var/macports/build/_opt_local_var_macports_sources_rsync.macports.org_release_tarballs_ports_lang_libomp/libomp/work/.CC_PRINT_OPTIONS'
:debug:configure CFLAGS='-pipe -Os'
:debug:configure CPATH='/opt/local/include'
:debug:configure CPPFLAGS='-I/opt/local/include'
:debug:configure CXX='/usr/bin/clang++'
:debug:configure CXXFLAGS='-pipe -Os -stdlib=libc++'
:debug:configure DEVELOPER_DIR='/Library/Developer/CommandLineTools'
:debug:configure F90FLAGS='-pipe -Os'
:debug:configure FCFLAGS='-pipe -Os'
:debug:configure FFLAGS='-pipe -Os'
:debug:configure INSTALL='/usr/bin/install -c'
:debug:configure LDFLAGS='-L/opt/local/lib -Wl,-headerpad_max_install_names'
:debug:configure LIBRARY_PATH='/opt/local/lib'
:debug:configure MACOSX_DEPLOYMENT_TARGET='10.9'
:debug:configure OBJC='/usr/bin/clang'
:debug:configure OBJCFLAGS='-pipe -Os'
:debug:configure OBJCXX='/usr/bin/clang++'
:debug:configure OBJCXXFLAGS='-pipe -Os -stdlib=libc++'
:info:configure Executing: cd "/opt/local/var/macports/build/_opt_local_var_macports_sources_rsync.macports.org_release_tarballs_ports_lang_libomp/libomp/work/build-x86_64" && /opt/local/bin/cmake -DCMAKE_INSTALL_PREFIX=/opt/local/tmp -DCMAKE_BUILD_TYPE=Release -DCMAKE_BUILD_WITH_INSTALL_RPATH=ON -DCMAKE_C_COMPILER="$CC" -DCMAKE_COLOR_MAKEFILE=ON -DCMAKE_CXX_COMPILER="$CXX" -DCMAKE_FIND_FRAMEWORK=LAST -DCMAKE_MAKE_PROGRAM=/usr/bin/make -DCMAKE_MODULE_PATH=/opt/local/share/cmake/Modules -DCMAKE_SYSTEM_PREFIX_PATH="/opt/local;/opt/local;/usr" -DCMAKE_VERBOSE_MAKEFILE=ON -DCMAKE_POLICY_DEFAULT_CMP0025=NEW -Wno-dev -DCMAKE_INSTALL_RPATH=/opt/local/lib/libomp -DCMAKE_INSTALL_NAME_DIR=/opt/local/lib/libomp -DLIBOMP_OMPT_SUPPORT=FALSE -DCMAKE_C_FLAGS_RELEASE="-DNDEBUG" -DCMAKE_CXX_FLAGS_RELEASE="-DNDEBUG" -DCMAKE_OSX_DEPLOYMENT_TARGET="10.9" -DCMAKE_OSX_SYSROOT="/" -DCMAKE_OSX_ARCHITECTURES=x86_64 /opt/local/var/macports/build/_opt_local_var_macports_sources_rsync.macports.org_release_tarballs_ports_lang_libomp/libomp/work/openmp-11.0.0.src
:debug:configure system: cd "/opt/local/var/macports/build/_opt_local_var_macports_sources_rsync.macports.org_release_tarballs_ports_lang_libomp/libomp/work/build-x86_64" && /opt/local/bin/cmake -DCMAKE_INSTALL_PREFIX=/opt/local/tmp -DCMAKE_BUILD_TYPE=Release -DCMAKE_BUILD_WITH_INSTALL_RPATH=ON -DCMAKE_C_COMPILER="$CC" -DCMAKE_COLOR_MAKEFILE=ON -DCMAKE_CXX_COMPILER="$CXX" -DCMAKE_FIND_FRAMEWORK=LAST -DCMAKE_MAKE_PROGRAM=/usr/bin/make -DCMAKE_MODULE_PATH=/opt/local/share/cmake/Modules -DCMAKE_SYSTEM_PREFIX_PATH="/opt/local;/opt/local;/usr" -DCMAKE_VERBOSE_MAKEFILE=ON -DCMAKE_POLICY_DEFAULT_CMP0025=NEW -Wno-dev -DCMAKE_INSTALL_RPATH=/opt/local/lib/libomp -DCMAKE_INSTALL_NAME_DIR=/opt/local/lib/libomp -DLIBOMP_OMPT_SUPPORT=FALSE -DCMAKE_C_FLAGS_RELEASE="-DNDEBUG" -DCMAKE_CXX_FLAGS_RELEASE="-DNDEBUG" -DCMAKE_OSX_DEPLOYMENT_TARGET="10.9" -DCMAKE_OSX_SYSROOT="/" -DCMAKE_OSX_ARCHITECTURES=x86_64 /opt/local/var/macports/build/_opt_local_var_macports_sources_rsync.macports.org_release_tarballs_ports_lang_libomp/libomp/work/openmp-11.0.0.src
:info:configure -- The C compiler identification is AppleClang 6.0.0.6000057
:info:configure -- The CXX compiler identification is AppleClang 6.0.0.6000057
:info:configure -- Detecting C compiler ABI info
:info:configure -- Detecting C compiler ABI info - done
:info:configure -- Check for working C compiler: /usr/bin/clang - skipped
:info:configure -- Detecting C compile features
:info:configure -- Detecting C compile features - done
:info:configure -- Detecting CXX compiler ABI info
:info:configure -- Detecting CXX compiler ABI info - done
:info:configure -- Check for working CXX compiler: /usr/bin/clang++ - skipped
:info:configure -- Detecting CXX compile features
:info:configure -- Detecting CXX compile features - done
:info:configure -- Performing Test OPENMP_HAVE_WALL_FLAG
:info:configure -- Performing Test OPENMP_HAVE_WALL_FLAG - Success
:info:configure -- Performing Test OPENMP_HAVE_WERROR_FLAG
:info:configure -- Performing Test OPENMP_HAVE_WERROR_FLAG - Success
:info:configure -- Performing Test OPENMP_HAVE_WCAST_QUAL_FLAG
:info:configure -- Performing Test OPENMP_HAVE_WCAST_QUAL_FLAG - Success
:info:configure -- Performing Test OPENMP_HAVE_WFORMAT_PEDANTIC_FLAG
:info:configure -- Performing Test OPENMP_HAVE_WFORMAT_PEDANTIC_FLAG - Failed
:info:configure -- Performing Test OPENMP_HAVE_WIMPLICIT_FALLTHROUGH_FLAG
:info:configure -- Performing Test OPENMP_HAVE_WIMPLICIT_FALLTHROUGH_FLAG - Success
:info:configure -- Performing Test OPENMP_HAVE_WSIGN_COMPARE_FLAG
:info:configure -- Performing Test OPENMP_HAVE_WSIGN_COMPARE_FLAG - Success
:info:configure -- Performing Test OPENMP_HAVE_WNO_EXTRA_FLAG
:info:configure -- Performing Test OPENMP_HAVE_WNO_EXTRA_FLAG - Success
:info:configure -- Performing Test OPENMP_HAVE_WNO_PEDANTIC_FLAG
:info:configure -- Performing Test OPENMP_HAVE_WNO_PEDANTIC_FLAG - Success
:info:configure -- Performing Test OPENMP_HAVE_WNO_MAYBE_UNINITIALIZED_FLAG
:info:configure -- Performing Test OPENMP_HAVE_WNO_MAYBE_UNINITIALIZED_FLAG - Failed
:info:configure -- Performing Test OPENMP_HAVE_STD_GNUPP14_FLAG
:info:configure -- Performing Test OPENMP_HAVE_STD_GNUPP14_FLAG - Failed
:info:configure -- Performing Test OPENMP_HAVE_STD_CPP14_FLAG
:info:configure -- Performing Test OPENMP_HAVE_STD_CPP14_FLAG - Failed
:info:configure -- Found PythonInterp: /opt/local/bin/python (found version "3.6.12")
:info:configure -- Cannot find llvm-lit.
:info:configure -- Please put llvm-lit in your PATH, set OPENMP_LLVM_LIT_EXECUTABLE to its full path, or point OPENMP_LLVM_TOOLS_DIR to its directory.
:info:configure CMake Warning at cmake/OpenMPTesting.cmake:22 (message):
:info:configure The check targets will not be available!
:info:configure Call Stack (most recent call first):
:info:configure cmake/OpenMPTesting.cmake:51 (find_standalone_test_dependencies)
:info:configure CMakeLists.txt:49 (include)
:info:configure -- Performing Test LIBOMP_HAVE_FNO_EXCEPTIONS_FLAG
:info:configure -- Performing Test LIBOMP_HAVE_FNO_EXCEPTIONS_FLAG - Success
:info:configure -- Performing Test LIBOMP_HAVE_FNO_RTTI_FLAG
:info:configure -- Performing Test LIBOMP_HAVE_FNO_RTTI_FLAG - Success
:info:configure -- Performing Test LIBOMP_HAVE_WNO_CLASS_MEMACCESS_FLAG
:info:configure -- Performing Test LIBOMP_HAVE_WNO_CLASS_MEMACCESS_FLAG - Failed
:info:configure -- Performing Test LIBOMP_HAVE_WNO_COVERED_SWITCH_DEFAULT_FLAG
:info:configure -- Performing Test LIBOMP_HAVE_WNO_COVERED_SWITCH_DEFAULT_FLAG - Success
:info:configure -- Performing Test LIBOMP_HAVE_WNO_FRAME_ADDRESS_FLAG
:info:configure -- Performing Test LIBOMP_HAVE_WNO_FRAME_ADDRESS_FLAG - Failed
:info:configure -- Performing Test LIBOMP_HAVE_WNO_STRICT_ALIASING_FLAG
:info:configure -- Performing Test LIBOMP_HAVE_WNO_STRICT_ALIASING_FLAG - Success
:info:configure -- Performing Test LIBOMP_HAVE_WSTRINGOP_OVERFLOW_FLAG
:info:configure -- Performing Test LIBOMP_HAVE_WSTRINGOP_OVERFLOW_FLAG - Failed
:info:configure -- Performing Test LIBOMP_HAVE_WNO_STRINGOP_TRUNCATION_FLAG
:info:configure -- Performing Test LIBOMP_HAVE_WNO_STRINGOP_TRUNCATION_FLAG - Failed
:info:configure -- Performing Test LIBOMP_HAVE_WNO_SWITCH_FLAG
:info:configure -- Performing Test LIBOMP_HAVE_WNO_SWITCH_FLAG - Success
:info:configure -- Performing Test LIBOMP_HAVE_WNO_UNINITIALIZED_FLAG
:info:configure -- Performing Test LIBOMP_HAVE_WNO_UNINITIALIZED_FLAG - Success
:info:configure -- Performing Test LIBOMP_HAVE_WNO_UNUSED_BUT_SET_VARIABLE_FLAG
:info:configure -- Performing Test LIBOMP_HAVE_WNO_UNUSED_BUT_SET_VARIABLE_FLAG - Failed
:info:configure -- Performing Test LIBOMP_HAVE_MSSE2_FLAG
:info:configure -- Performing Test LIBOMP_HAVE_MSSE2_FLAG - Success
:info:configure -- Performing Test LIBOMP_HAVE_FTLS_MODEL_FLAG
:info:configure -- Performing Test LIBOMP_HAVE_FTLS_MODEL_FLAG - Success
:info:configure -- Performing Test LIBOMP_HAVE_MMIC_FLAG
:info:configure -- Performing Test LIBOMP_HAVE_MMIC_FLAG - Failed
:info:configure -- Performing Test LIBOMP_HAVE_M32_FLAG
:info:configure -- Performing Test LIBOMP_HAVE_M32_FLAG - Success
:info:configure -- Looking for pthread.h
:info:configure -- Looking for pthread.h - found
:info:configure -- Performing Test CMAKE_HAVE_LIBC_PTHREAD
:info:configure -- Performing Test CMAKE_HAVE_LIBC_PTHREAD - Success
:info:configure -- Found Threads: TRUE
:info:configure -- Found Perl: /opt/local/bin/perl (found version "5.26.3")
:info:configure -- Performing Test LIBOMP_HAVE_VERSION_SYMBOLS
:info:configure -- Performing Test LIBOMP_HAVE_VERSION_SYMBOLS - Failed
:info:configure -- Performing Test LIBOMP_HAVE___BUILTIN_FRAME_ADDRESS
:info:configure -- Performing Test LIBOMP_HAVE___BUILTIN_FRAME_ADDRESS - Success
:info:configure -- Performing Test LIBOMP_HAVE_WEAK_ATTRIBUTE
:info:configure -- Performing Test LIBOMP_HAVE_WEAK_ATTRIBUTE - Success
:info:configure -- Looking for include files windows.h, psapi.h
:info:configure -- Looking for include files windows.h, psapi.h - not found
:info:configure -- Looking for EnumProcessModules in psapi
:info:configure -- Looking for EnumProcessModules in psapi - not found
:info:configure -- LIBOMP: Operating System -- Darwin
:info:configure -- LIBOMP: Target Architecture -- x86_64
:info:configure -- LIBOMP: Build Type -- Release
:info:configure -- LIBOMP: Library Kind -- SHARED
:info:configure -- LIBOMP: Library Type -- normal
:info:configure -- LIBOMP: Fortran Modules -- FALSE
:info:configure -- LIBOMP: Build -- 20140926
:info:configure -- LIBOMP: Use Stats-gathering -- FALSE
:info:configure -- LIBOMP: Use Debugger-support -- FALSE
:info:configure -- LIBOMP: Use ITT notify -- TRUE
:info:configure -- LIBOMP: Use OMPT-support -- FALSE
:info:configure -- LIBOMP: Use Adaptive locks -- TRUE
:info:configure -- LIBOMP: Use quad precision -- FALSE
:info:configure -- LIBOMP: Use TSAN-support -- FALSE
:info:configure -- LIBOMP: Use Hwloc library -- FALSE
:info:configure -- Looking for sqrt in m
:info:configure -- Looking for sqrt in m - found
:info:configure -- Looking for __atomic_load_1
:info:configure -- Looking for __atomic_load_1 - found
:info:configure -- check-libomp does nothing.
:info:configure -- check-ompt does nothing.
:info:configure -- check-openmp does nothing.
:info:configure -- Configuring done
:info:configure -- Generating done
:info:configure -- Build files have been written to: /opt/local/var/macports/build/_opt_local_var_macports_sources_rsync.macports.org_release_tarballs_ports_lang_libomp/libomp/work/build-x86_64
:debug:configure setting option autoconf.dir to /opt/local/var/macports/build/_opt_local_var_macports_sources_rsync.macports.org_release_tarballs_ports_lang_libomp/libomp/work/openmp-11.0.0.src
:debug:configure setting option autoreconf.dir to /opt/local/var/macports/build/_opt_local_var_macports_sources_rsync.macports.org_release_tarballs_ports_lang_libomp/libomp/work/openmp-11.0.0.src
:debug:configure setting option configure.dir to /opt/local/var/macports/build/_opt_local_var_macports_sources_rsync.macports.org_release_tarballs_ports_lang_libomp/libomp/work/build
:debug:configure setting option configure.compiler to clang
:debug:configure setting option configure.f90 to {}
:debug:configure setting option configure.f77 to {}
:debug:configure setting option configure.fc to {}
:debug:configure setting option configure.cc to /usr/bin/clang
:debug:configure setting option configure.cxx to /usr/bin/clang++
:debug:configure setting option configure.objc to /usr/bin/clang
:info:configure ---> Configuring libomp for architecture i386
:debug:configure setting option configure.dir to /opt/local/var/macports/build/_opt_local_var_macports_sources_rsync.macports.org_release_tarballs_ports_lang_libomp/libomp/work/build-i386
:debug:configure setting option autoreconf.dir to /opt/local/var/macports/build/_opt_local_var_macports_sources_rsync.macports.org_release_tarballs_ports_lang_libomp/libomp/work/openmp-11.0.0.src-i386
:debug:configure setting option autoconf.dir to /opt/local/var/macports/build/_opt_local_var_macports_sources_rsync.macports.org_release_tarballs_ports_lang_libomp/libomp/work/openmp-11.0.0.src-i386
:debug:configure Environment:
:debug:configure CC='/usr/bin/clang'
:debug:configure CC_PRINT_OPTIONS='YES'
:debug:configure CC_PRINT_OPTIONS_FILE='/opt/local/var/macports/build/_opt_local_var_macports_sources_rsync.macports.org_release_tarballs_ports_lang_libomp/libomp/work/.CC_PRINT_OPTIONS'
:debug:configure CFLAGS='-pipe -Os'
:debug:configure CPATH='/opt/local/include'
:debug:configure CPPFLAGS='-I/opt/local/include'
:debug:configure CXX='/usr/bin/clang++'
:debug:configure CXXFLAGS='-pipe -Os -stdlib=libc++'
:debug:configure DEVELOPER_DIR='/Library/Developer/CommandLineTools'
:debug:configure F90FLAGS='-pipe -Os'
:debug:configure FCFLAGS='-pipe -Os'
:debug:configure FFLAGS='-pipe -Os'
:debug:configure INSTALL='/usr/bin/install -c'
:debug:configure LDFLAGS='-L/opt/local/lib -Wl,-headerpad_max_install_names'
:debug:configure LIBRARY_PATH='/opt/local/lib'
:debug:configure MACOSX_DEPLOYMENT_TARGET='10.9'
:debug:configure OBJC='/usr/bin/clang'
:debug:configure OBJCFLAGS='-pipe -Os'
:debug:configure OBJCXX='/usr/bin/clang++'
:debug:configure OBJCXXFLAGS='-pipe -Os -stdlib=libc++'
:info:configure Executing: cd "/opt/local/var/macports/build/_opt_local_var_macports_sources_rsync.macports.org_release_tarballs_ports_lang_libomp/libomp/work/build-i386" && /opt/local/bin/cmake -DCMAKE_INSTALL_PREFIX=/opt/local/tmp -DCMAKE_BUILD_TYPE=Release -DCMAKE_BUILD_WITH_INSTALL_RPATH=ON -DCMAKE_C_COMPILER="$CC" -DCMAKE_COLOR_MAKEFILE=ON -DCMAKE_CXX_COMPILER="$CXX" -DCMAKE_FIND_FRAMEWORK=LAST -DCMAKE_MAKE_PROGRAM=/usr/bin/make -DCMAKE_MODULE_PATH=/opt/local/share/cmake/Modules -DCMAKE_SYSTEM_PREFIX_PATH="/opt/local;/opt/local;/usr" -DCMAKE_VERBOSE_MAKEFILE=ON -DCMAKE_POLICY_DEFAULT_CMP0025=NEW -Wno-dev -DCMAKE_INSTALL_RPATH=/opt/local/lib/libomp -DCMAKE_INSTALL_NAME_DIR=/opt/local/lib/libomp -DLIBOMP_OMPT_SUPPORT=FALSE -DCMAKE_C_FLAGS_RELEASE="-DNDEBUG" -DCMAKE_CXX_FLAGS_RELEASE="-DNDEBUG" -DCMAKE_OSX_DEPLOYMENT_TARGET="10.9" -DCMAKE_OSX_SYSROOT="/" -DCMAKE_OSX_ARCHITECTURES=i386 /opt/local/var/macports/build/_opt_local_var_macports_sources_rsync.macports.org_release_tarballs_ports_lang_libomp/libomp/work/openmp-11.0.0.src
:debug:configure system: cd "/opt/local/var/macports/build/_opt_local_var_macports_sources_rsync.macports.org_release_tarballs_ports_lang_libomp/libomp/work/build-i386" && /opt/local/bin/cmake -DCMAKE_INSTALL_PREFIX=/opt/local/tmp -DCMAKE_BUILD_TYPE=Release -DCMAKE_BUILD_WITH_INSTALL_RPATH=ON -DCMAKE_C_COMPILER="$CC" -DCMAKE_COLOR_MAKEFILE=ON -DCMAKE_CXX_COMPILER="$CXX" -DCMAKE_FIND_FRAMEWORK=LAST -DCMAKE_MAKE_PROGRAM=/usr/bin/make -DCMAKE_MODULE_PATH=/opt/local/share/cmake/Modules -DCMAKE_SYSTEM_PREFIX_PATH="/opt/local;/opt/local;/usr" -DCMAKE_VERBOSE_MAKEFILE=ON -DCMAKE_POLICY_DEFAULT_CMP0025=NEW -Wno-dev -DCMAKE_INSTALL_RPATH=/opt/local/lib/libomp -DCMAKE_INSTALL_NAME_DIR=/opt/local/lib/libomp -DLIBOMP_OMPT_SUPPORT=FALSE -DCMAKE_C_FLAGS_RELEASE="-DNDEBUG" -DCMAKE_CXX_FLAGS_RELEASE="-DNDEBUG" -DCMAKE_OSX_DEPLOYMENT_TARGET="10.9" -DCMAKE_OSX_SYSROOT="/" -DCMAKE_OSX_ARCHITECTURES=i386 /opt/local/var/macports/build/_opt_local_var_macports_sources_rsync.macports.org_release_tarballs_ports_lang_libomp/libomp/work/openmp-11.0.0.src
:info:configure -- The C compiler identification is AppleClang 6.0.0.6000057
:info:configure -- The CXX compiler identification is AppleClang 6.0.0.6000057
:info:configure -- Detecting C compiler ABI info
:info:configure -- Detecting C compiler ABI info - done
:info:configure -- Check for working C compiler: /usr/bin/clang - skipped
:info:configure -- Detecting C compile features
:info:configure -- Detecting C compile features - done
:info:configure -- Detecting CXX compiler ABI info
:info:configure -- Detecting CXX compiler ABI info - done
:info:configure -- Check for working CXX compiler: /usr/bin/clang++ - skipped
:info:configure -- Detecting CXX compile features
:info:configure -- Detecting CXX compile features - done
:info:configure -- Performing Test OPENMP_HAVE_WALL_FLAG
:info:configure -- Performing Test OPENMP_HAVE_WALL_FLAG - Success
:info:configure -- Performing Test OPENMP_HAVE_WERROR_FLAG
:info:configure -- Performing Test OPENMP_HAVE_WERROR_FLAG - Success
:info:configure -- Performing Test OPENMP_HAVE_WCAST_QUAL_FLAG
:info:configure -- Performing Test OPENMP_HAVE_WCAST_QUAL_FLAG - Success
:info:configure -- Performing Test OPENMP_HAVE_WFORMAT_PEDANTIC_FLAG
:info:configure -- Performing Test OPENMP_HAVE_WFORMAT_PEDANTIC_FLAG - Failed
:info:configure -- Performing Test OPENMP_HAVE_WIMPLICIT_FALLTHROUGH_FLAG
:info:configure -- Performing Test OPENMP_HAVE_WIMPLICIT_FALLTHROUGH_FLAG - Success
:info:configure -- Performing Test OPENMP_HAVE_WSIGN_COMPARE_FLAG
:info:configure -- Performing Test OPENMP_HAVE_WSIGN_COMPARE_FLAG - Success
:info:configure -- Performing Test OPENMP_HAVE_WNO_EXTRA_FLAG
:info:configure -- Performing Test OPENMP_HAVE_WNO_EXTRA_FLAG - Success
:info:configure -- Performing Test OPENMP_HAVE_WNO_PEDANTIC_FLAG
:info:configure -- Performing Test OPENMP_HAVE_WNO_PEDANTIC_FLAG - Success
:info:configure -- Performing Test OPENMP_HAVE_WNO_MAYBE_UNINITIALIZED_FLAG
:info:configure -- Performing Test OPENMP_HAVE_WNO_MAYBE_UNINITIALIZED_FLAG - Failed
:info:configure -- Performing Test OPENMP_HAVE_STD_GNUPP14_FLAG
:info:configure -- Performing Test OPENMP_HAVE_STD_GNUPP14_FLAG - Failed
:info:configure -- Performing Test OPENMP_HAVE_STD_CPP14_FLAG
:info:configure -- Performing Test OPENMP_HAVE_STD_CPP14_FLAG - Failed
:info:configure -- Found PythonInterp: /opt/local/bin/python (found version "3.6.12")
:info:configure -- Cannot find llvm-lit.
:info:configure -- Please put llvm-lit in your PATH, set OPENMP_LLVM_LIT_EXECUTABLE to its full path, or point OPENMP_LLVM_TOOLS_DIR to its directory.
:info:configure CMake Warning at cmake/OpenMPTesting.cmake:22 (message):
:info:configure The check targets will not be available!
:info:configure Call Stack (most recent call first):
:info:configure cmake/OpenMPTesting.cmake:51 (find_standalone_test_dependencies)
:info:configure CMakeLists.txt:49 (include)
:info:configure -- Performing Test LIBOMP_HAVE_FNO_EXCEPTIONS_FLAG
:info:configure -- Performing Test LIBOMP_HAVE_FNO_EXCEPTIONS_FLAG - Success
:info:configure -- Performing Test LIBOMP_HAVE_FNO_RTTI_FLAG
:info:configure -- Performing Test LIBOMP_HAVE_FNO_RTTI_FLAG - Success
:info:configure -- Performing Test LIBOMP_HAVE_WNO_CLASS_MEMACCESS_FLAG
:info:configure -- Performing Test LIBOMP_HAVE_WNO_CLASS_MEMACCESS_FLAG - Failed
:info:configure -- Performing Test LIBOMP_HAVE_WNO_COVERED_SWITCH_DEFAULT_FLAG
:info:configure -- Performing Test LIBOMP_HAVE_WNO_COVERED_SWITCH_DEFAULT_FLAG - Success
:info:configure -- Performing Test LIBOMP_HAVE_WNO_FRAME_ADDRESS_FLAG
:info:configure -- Performing Test LIBOMP_HAVE_WNO_FRAME_ADDRESS_FLAG - Failed
:info:configure -- Performing Test LIBOMP_HAVE_WNO_STRICT_ALIASING_FLAG
:info:configure -- Performing Test LIBOMP_HAVE_WNO_STRICT_ALIASING_FLAG - Success
:info:configure -- Performing Test LIBOMP_HAVE_WSTRINGOP_OVERFLOW_FLAG
:info:configure -- Performing Test LIBOMP_HAVE_WSTRINGOP_OVERFLOW_FLAG - Failed
:info:configure -- Performing Test LIBOMP_HAVE_WNO_STRINGOP_TRUNCATION_FLAG
:info:configure -- Performing Test LIBOMP_HAVE_WNO_STRINGOP_TRUNCATION_FLAG - Failed
:info:configure -- Performing Test LIBOMP_HAVE_WNO_SWITCH_FLAG
:info:configure -- Performing Test LIBOMP_HAVE_WNO_SWITCH_FLAG - Success
:info:configure -- Performing Test LIBOMP_HAVE_WNO_UNINITIALIZED_FLAG
:info:configure -- Performing Test LIBOMP_HAVE_WNO_UNINITIALIZED_FLAG - Success
:info:configure -- Performing Test LIBOMP_HAVE_WNO_UNUSED_BUT_SET_VARIABLE_FLAG
:info:configure -- Performing Test LIBOMP_HAVE_WNO_UNUSED_BUT_SET_VARIABLE_FLAG - Failed
:info:configure -- Performing Test LIBOMP_HAVE_MSSE2_FLAG
:info:configure -- Performing Test LIBOMP_HAVE_MSSE2_FLAG - Success
:info:configure -- Performing Test LIBOMP_HAVE_FTLS_MODEL_FLAG
:info:configure -- Performing Test LIBOMP_HAVE_FTLS_MODEL_FLAG - Success
:info:configure -- Performing Test LIBOMP_HAVE_MMIC_FLAG
:info:configure -- Performing Test LIBOMP_HAVE_MMIC_FLAG - Failed
:info:configure -- Performing Test LIBOMP_HAVE_M32_FLAG
:info:configure -- Performing Test LIBOMP_HAVE_M32_FLAG - Success
:info:configure -- Looking for pthread.h
:info:configure -- Looking for pthread.h - found
:info:configure -- Performing Test CMAKE_HAVE_LIBC_PTHREAD
:info:configure -- Performing Test CMAKE_HAVE_LIBC_PTHREAD - Success
:info:configure -- Found Threads: TRUE
:info:configure -- Found Perl: /opt/local/bin/perl (found version "5.26.3")
:info:configure -- Performing Test LIBOMP_HAVE_VERSION_SYMBOLS
:info:configure -- Performing Test LIBOMP_HAVE_VERSION_SYMBOLS - Failed
:info:configure -- Performing Test LIBOMP_HAVE___BUILTIN_FRAME_ADDRESS
:info:configure -- Performing Test LIBOMP_HAVE___BUILTIN_FRAME_ADDRESS - Success
:info:configure -- Performing Test LIBOMP_HAVE_WEAK_ATTRIBUTE
:info:configure -- Performing Test LIBOMP_HAVE_WEAK_ATTRIBUTE - Success
:info:configure -- Looking for include files windows.h, psapi.h
:info:configure -- Looking for include files windows.h, psapi.h - not found
:info:configure -- Looking for EnumProcessModules in psapi
:info:configure -- Looking for EnumProcessModules in psapi - not found
:info:configure -- LIBOMP: Operating System -- Darwin
:info:configure -- LIBOMP: Target Architecture -- i386
:info:configure -- LIBOMP: Build Type -- Release
:info:configure -- LIBOMP: Library Kind -- SHARED
:info:configure -- LIBOMP: Library Type -- normal
:info:configure -- LIBOMP: Fortran Modules -- FALSE
:info:configure -- LIBOMP: Build -- 20140926
:info:configure -- LIBOMP: Use Stats-gathering -- FALSE
:info:configure -- LIBOMP: Use Debugger-support -- FALSE
:info:configure -- LIBOMP: Use ITT notify -- TRUE
:info:configure -- LIBOMP: Use OMPT-support -- FALSE
:info:configure -- LIBOMP: Use Adaptive locks -- TRUE
:info:configure -- LIBOMP: Use quad precision -- FALSE
:info:configure -- LIBOMP: Use TSAN-support -- FALSE
:info:configure -- LIBOMP: Use Hwloc library -- FALSE
:info:configure -- Looking for sqrt in m
:info:configure -- Looking for sqrt in m - found
:info:configure -- Looking for __atomic_load_1
:info:configure -- Looking for __atomic_load_1 - found
:info:configure -- check-libomp does nothing.
:info:configure -- check-ompt does nothing.
:info:configure -- check-openmp does nothing.
:info:configure -- Configuring done
:info:configure -- Generating done
:info:configure -- Build files have been written to: /opt/local/var/macports/build/_opt_local_var_macports_sources_rsync.macports.org_release_tarballs_ports_lang_libomp/libomp/work/build-i386
:debug:configure setting option autoconf.dir to /opt/local/var/macports/build/_opt_local_var_macports_sources_rsync.macports.org_release_tarballs_ports_lang_libomp/libomp/work/openmp-11.0.0.src
:debug:configure setting option autoreconf.dir to /opt/local/var/macports/build/_opt_local_var_macports_sources_rsync.macports.org_release_tarballs_ports_lang_libomp/libomp/work/openmp-11.0.0.src
:debug:configure setting option configure.dir to /opt/local/var/macports/build/_opt_local_var_macports_sources_rsync.macports.org_release_tarballs_ports_lang_libomp/libomp/work/build
:debug:configure setting option configure.compiler to clang
:debug:configure setting option configure.f90 to {}
:debug:configure setting option configure.f77 to {}
:debug:configure setting option configure.fc to {}
:debug:configure setting option configure.cc to /usr/bin/clang
:debug:configure setting option configure.cxx to /usr/bin/clang++
:debug:configure setting option configure.objc to /usr/bin/clang
:debug:configure Executing proc-post-org.macports.configure-configure-0
:debug:configure Privilege de-escalation not attempted as not running as root.
:debug:build build phase started at Fri Dec 4 19:39:28 PST 2020
:notice:build ---> Building libomp
:debug:build Executing org.macports.build (libomp)
:info:build ---> Building libomp for architecture x86_64
:debug:build setting option build.dir to /opt/local/var/macports/build/_opt_local_var_macports_sources_rsync.macports.org_release_tarballs_ports_lang_libomp/libomp/work/build-x86_64
:debug:build Environment:
:debug:build CC_PRINT_OPTIONS='YES'
:debug:build CC_PRINT_OPTIONS_FILE='/opt/local/var/macports/build/_opt_local_var_macports_sources_rsync.macports.org_release_tarballs_ports_lang_libomp/libomp/work/.CC_PRINT_OPTIONS'
:debug:build CPATH='/opt/local/include'
:debug:build DEVELOPER_DIR='/Library/Developer/CommandLineTools'
:debug:build LIBRARY_PATH='/opt/local/lib'
:debug:build MACOSX_DEPLOYMENT_TARGET='10.9'
:info:build Executing: cd "/opt/local/var/macports/build/_opt_local_var_macports_sources_rsync.macports.org_release_tarballs_ports_lang_libomp/libomp/work/build-x86_64" && /usr/bin/make -j8 -w all VERBOSE=ON
:debug:build system: cd "/opt/local/var/macports/build/_opt_local_var_macports_sources_rsync.macports.org_release_tarballs_ports_lang_libomp/libomp/work/build-x86_64" && /usr/bin/make -j8 -w all VERBOSE=ON
:info:build make: Entering directory `/opt/local/var/macports/build/_opt_local_var_macports_sources_rsync.macports.org_release_tarballs_ports_lang_libomp/libomp/work/build-x86_64'
:info:build /opt/local/bin/cmake -S/opt/local/var/macports/build/_opt_local_var_macports_sources_rsync.macports.org_release_tarballs_ports_lang_libomp/libomp/work/openmp-11.0.0.src -B/opt/local/var/macports/build/_opt_local_var_macports_sources_rsync.macports.org_release_tarballs_ports_lang_libomp/libomp/work/build-x86_64 --check-build-system CMakeFiles/Makefile.cmake 0
:info:build /opt/local/bin/cmake -E cmake_progress_start /opt/local/var/macports/build/_opt_local_var_macports_sources_rsync.macports.org_release_tarballs_ports_lang_libomp/libomp/work/build-x86_64/CMakeFiles /opt/local/var/macports/build/_opt_local_var_macports_sources_rsync.macports.org_release_tarballs_ports_lang_libomp/libomp/work/build-x86_64//CMakeFiles/progress.marks
:info:build /Library/Developer/CommandLineTools/usr/bin/make -f CMakeFiles/Makefile2 all
:info:build make[1]: Entering directory `/opt/local/var/macports/build/_opt_local_var_macports_sources_rsync.macports.org_release_tarballs_ports_lang_libomp/libomp/work/build-x86_64'
:info:build /Library/Developer/CommandLineTools/usr/bin/make -f runtime/src/CMakeFiles/libomp-needed-headers.dir/build.make runtime/src/CMakeFiles/libomp-needed-headers.dir/depend
:info:build make[2]: Entering directory `/opt/local/var/macports/build/_opt_local_var_macports_sources_rsync.macports.org_release_tarballs_ports_lang_libomp/libomp/work/build-x86_64'
:info:build cd /opt/local/var/macports/build/_opt_local_var_macports_sources_rsync.macports.org_release_tarballs_ports_lang_libomp/libomp/work/build-x86_64 && /opt/local/bin/cmake -E cmake_depends "Unix Makefiles" /opt/local/var/macports/build/_opt_local_var_macports_sources_rsync.macports.org_release_tarballs_ports_lang_libomp/libomp/work/openmp-11.0.0.src /opt/local/var/macports/build/_opt_local_var_macports_sources_rsync.macports.org_release_tarballs_ports_lang_libomp/libomp/work/openmp-11.0.0.src/runtime/src /opt/local/var/macports/build/_opt_local_var_macports_sources_rsync.macports.org_release_tarballs_ports_lang_libomp/libomp/work/build-x86_64 /opt/local/var/macports/build/_opt_local_var_macports_sources_rsync.macports.org_release_tarballs_ports_lang_libomp/libomp/work/build-x86_64/runtime/src /opt/local/var/macports/build/_opt_local_var_macports_sources_rsync.macports.org_release_tarballs_ports_lang_libomp/libomp/work/build-x86_64/runtime/src/CMakeFiles/libomp-needed-headers.dir/DependInfo.cmake --color=
:info:build Dependee "/opt/local/var/macports/build/_opt_local_var_macports_sources_rsync.macports.org_release_tarballs_ports_lang_libomp/libomp/work/build-x86_64/runtime/src/CMakeFiles/libomp-needed-headers.dir/DependInfo.cmake" is newer than depender "/opt/local/var/macports/build/_opt_local_var_macports_sources_rsync.macports.org_release_tarballs_ports_lang_libomp/libomp/work/build-x86_64/runtime/src/CMakeFiles/libomp-needed-headers.dir/depend.internal".
:info:build Dependee "/opt/local/var/macports/build/_opt_local_var_macports_sources_rsync.macports.org_release_tarballs_ports_lang_libomp/libomp/work/build-x86_64/runtime/src/CMakeFiles/CMakeDirectoryInformation.cmake" is newer than depender "/opt/local/var/macports/build/_opt_local_var_macports_sources_rsync.macports.org_release_tarballs_ports_lang_libomp/libomp/work/build-x86_64/runtime/src/CMakeFiles/libomp-needed-headers.dir/depend.internal".
:info:build Scanning dependencies of target libomp-needed-headers
:info:build make[2]: Leaving directory `/opt/local/var/macports/build/_opt_local_var_macports_sources_rsync.macports.org_release_tarballs_ports_lang_libomp/libomp/work/build-x86_64'
:info:build /Library/Developer/CommandLineTools/usr/bin/make -f runtime/src/CMakeFiles/libomp-needed-headers.dir/build.make runtime/src/CMakeFiles/libomp-needed-headers.dir/build
:info:build make[2]: Entering directory `/opt/local/var/macports/build/_opt_local_var_macports_sources_rsync.macports.org_release_tarballs_ports_lang_libomp/libomp/work/build-x86_64'
:info:build [ 5%] Generating kmp_i18n_default.inc
:info:build [ 5%] Generating kmp_i18n_id.inc
:info:build cd /opt/local/var/macports/build/_opt_local_var_macports_sources_rsync.macports.org_release_tarballs_ports_lang_libomp/libomp/work/build-x86_64/runtime/src && /opt/local/bin/perl /opt/local/var/macports/build/_opt_local_var_macports_sources_rsync.macports.org_release_tarballs_ports_lang_libomp/libomp/work/openmp-11.0.0.src/runtime/tools/message-converter.pl --os=mac --prefix=kmp_i18n --default=kmp_i18n_default.inc /opt/local/var/macports/build/_opt_local_var_macports_sources_rsync.macports.org_release_tarballs_ports_lang_libomp/libomp/work/openmp-11.0.0.src/runtime/src/i18n/en_US.txt
:info:build cd /opt/local/var/macports/build/_opt_local_var_macports_sources_rsync.macports.org_release_tarballs_ports_lang_libomp/libomp/work/build-x86_64/runtime/src && /opt/local/bin/perl /opt/local/var/macports/build/_opt_local_var_macports_sources_rsync.macports.org_release_tarballs_ports_lang_libomp/libomp/work/openmp-11.0.0.src/runtime/tools/message-converter.pl --os=mac --prefix=kmp_i18n --enum=kmp_i18n_id.inc /opt/local/var/macports/build/_opt_local_var_macports_sources_rsync.macports.org_release_tarballs_ports_lang_libomp/libomp/work/openmp-11.0.0.src/runtime/src/i18n/en_US.txt
:info:build make[2]: Leaving directory `/opt/local/var/macports/build/_opt_local_var_macports_sources_rsync.macports.org_release_tarballs_ports_lang_libomp/libomp/work/build-x86_64'
:info:build [ 5%] Built target libomp-needed-headers
:info:build /Library/Developer/CommandLineTools/usr/bin/make -f runtime/src/CMakeFiles/omp.dir/build.make runtime/src/CMakeFiles/omp.dir/depend
:info:build make[2]: Entering directory `/opt/local/var/macports/build/_opt_local_var_macports_sources_rsync.macports.org_release_tarballs_ports_lang_libomp/libomp/work/build-x86_64'
:info:build cd /opt/local/var/macports/build/_opt_local_var_macports_sources_rsync.macports.org_release_tarballs_ports_lang_libomp/libomp/work/build-x86_64 && /opt/local/bin/cmake -E cmake_depends "Unix Makefiles" /opt/local/var/macports/build/_opt_local_var_macports_sources_rsync.macports.org_release_tarballs_ports_lang_libomp/libomp/work/openmp-11.0.0.src /opt/local/var/macports/build/_opt_local_var_macports_sources_rsync.macports.org_release_tarballs_ports_lang_libomp/libomp/work/openmp-11.0.0.src/runtime/src /opt/local/var/macports/build/_opt_local_var_macports_sources_rsync.macports.org_release_tarballs_ports_lang_libomp/libomp/work/build-x86_64 /opt/local/var/macports/build/_opt_local_var_macports_sources_rsync.macports.org_release_tarballs_ports_lang_libomp/libomp/work/build-x86_64/runtime/src /opt/local/var/macports/build/_opt_local_var_macports_sources_rsync.macports.org_release_tarballs_ports_lang_libomp/libomp/work/build-x86_64/runtime/src/CMakeFiles/omp.dir/DependInfo.cmake --color=
:info:build Dependee "/opt/local/var/macports/build/_opt_local_var_macports_sources_rsync.macports.org_release_tarballs_ports_lang_libomp/libomp/work/build-x86_64/runtime/src/CMakeFiles/omp.dir/DependInfo.cmake" is newer than depender "/opt/local/var/macports/build/_opt_local_var_macports_sources_rsync.macports.org_release_tarballs_ports_lang_libomp/libomp/work/build-x86_64/runtime/src/CMakeFiles/omp.dir/depend.internal".
:info:build Dependee "/opt/local/var/macports/build/_opt_local_var_macports_sources_rsync.macports.org_release_tarballs_ports_lang_libomp/libomp/work/build-x86_64/runtime/src/CMakeFiles/CMakeDirectoryInformation.cmake" is newer than depender "/opt/local/var/macports/build/_opt_local_var_macports_sources_rsync.macports.org_release_tarballs_ports_lang_libomp/libomp/work/build-x86_64/runtime/src/CMakeFiles/omp.dir/depend.internal".
:info:build Scanning dependencies of target omp
:info:build make[2]: Leaving directory `/opt/local/var/macports/build/_opt_local_var_macports_sources_rsync.macports.org_release_tarballs_ports_lang_libomp/libomp/work/build-x86_64'
:info:build /Library/Developer/CommandLineTools/usr/bin/make -f runtime/src/CMakeFiles/omp.dir/build.make runtime/src/CMakeFiles/omp.dir/build
:info:build make[2]: Entering directory `/opt/local/var/macports/build/_opt_local_var_macports_sources_rsync.macports.org_release_tarballs_ports_lang_libomp/libomp/work/build-x86_64'
:info:build [ 11%] Building CXX object runtime/src/CMakeFiles/omp.dir/kmp_atomic.cpp.o
:info:build [ 11%] Building CXX object runtime/src/CMakeFiles/omp.dir/kmp_csupport.cpp.o
:info:build [ 14%] Building CXX object runtime/src/CMakeFiles/omp.dir/kmp_debug.cpp.o
:info:build cd /opt/local/var/macports/build/_opt_local_var_macports_sources_rsync.macports.org_release_tarballs_ports_lang_libomp/libomp/work/build-x86_64/runtime/src && /usr/bin/clang++ -Domp_EXPORTS -I/opt/local/var/macports/build/_opt_local_var_macports_sources_rsync.macports.org_release_tarballs_ports_lang_libomp/libomp/work/build-x86_64/runtime/src -I/opt/local/var/macports/build/_opt_local_var_macports_sources_rsync.macports.org_release_tarballs_ports_lang_libomp/libomp/work/openmp-11.0.0.src/runtime/src -I/opt/local/var/macports/build/_opt_local_var_macports_sources_rsync.macports.org_release_tarballs_ports_lang_libomp/libomp/work/openmp-11.0.0.src/runtime/src/i18n -I/opt/local/var/macports/build/_opt_local_var_macports_sources_rsync.macports.org_release_tarballs_ports_lang_libomp/libomp/work/openmp-11.0.0.src/runtime/src/include -I/opt/local/var/macports/build/_opt_local_var_macports_sources_rsync.macports.org_release_tarballs_ports_lang_libomp/libomp/work/openmp-11.0.0.src/runtime/src/thirdparty/ittnotify -pipe -Os -stdlib=libc++ -Wall -Wcast-qual -Wimplicit-fallthrough -Wsign-compare -Wno-extra -Wno-pedantic -DNDEBUG -arch x86_64 -mmacosx-version-min=10.9 -fPIC -D _GNU_SOURCE -D _REENTRANT -I/opt/local/include -fno-exceptions -fno-rtti -Wno-covered-switch-default -Wno-strict-aliasing -Wno-switch -Wno-uninitialized -o CMakeFiles/omp.dir/kmp_csupport.cpp.o -c /opt/local/var/macports/build/_opt_local_var_macports_sources_rsync.macports.org_release_tarballs_ports_lang_libomp/libomp/work/openmp-11.0.0.src/runtime/src/kmp_csupport.cpp
:info:build cd /opt/local/var/macports/build/_opt_local_var_macports_sources_rsync.macports.org_release_tarballs_ports_lang_libomp/libomp/work/build-x86_64/runtime/src && /usr/bin/clang++ -Domp_EXPORTS -I/opt/local/var/macports/build/_opt_local_var_macports_sources_rsync.macports.org_release_tarballs_ports_lang_libomp/libomp/work/build-x86_64/runtime/src -I/opt/local/var/macports/build/_opt_local_var_macports_sources_rsync.macports.org_release_tarballs_ports_lang_libomp/libomp/work/openmp-11.0.0.src/runtime/src -I/opt/local/var/macports/build/_opt_local_var_macports_sources_rsync.macports.org_release_tarballs_ports_lang_libomp/libomp/work/openmp-11.0.0.src/runtime/src/i18n -I/opt/local/var/macports/build/_opt_local_var_macports_sources_rsync.macports.org_release_tarballs_ports_lang_libomp/libomp/work/openmp-11.0.0.src/runtime/src/include -I/opt/local/var/macports/build/_opt_local_var_macports_sources_rsync.macports.org_release_tarballs_ports_lang_libomp/libomp/work/openmp-11.0.0.src/runtime/src/thirdparty/ittnotify -pipe -Os -stdlib=libc++ -Wall -Wcast-qual -Wimplicit-fallthrough -Wsign-compare -Wno-extra -Wno-pedantic -DNDEBUG -arch x86_64 -mmacosx-version-min=10.9 -fPIC -D _GNU_SOURCE -D _REENTRANT -I/opt/local/include -fno-exceptions -fno-rtti -Wno-covered-switch-default -Wno-strict-aliasing -Wno-switch -Wno-uninitialized -o CMakeFiles/omp.dir/kmp_debug.cpp.o -c /opt/local/var/macports/build/_opt_local_var_macports_sources_rsync.macports.org_release_tarballs_ports_lang_libomp/libomp/work/openmp-11.0.0.src/runtime/src/kmp_debug.cpp
:info:build cd /opt/local/var/macports/build/_opt_local_var_macports_sources_rsync.macports.org_release_tarballs_ports_lang_libomp/libomp/work/build-x86_64/runtime/src && /usr/bin/clang++ -Domp_EXPORTS -I/opt/local/var/macports/build/_opt_local_var_macports_sources_rsync.macports.org_release_tarballs_ports_lang_libomp/libomp/work/build-x86_64/runtime/src -I/opt/local/var/macports/build/_opt_local_var_macports_sources_rsync.macports.org_release_tarballs_ports_lang_libomp/libomp/work/openmp-11.0.0.src/runtime/src -I/opt/local/var/macports/build/_opt_local_var_macports_sources_rsync.macports.org_release_tarballs_ports_lang_libomp/libomp/work/openmp-11.0.0.src/runtime/src/i18n -I/opt/local/var/macports/build/_opt_local_var_macports_sources_rsync.macports.org_release_tarballs_ports_lang_libomp/libomp/work/openmp-11.0.0.src/runtime/src/include -I/opt/local/var/macports/build/_opt_local_var_macports_sources_rsync.macports.org_release_tarballs_ports_lang_libomp/libomp/work/openmp-11.0.0.src/runtime/src/thirdparty/ittnotify -pipe -Os -stdlib=libc++ -Wall -Wcast-qual -Wimplicit-fallthrough -Wsign-compare -Wno-extra -Wno-pedantic -DNDEBUG -arch x86_64 -mmacosx-version-min=10.9 -fPIC -D _GNU_SOURCE -D _REENTRANT -I/opt/local/include -fno-exceptions -fno-rtti -Wno-covered-switch-default -Wno-strict-aliasing -Wno-switch -Wno-uninitialized -o CMakeFiles/omp.dir/kmp_atomic.cpp.o -c /opt/local/var/macports/build/_opt_local_var_macports_sources_rsync.macports.org_release_tarballs_ports_lang_libomp/libomp/work/openmp-11.0.0.src/runtime/src/kmp_atomic.cpp
:info:build [ 20%] Building CXX object runtime/src/CMakeFiles/omp.dir/kmp_alloc.cpp.o
:info:build [ 23%] Building CXX object runtime/src/CMakeFiles/omp.dir/kmp_error.cpp.o
:info:build [ 23%] Building CXX object runtime/src/CMakeFiles/omp.dir/kmp_itt.cpp.o
:info:build [ 26%] Building CXX object runtime/src/CMakeFiles/omp.dir/kmp_global.cpp.o
:info:build cd /opt/local/var/macports/build/_opt_local_var_macports_sources_rsync.macports.org_release_tarballs_ports_lang_libomp/libomp/work/build-x86_64/runtime/src && /usr/bin/clang++ -Domp_EXPORTS -I/opt/local/var/macports/build/_opt_local_var_macports_sources_rsync.macports.org_release_tarballs_ports_lang_libomp/libomp/work/build-x86_64/runtime/src -I/opt/local/var/macports/build/_opt_local_var_macports_sources_rsync.macports.org_release_tarballs_ports_lang_libomp/libomp/work/openmp-11.0.0.src/runtime/src -I/opt/local/var/macports/build/_opt_local_var_macports_sources_rsync.macports.org_release_tarballs_ports_lang_libomp/libomp/work/openmp-11.0.0.src/runtime/src/i18n -I/opt/local/var/macports/build/_opt_local_var_macports_sources_rsync.macports.org_release_tarballs_ports_lang_libomp/libomp/work/openmp-11.0.0.src/runtime/src/include -I/opt/local/var/macports/build/_opt_local_var_macports_sources_rsync.macports.org_release_tarballs_ports_lang_libomp/libomp/work/openmp-11.0.0.src/runtime/src/thirdparty/ittnotify -pipe -Os -stdlib=libc++ -Wall -Wcast-qual -Wimplicit-fallthrough -Wsign-compare -Wno-extra -Wno-pedantic -DNDEBUG -arch x86_64 -mmacosx-version-min=10.9 -fPIC -D _GNU_SOURCE -D _REENTRANT -I/opt/local/include -fno-exceptions -fno-rtti -Wno-covered-switch-default -Wno-strict-aliasing -Wno-switch -Wno-uninitialized -o CMakeFiles/omp.dir/kmp_error.cpp.o -c /opt/local/var/macports/build/_opt_local_var_macports_sources_rsync.macports.org_release_tarballs_ports_lang_libomp/libomp/work/openmp-11.0.0.src/runtime/src/kmp_error.cpp
:info:build [ 29%] Building CXX object runtime/src/CMakeFiles/omp.dir/kmp_environment.cpp.o
:info:build cd /opt/local/var/macports/build/_opt_local_var_macports_sources_rsync.macports.org_release_tarballs_ports_lang_libomp/libomp/work/build-x86_64/runtime/src && /usr/bin/clang++ -Domp_EXPORTS -I/opt/local/var/macports/build/_opt_local_var_macports_sources_rsync.macports.org_release_tarballs_ports_lang_libomp/libomp/work/build-x86_64/runtime/src -I/opt/local/var/macports/build/_opt_local_var_macports_sources_rsync.macports.org_release_tarballs_ports_lang_libomp/libomp/work/openmp-11.0.0.src/runtime/src -I/opt/local/var/macports/build/_opt_local_var_macports_sources_rsync.macports.org_release_tarballs_ports_lang_libomp/libomp/work/openmp-11.0.0.src/runtime/src/i18n -I/opt/local/var/macports/build/_opt_local_var_macports_sources_rsync.macports.org_release_tarballs_ports_lang_libomp/libomp/work/openmp-11.0.0.src/runtime/src/include -I/opt/local/var/macports/build/_opt_local_var_macports_sources_rsync.macports.org_release_tarballs_ports_lang_libomp/libomp/work/openmp-11.0.0.src/runtime/src/thirdparty/ittnotify -pipe -Os -stdlib=libc++ -Wall -Wcast-qual -Wimplicit-fallthrough -Wsign-compare -Wno-extra -Wno-pedantic -DNDEBUG -arch x86_64 -mmacosx-version-min=10.9 -fPIC -D _GNU_SOURCE -D _REENTRANT -I/opt/local/include -fno-exceptions -fno-rtti -Wno-covered-switch-default -Wno-strict-aliasing -Wno-switch -Wno-uninitialized -o CMakeFiles/omp.dir/kmp_global.cpp.o -c /opt/local/var/macports/build/_opt_local_var_macports_sources_rsync.macports.org_release_tarballs_ports_lang_libomp/libomp/work/openmp-11.0.0.src/runtime/src/kmp_global.cpp
:info:build cd /opt/local/var/macports/build/_opt_local_var_macports_sources_rsync.macports.org_release_tarballs_ports_lang_libomp/libomp/work/build-x86_64/runtime/src && /usr/bin/clang++ -Domp_EXPORTS -I/opt/local/var/macports/build/_opt_local_var_macports_sources_rsync.macports.org_release_tarballs_ports_lang_libomp/libomp/work/build-x86_64/runtime/src -I/opt/local/var/macports/build/_opt_local_var_macports_sources_rsync.macports.org_release_tarballs_ports_lang_libomp/libomp/work/openmp-11.0.0.src/runtime/src -I/opt/local/var/macports/build/_opt_local_var_macports_sources_rsync.macports.org_release_tarballs_ports_lang_libomp/libomp/work/openmp-11.0.0.src/runtime/src/i18n -I/opt/local/var/macports/build/_opt_local_var_macports_sources_rsync.macports.org_release_tarballs_ports_lang_libomp/libomp/work/openmp-11.0.0.src/runtime/src/include -I/opt/local/var/macports/build/_opt_local_var_macports_sources_rsync.macports.org_release_tarballs_ports_lang_libomp/libomp/work/openmp-11.0.0.src/runtime/src/thirdparty/ittnotify -pipe -Os -stdlib=libc++ -Wall -Wcast-qual -Wimplicit-fallthrough -Wsign-compare -Wno-extra -Wno-pedantic -DNDEBUG -arch x86_64 -mmacosx-version-min=10.9 -fPIC -D _GNU_SOURCE -D _REENTRANT -I/opt/local/include -fno-exceptions -fno-rtti -Wno-covered-switch-default -Wno-strict-aliasing -Wno-switch -Wno-uninitialized -o CMakeFiles/omp.dir/kmp_itt.cpp.o -c /opt/local/var/macports/build/_opt_local_var_macports_sources_rsync.macports.org_release_tarballs_ports_lang_libomp/libomp/work/openmp-11.0.0.src/runtime/src/kmp_itt.cpp
:info:build cd /opt/local/var/macports/build/_opt_local_var_macports_sources_rsync.macports.org_release_tarballs_ports_lang_libomp/libomp/work/build-x86_64/runtime/src && /usr/bin/clang++ -Domp_EXPORTS -I/opt/local/var/macports/build/_opt_local_var_macports_sources_rsync.macports.org_release_tarballs_ports_lang_libomp/libomp/work/build-x86_64/runtime/src -I/opt/local/var/macports/build/_opt_local_var_macports_sources_rsync.macports.org_release_tarballs_ports_lang_libomp/libomp/work/openmp-11.0.0.src/runtime/src -I/opt/local/var/macports/build/_opt_local_var_macports_sources_rsync.macports.org_release_tarballs_ports_lang_libomp/libomp/work/openmp-11.0.0.src/runtime/src/i18n -I/opt/local/var/macports/build/_opt_local_var_macports_sources_rsync.macports.org_release_tarballs_ports_lang_libomp/libomp/work/openmp-11.0.0.src/runtime/src/include -I/opt/local/var/macports/build/_opt_local_var_macports_sources_rsync.macports.org_release_tarballs_ports_lang_libomp/libomp/work/openmp-11.0.0.src/runtime/src/thirdparty/ittnotify -pipe -Os -stdlib=libc++ -Wall -Wcast-qual -Wimplicit-fallthrough -Wsign-compare -Wno-extra -Wno-pedantic -DNDEBUG -arch x86_64 -mmacosx-version-min=10.9 -fPIC -D _GNU_SOURCE -D _REENTRANT -I/opt/local/include -fno-exceptions -fno-rtti -Wno-covered-switch-default -Wno-strict-aliasing -Wno-switch -Wno-uninitialized -o CMakeFiles/omp.dir/kmp_environment.cpp.o -c /opt/local/var/macports/build/_opt_local_var_macports_sources_rsync.macports.org_release_tarballs_ports_lang_libomp/libomp/work/openmp-11.0.0.src/runtime/src/kmp_environment.cpp
:info:build cd /opt/local/var/macports/build/_opt_local_var_macports_sources_rsync.macports.org_release_tarballs_ports_lang_libomp/libomp/work/build-x86_64/runtime/src && /usr/bin/clang++ -Domp_EXPORTS -I/opt/local/var/macports/build/_opt_local_var_macports_sources_rsync.macports.org_release_tarballs_ports_lang_libomp/libomp/work/build-x86_64/runtime/src -I/opt/local/var/macports/build/_opt_local_var_macports_sources_rsync.macports.org_release_tarballs_ports_lang_libomp/libomp/work/openmp-11.0.0.src/runtime/src -I/opt/local/var/macports/build/_opt_local_var_macports_sources_rsync.macports.org_release_tarballs_ports_lang_libomp/libomp/work/openmp-11.0.0.src/runtime/src/i18n -I/opt/local/var/macports/build/_opt_local_var_macports_sources_rsync.macports.org_release_tarballs_ports_lang_libomp/libomp/work/openmp-11.0.0.src/runtime/src/include -I/opt/local/var/macports/build/_opt_local_var_macports_sources_rsync.macports.org_release_tarballs_ports_lang_libomp/libomp/work/openmp-11.0.0.src/runtime/src/thirdparty/ittnotify -pipe -Os -stdlib=libc++ -Wall -Wcast-qual -Wimplicit-fallthrough -Wsign-compare -Wno-extra -Wno-pedantic -DNDEBUG -arch x86_64 -mmacosx-version-min=10.9 -fPIC -D _GNU_SOURCE -D _REENTRANT -I/opt/local/include -fno-exceptions -fno-rtti -Wno-covered-switch-default -Wno-strict-aliasing -Wno-switch -Wno-uninitialized -o CMakeFiles/omp.dir/kmp_alloc.cpp.o -c /opt/local/var/macports/build/_opt_local_var_macports_sources_rsync.macports.org_release_tarballs_ports_lang_libomp/libomp/work/openmp-11.0.0.src/runtime/src/kmp_alloc.cpp
:info:build In file included from /opt/local/var/macports/build/_opt_local_var_macports_sources_rsync.macports.org_release_tarballs_ports_lang_libomp/libomp/work/openmp-11.0.0.src/runtime/src/kmp_itt.cpp:16:
:info:build In file included from /opt/local/var/macports/build/_opt_local_var_macports_sources_rsync.macports.org_release_tarballs_ports_lang_libomp/libomp/work/openmp-11.0.0.src/runtime/src/kmp_itt.h:17:
:info:build In file included from /opt/local/var/macports/build/_opt_local_var_macports_sources_rsync.macports.org_release_tarballs_ports_lang_libomp/libomp/work/openmp-11.0.0.src/runtime/src/kmp_lock.h:20:
:info:build In file included from /opt/local/var/macports/build/_opt_local_var_macports_sources_rsync.macports.org_release_tarballs_ports_lang_libomp/libomp/work/openmp-11.0.0.src/runtime/src/kmp_environment.cpp:53:
:info:build In file included from /opt/local/var/macports/build/_opt_local_var_macports_sources_rsync.macports.org_release_tarballs_ports_lang_libomp/libomp/work/openmp-11.0.0.src/runtime/src/kmp.h:79:
:info:build In file included from /opt/local/var/macports/build/_opt_local_var_macports_sources_rsync.macports.org_release_tarballs_ports_lang_libomp/libomp/work/openmp-11.0.0.src/runtime/src/kmp_os.h:18:
:info:build /Library/Developer/CommandLineTools/usr/bin/../include/c++/v1/atomic:539:2: error: <atomic> is not implemented
:info:build In file included from /opt/local/var/macports/build/_opt_local_var_macports_sources_rsync.macports.org_release_tarballs_ports_lang_libomp/libomp/work/openmp-11.0.0.src/runtime/src/kmp_debug.cpp:13:
:info:build In file included from /opt/local/var/macports/build/_opt_local_var_macports_sources_rsync.macports.org_release_tarballs_ports_lang_libomp/libomp/work/openmp-11.0.0.src/runtime/src/kmp.h:79:
:info:build In file included from /opt/local/var/macports/build/_opt_local_var_macports_sources_rsync.macports.org_release_tarballs_ports_lang_libomp/libomp/work/openmp-11.0.0.src/runtime/src/kmp_os.h:18:
:info:build /Library/Developer/CommandLineTools/usr/bin/../include/c++/v1/atomic:539:2: error: <atomic> is not implemented
:info:build #error <atomic> is not implemented
:info:build ^
:info:build In file included from /opt/local/var/macports/build/_opt_local_var_macports_sources_rsync.macports.org_release_tarballs_ports_lang_libomp/libomp/work/openmp-11.0.0.src/runtime/src/kmp_atomic.cpp:13:
:info:build In file included from /opt/local/var/macports/build/_opt_local_var_macports_sources_rsync.macports.org_release_tarballs_ports_lang_libomp/libomp/work/openmp-11.0.0.src/runtime/src/kmp_atomic.h:16:
:info:build In file included from /opt/local/var/macports/build/_opt_local_var_macports_sources_rsync.macports.org_release_tarballs_ports_lang_libomp/libomp/work/openmp-11.0.0.src/runtime/src/kmp_lock.h:20:
:info:build In file included from /opt/local/var/macports/build/_opt_local_var_macports_sources_rsync.macports.org_release_tarballs_ports_lang_libomp/libomp/work/openmp-11.0.0.src/runtime/src/kmp_os.h:18:
:info:build In file included from #error <atomic> is not implemented/opt/local/var/macports/build/_opt_local_var_macports_sources_rsync.macports.org_release_tarballs_ports_lang_libomp/libomp/work/openmp-11.0.0.src/runtime/src/kmp_alloc.cpp
:info:build :13 ^
:info:build /Library/Developer/CommandLineTools/usr/bin/../include/c++/v1/atomic:539:2: error: <atomic> is not implemented
:info:build #error <atomic> is not implemented
:info:build :
:info:build ^
:info:build In file included from /opt/local/var/macports/build/_opt_local_var_macports_sources_rsync.macports.org_release_tarballs_ports_lang_libomp/libomp/work/openmp-11.0.0.src/runtime/src/kmp.h:79:
:info:build In file included from /opt/local/var/macports/build/_opt_local_var_macports_sources_rsync.macports.org_release_tarballs_ports_lang_libomp/libomp/work/openmp-11.0.0.src/runtime/src/kmp_os.h:18:
:info:build /Library/Developer/CommandLineTools/usr/bin/../include/c++/v1/atomic:539:2: error: <atomic> is not implemented
:info:build #error <atomic> is not implemented
:info:build ^
:info:build In file included from /opt/local/var/macports/build/_opt_local_var_macports_sources_rsync.macports.org_release_tarballs_ports_lang_libomp/libomp/work/openmp-11.0.0.src/runtime/src/kmp_global.cpp:13:
:info:build In file included from /opt/local/var/macports/build/_opt_local_var_macports_sources_rsync.macports.org_release_tarballs_ports_lang_libomp/libomp/work/openmp-11.0.0.src/runtime/src/kmp_os.hIn file included from In file included from /opt/local/var/macports/build/_opt_local_var_macports_sources_rsync.macports.org_release_tarballs_ports_lang_libomp/libomp/work/openmp-11.0.0.src/runtime/src/kmp.h:79:/opt/local/var/macports/build/_opt_local_var_macports_sources_rsync.macports.org_release_tarballs_ports_lang_libomp/libomp/work/openmp-11.0.0.src/runtime/src/kmp_csupport.cpp:
:info:build :15In file included from :
:info:build In file included from /opt/local/var/macports/build/_opt_local_var_macports_sources_rsync.macports.org_release_tarballs_ports_lang_libomp/libomp/work/openmp-11.0.0.src/runtime/src/kmp.h:79:
:info:build In file included from /opt/local/var/macports/build/_opt_local_var_macports_sources_rsync.macports.org_release_tarballs_ports_lang_libomp/libomp/work/openmp-11.0.0.src/runtime/src/kmp_os.h:18:
:info:build 18:
:info:build /Library/Developer/CommandLineTools/usr/bin/../include/c++/v1/atomic:539:2: error: <atomic> is not implemented
:info:build /Library/Developer/CommandLineTools/usr/bin/../include/c++/v1/atomic:539:2:/opt/local/var/macports/build/_opt_local_var_macports_sources_rsync.macports.org_release_tarballs_ports_lang_libomp/libomp/work/openmp-11.0.0.src/runtime/src/kmp_os.h:18:
:info:build /Library/Developer/CommandLineTools/usr/bin/../include/c++/v1/atomic:539:2: error: <atomic> is not implemented
:info:build error: <atomic> is not implemented
:info:build #error <atomic> is not implemented
:info:build ^
:info:build #error <atomic> is not implemented
:info:build ^
:info:build #error <atomic> is not implemented
:info:build ^
:info:build In file included from /opt/local/var/macports/build/_opt_local_var_macports_sources_rsync.macports.org_release_tarballs_ports_lang_libomp/libomp/work/openmp-11.0.0.src/runtime/src/kmp_error.cpp:13:
:info:build In file included from /opt/local/var/macports/build/_opt_local_var_macports_sources_rsync.macports.org_release_tarballs_ports_lang_libomp/libomp/work/openmp-11.0.0.src/runtime/src/kmp.h:79:
:info:build In file included from /opt/local/var/macports/build/_opt_local_var_macports_sources_rsync.macports.org_release_tarballs_ports_lang_libomp/libomp/work/openmp-11.0.0.src/runtime/src/kmp_os.h:18:
:info:build /Library/Developer/CommandLineTools/usr/bin/../include/c++/v1/atomic:539:2: error: <atomic> is not implemented
:info:build #error <atomic> is not implemented
:info:build ^
:info:build In file included from /opt/local/var/macports/build/_opt_local_var_macports_sources_rsync.macports.org_release_tarballs_ports_lang_libomp/libomp/work/openmp-11.0.0.src/runtime/src/kmp_itt.cppIn file included from /opt/local/var/macports/build/_opt_local_var_macports_sources_rsync.macports.org_release_tarballs_ports_lang_libomp/libomp/work/openmp-11.0.0.src/runtime/src/kmp_atomic.cpp:13:
:info:build :16:
:info:build In file included from /opt/local/var/macports/build/_opt_local_var_macports_sources_rsync.macports.org_release_tarballs_ports_lang_libomp/libomp/work/openmp-11.0.0.src/runtime/src/kmp_atomic.h:16:
:info:build In file included from /opt/local/var/macports/build/_opt_local_var_macports_sources_rsync.macports.org_release_tarballs_ports_lang_libomp/libomp/work/openmp-11.0.0.src/runtime/src/kmp_lock.h:20:
:info:build /opt/local/var/macports/build/_opt_local_var_macports_sources_rsync.macports.org_release_tarballs_ports_lang_libomp/libomp/work/openmp-11.0.0.src/runtime/src/kmp_os.h:1028:6: warning: variable templates are a C++1y extension [-Wc++1y-extensions]
:info:build bool __kmp_atomic_compare_store(std::atomic<T> *p, T expected, T desired) {
:info:build ^
:info:build In file included from /opt/local/var/macports/build/_opt_local_var_macports_sources_rsync.macports.org_release_tarballs_ports_lang_libomp/libomp/work/openmp-11.0.0.src/runtime/src/kmp_itt.h:17:
:info:build In file included from /opt/local/var/macports/build/_opt_local_var_macports_sources_rsync.macports.org_release_tarballs_ports_lang_libomp/libomp/work/openmp-11.0.0.src/runtime/src/kmp_lock.h:20:
:info:build In file included from /opt/local/var/macports/build/_opt_local_var_macports_sources_rsync.macports.org_release_tarballs_ports_lang_libomp/libomp/work/openmp-11.0.0.src/runtime/src/kmp_alloc.cpp:13:
:info:build In file included from /opt/local/var/macports/build/_opt_local_var_macports_sources_rsync.macports.org_release_tarballs_ports_lang_libomp/libomp/work/openmp-11.0.0.src/runtime/src/kmp.h:79:
:info:build In file included from /opt/local/var/macports/build/_opt_local_var_macports_sources_rsync.macports.org_release_tarballs_ports_lang_libomp/libomp/work/openmp-11.0.0.src/runtime/src/kmp_error.cpp:/opt/local/var/macports/build/_opt_local_var_macports_sources_rsync.macports.org_release_tarballs_ports_lang_libomp/libomp/work/openmp-11.0.0.src/runtime/src/kmp_os.h:1028/opt/local/var/macports/build/_opt_local_var_macports_sources_rsync.macports.org_release_tarballs_ports_lang_libomp/libomp/work/openmp-11.0.0.src/runtime/src/kmp_os.h:1028:6: warning: variable templates are a C++1y extension [-Wc++1y-extensions]
:info:build bool __kmp_atomic_compare_store(std::atomic<T> *p, T expected, T desired) {
:info:build ^
:info:build :6: warning: variable templates are a C++1y extension [-Wc++1y-extensions]
:info:build bool __kmp_atomic_compare_store(std::atomic<T> *p, T expected, T desired) {
:info:build ^
:info:build In file included from /opt/local/var/macports/build/_opt_local_var_macports_sources_rsync.macports.org_release_tarballs_ports_lang_libomp/libomp/work/openmp-11.0.0.src/runtime/src/kmp_global.cpp:13:
:info:build In file included from /opt/local/var/macports/build/_opt_local_var_macports_sources_rsync.macports.org_release_tarballs_ports_lang_libomp/libomp/work/openmp-11.0.0.src/runtime/src/kmp.h13:
:info:build In file included from /opt/local/var/macports/build/_opt_local_var_macports_sources_rsync.macports.org_release_tarballs_ports_lang_libomp/libomp/work/openmp-11.0.0.src/runtime/src/kmp.h:79:
:info:build /opt/local/var/macports/build/_opt_local_var_macports_sources_rsync.macports.org_release_tarballs_ports_lang_libomp/libomp/work/openmp-11.0.0.src/runtime/src/kmp_os.h:1028:6:In file included from /opt/local/var/macports/build/_opt_local_var_macports_sources_rsync.macports.org_release_tarballs_ports_lang_libomp/libomp/work/openmp-11.0.0.src/runtime/src/kmp_environment.cpp:53:
:info:build In file included from /opt/local/var/macports/build/_opt_local_var_macports_sources_rsync.macports.org_release_tarballs_ports_lang_libomp/libomp/work/openmp-11.0.0.src/runtime/src/kmp.h:79:
:info:build /opt/local/var/macports/build/_opt_local_var_macports_sources_rsync.macports.org_release_tarballs_ports_lang_libomp/libomp/work/openmp-11.0.0.src/runtime/src/kmp_os.h:1028:6: warning: variable templates are a C++1y extension [-Wc++1y-extensions]
:info:build bool __kmp_atomic_compare_store(std::atomic<T> *p, T expected, T desired) {
:info:build ^
:info:build warning: variable templates are a C++1y extension [-Wc++1y-extensions]
:info:build bool __kmp_atomic_compare_store(std::atomic<T> *p, T expected, T desired) {
:info:build ^
:info:build In file included from /opt/local/var/macports/build/_opt_local_var_macports_sources_rsync.macports.org_release_tarballs_ports_lang_libomp/libomp/work/openmp-11.0.0.src/runtime/src/kmp_debug.cpp:13:
:info:build In file included from /opt/local/var/macports/build/_opt_local_var_macports_sources_rsync.macports.org_release_tarballs_ports_lang_libomp/libomp/work/openmp-11.0.0.src/runtime/src/kmp.h:79:
:info:build /opt/local/var/macports/build/_opt_local_var_macports_sources_rsync.macports.org_release_tarballs_ports_lang_libomp/libomp/work/openmp-11.0.0.src/runtime/src/kmp_os.h:1028:6: warning: variable templates are a C++1y extension [-Wc++1y-extensions]
:info:build bool __kmp_atomic_compare_store(std::atomic<T> *p, T expected, T desired) {
:info:build ^
:info:build In file included from /opt/local/var/macports/build/_opt_local_var_macports_sources_rsync.macports.org_release_tarballs_ports_lang_libomp/libomp/work/openmp-11.0.0.src/runtime/src/kmp_csupport.cpp:15:
:info:build In file included from /opt/local/var/macports/build/_opt_local_var_macports_sources_rsync.macports.org_release_tarballs_ports_lang_libomp/libomp/work/openmp-11.0.0.src/runtime/src/kmp.h:79:
:info:build /opt/local/var/macports/build/_opt_local_var_macports_sources_rsync.macports.org_release_tarballs_ports_lang_libomp/libomp/work/openmp-11.0.0.src/runtime/src/kmp_os.h:1028:6: warning: variable templates are a C++1y extension [-Wc++1y-extensions]
:info:build bool __kmp_atomic_compare_store(std::atomic<T> *p, T expected, T desired) {
:info:build ^
:info:build :79:
:info:build /opt/local/var/macports/build/_opt_local_var_macports_sources_rsync.macports.org_release_tarballs_ports_lang_libomp/libomp/work/openmp-11.0.0.src/runtime/src/kmp_os.h:1028:6: warning: variable templates are a C++1y extension [-Wc++1y-extensions]
:info:build bool __kmp_atomic_compare_store(std::atomic<T> *p, T expected, T desired) {
:info:build ^
:info:build /opt/local/var/macports/build/_opt_local_var_macports_sources_rsync.macports.org_release_tarballs_ports_lang_libomp/libomp/work/openmp-11.0.0.src/runtime/src/kmp_os.h:1028:/opt/local/var/macports/build/_opt_local_var_macports_sources_rsync.macports.org_release_tarballs_ports_lang_libomp/libomp/work/openmp-11.0.0.src/runtime/src/kmp_os.h:1028/opt/local/var/macports/build/_opt_local_var_macports_sources_rsync.macports.org_release_tarballs_ports_lang_libomp/libomp/work/openmp-11.0.0.src/runtime/src/kmp_os.h:102833: /opt/local/var/macports/build/_opt_local_var_macports_sources_rsync.macports.org_release_tarballs_ports_lang_libomp/libomp/work/openmp-11.0.0.src/runtime/src/kmp_os.h:1028:33: error: no member named 'atomic' in namespace 'std'; did you mean 'atoi'?
:info:build bool __kmp_atomic_compare_store(std::atomic<T> *p, T expected, T desired) {
:info:build ^~~~~~~~~~~
:info:build atoi
:info:build /usr/include/stdlib.h:132:6: note: :error: no member named 'atomic' in namespace 'std'; did you mean 'atoi'?
:info:build 33: errorbool __kmp_atomic_compare_store(std::atomic<T> *p, T expected, T desired) {
:info:build : no member named 'atomic' in namespace 'std'; did you mean 'atoi'?
:info:build :bool __kmp_atomic_compare_store(std::atomic<T> *p, T expected, T desired) {
:info:build ^~~~~~~~~~~
:info:build atoi
:info:build /usr/include/stdlib.h:132:6: note: 'atoi' declared here
:info:build int atoi(const char *);
:info:build ^
:info:build 33In file included from /opt/local/var/macports/build/_opt_local_var_macports_sources_rsync.macports.org_release_tarballs_ports_lang_libomp/libomp/work/openmp-11.0.0.src/runtime/src/kmp_itt.cpp:16:
:info:build In file included from /opt/local/var/macports/build/_opt_local_var_macports_sources_rsync.macports.org_release_tarballs_ports_lang_libomp/libomp/work/openmp-11.0.0.src/runtime/src/kmp_itt.h:17:
:info:build In file included from /opt/local/var/macports/build/_opt_local_var_macports_sources_rsync.macports.org_release_tarballs_ports_lang_libomp/libomp/work/openmp-11.0.0.src/runtime/src/kmp_lock.h:20:
:info:build /opt/local/var/macports/build/_opt_local_var_macports_sources_rsync.macports.org_release_tarballs_ports_lang_libomp/libomp/work/openmp-11.0.0.src/runtime/src/kmp_os.h:1028:45: : 'atoi' declared hereerror
:info:build ^~~~~~~~~~~
:info:build atoi
:info:build int atoi(const char *);
:info:build ^
:info:build In file included from /usr/include/stdlib.h/opt/local/var/macports/build/_opt_local_var_macports_sources_rsync.macports.org_release_tarballs_ports_lang_libomp/libomp/work/openmp-11.0.0.src/runtime/src/kmp_environment.cpp::13253::
:info:build 6In file included from :/opt/local/var/macports/build/_opt_local_var_macports_sources_rsync.macports.org_release_tarballs_ports_lang_libomp/libomp/work/openmp-11.0.0.src/runtime/src/kmp.h :note79: :
:info:build 'atoi' declared here/opt/local/var/macports/build/_opt_local_var_macports_sources_rsync.macports.org_release_tarballs_ports_lang_libomp/libomp/work/openmp-11.0.0.src/runtime/src/kmp_os.h
:info:build :1028:45: error: 'T' does not refer to a value
:info:build int atoi(const char *);
:info:build ^
:info:build /opt/local/var/macports/build/_opt_local_var_macports_sources_rsync.macports.org_release_tarballs_ports_lang_libomp/libomp/work/openmp-11.0.0.src/runtime/src/kmp_os.h:1028:33: error: no member named 'atomic' in namespace 'std'; did you mean 'atoi'?
:info:build error: 'T' does not refer to a value
:info:build bool __kmp_atomic_compare_store(std::atomic<T> *p, T expected, T desired) {
:info:build ^
:info:build /opt/local/var/macports/build/_opt_local_var_macports_sources_rsync.macports.org_release_tarballs_ports_lang_libomp/libomp/work/openmp-11.0.0.src/runtime/src/kmp_os.h:1027:20: note: declared here
:info:build template <typename T>
:info:build ^
:info:build bool __kmp_atomic_compare_store(std::atomic<T> *p, T expected, T desired) {
:info:build ^~~~~~~~~~~:
:info:build no member named 'atomic' in namespace 'std'; did you mean 'atoi'?
:info:build In file included from /opt/local/var/macports/build/_opt_local_var_macports_sources_rsync.macports.org_release_tarballs_ports_lang_libomp/libomp/work/openmp-11.0.0.src/runtime/src/kmp_atomic.cpp:13:
:info:build In file included from /opt/local/var/macports/build/_opt_local_var_macports_sources_rsync.macports.org_release_tarballs_ports_lang_libomp/libomp/work/openmp-11.0.0.src/runtime/src/kmp_atomic.h:16:
:info:build In file included from /opt/local/var/macports/build/_opt_local_var_macports_sources_rsync.macports.org_release_tarballs_ports_lang_libomp/libomp/work/openmp-11.0.0.src/runtime/src/kmp_lock.h:20:
:info:build /opt/local/var/macports/build/_opt_local_var_macports_sources_rsync.macports.org_release_tarballs_ports_lang_libomp/libomp/work/openmp-11.0.0.src/runtime/src/kmp_os.h:1028:45: error: 'T' does not refer to a value
:info:build bool __kmp_atomic_compare_store(std::atomic<T> *p, T expected, T desired) {
:info:build ^~~~~~~~~~~
:info:build atoi
:info:build bool __kmp_atomic_compare_store(std::atomic<T> *p, T expected, T desired) {
:info:build ^
:info:build /opt/local/var/macports/build/_opt_local_var_macports_sources_rsync.macports.org_release_tarballs_ports_lang_libomp/libomp/work/openmp-11.0.0.src/runtime/src/kmp_os.h:1027:20/usr/include/stdlib.h:: 132note:: 6declared here:
:info:build note: 'atoi' declared here
:info:build template <typename T>
:info:build ^
:info:build int atoi(const char *);
:info:build ^
:info:build In file included from /opt/local/var/macports/build/_opt_local_var_macports_sources_rsync.macports.org_release_tarballs_ports_lang_libomp/libomp/work/openmp-11.0.0.src/runtime/src/kmp_alloc.cpp:13:
:info:build In file included from /opt/local/var/macports/build/_opt_local_var_macports_sources_rsync.macports.org_release_tarballs_ports_lang_libomp/libomp/work/openmp-11.0.0.src/runtime/src/kmp.h:79:
:info:build bool __kmp_atomic_compare_store(std::atomic<T> *p, T expected, T desired) {
:info:build atoi ^
:info:build /opt/local/var/macports/build/_opt_local_var_macports_sources_rsync.macports.org_release_tarballs_ports_lang_libomp/libomp/work/openmp-11.0.0.src/runtime/src/kmp_os.h:1027:20: note: declared here
:info:build template <typename T>
:info:build ^/usr/include/stdlib.h
:info:build :132:6: note: 'atoi' declared here
:info:build /opt/local/var/macports/build/_opt_local_var_macports_sources_rsync.macports.org_release_tarballs_ports_lang_libomp/libomp/work/openmp-11.0.0.src/runtime/src/kmp_os.h:1028:45: error: 'T' does not refer to a value
:info:build int atoi(const char *);
:info:build ^
:info:build In file included from /opt/local/var/macports/build/_opt_local_var_macports_sources_rsync.macports.org_release_tarballs_ports_lang_libomp/libomp/work/openmp-11.0.0.src/runtime/src/kmp_error.cpp:13:
:info:build In file included from /opt/local/var/macports/build/_opt_local_var_macports_sources_rsync.macports.org_release_tarballs_ports_lang_libomp/libomp/work/openmp-11.0.0.src/runtime/src/kmp.h:79:
:info:build /opt/local/var/macports/build/_opt_local_var_macports_sources_rsync.macports.org_release_tarballs_ports_lang_libomp/libomp/work/openmp-11.0.0.src/runtime/src/kmp_os.h:1028:45: error: 'T' does not refer to a value
:info:build bool __kmp_atomic_compare_store(std::atomic<T> *p, T expected, T desired) {
:info:build ^
:info:build /opt/local/var/macports/build/_opt_local_var_macports_sources_rsync.macports.org_release_tarballs_ports_lang_libomp/libomp/work/openmp-11.0.0.src/runtime/src/kmp_os.h:1027:20: note: declared here
:info:build template <typename T>
:info:build ^
:info:build bool __kmp_atomic_compare_store(std::atomic<T> *p, T expected, T desired) {
:info:build ^
:info:build /opt/local/var/macports/build/_opt_local_var_macports_sources_rsync.macports.org_release_tarballs_ports_lang_libomp/libomp/work/openmp-11.0.0.src/runtime/src/kmp_os.h:1027:20: note: declared here
:info:build template <typename T>
:info:build ^
:info:build /opt/local/var/macports/build/_opt_local_var_macports_sources_rsync.macports.org_release_tarballs_ports_lang_libomp/libomp/work/openmp-11.0.0.src/runtime/src/kmp_os.h:1028:33: error: no member named 'atomic' in namespace 'std'; did you mean 'atoi'?
:info:build bool __kmp_atomic_compare_store(std::atomic<T> *p, T expected, T desired) {
:info:build ^~~~~~~~~~~
:info:build atoi
:info:build /usr/include/stdlib.h:132:6: note: 'atoi' declared here
:info:build int atoi(const char *);
:info:build ^
:info:build In file included from /opt/local/var/macports/build/_opt_local_var_macports_sources_rsync.macports.org_release_tarballs_ports_lang_libomp/libomp/work/openmp-11.0.0.src/runtime/src/kmp_debug.cpp:13:
:info:build In file included from /opt/local/var/macports/build/_opt_local_var_macports_sources_rsync.macports.org_release_tarballs_ports_lang_libomp/libomp/work/openmp-11.0.0.src/runtime/src/kmp.h:79:
:info:build /opt/local/var/macports/build/_opt_local_var_macports_sources_rsync.macports.org_release_tarballs_ports_lang_libomp/libomp/work/openmp-11.0.0.src/runtime/src/kmp_os.h:1028:45: error: 'T' does not refer to a value
:info:build bool __kmp_atomic_compare_store(std::atomic<T> *p, T expected, T desired) {
:info:build ^
:info:build /opt/local/var/macports/build/_opt_local_var_macports_sources_rsync.macports.org_release_tarballs_ports_lang_libomp/libomp/work/openmp-11.0.0.src/runtime/src/kmp_os.h:1027:20: note: declared here
:info:build template <typename T>
:info:build ^
:info:build /opt/local/var/macports/build/_opt_local_var_macports_sources_rsync.macports.org_release_tarballs_ports_lang_libomp/libomp/work/openmp-11.0.0.src/runtime/src/kmp_os.h:1028:33: error: no member named 'atomic' in namespace 'std'; did you mean 'atoi'?
:info:build bool __kmp_atomic_compare_store(std::atomic<T> *p, T expected, T desired) {
:info:build ^~~~~~~~~~~
:info:build atoi
:info:build /usr/include/stdlib.h:132:6: note: 'atoi' declared here
:info:build int atoi(const char *);
:info:build ^
:info:build In file included from /opt/local/var/macports/build/_opt_local_var_macports_sources_rsync.macports.org_release_tarballs_ports_lang_libomp/libomp/work/openmp-11.0.0.src/runtime/src/kmp_csupport.cpp:15:
:info:build In file included from /opt/local/var/macports/build/_opt_local_var_macports_sources_rsync.macports.org_release_tarballs_ports_lang_libomp/libomp/work/openmp-11.0.0.src/runtime/src/kmp.h:79:
:info:build /opt/local/var/macports/build/_opt_local_var_macports_sources_rsync.macports.org_release_tarballs_ports_lang_libomp/libomp/work/openmp-11.0.0.src/runtime/src/kmp_os.h:1028:45: error: 'T' does not refer to a value
:info:build bool __kmp_atomic_compare_store(std::atomic<T> *p, T expected, T desired) {
:info:build ^
:info:build /opt/local/var/macports/build/_opt_local_var_macports_sources_rsync.macports.org_release_tarballs_ports_lang_libomp/libomp/work/openmp-11.0.0.src/runtime/src/kmp_os.h:1027:20: note: declared here
:info:build /opt/local/var/macports/build/_opt_local_var_macports_sources_rsync.macports.org_release_tarballs_ports_lang_libomp/libomp/work/openmp-11.0.0.src/runtime/src/kmp_os.h:1028:33: error: template <typename T>no member named 'atomic' in namespace 'std'; did you mean 'atoi'?
:info:build ^
:info:build bool __kmp_atomic_compare_store(std::atomic<T> *p, T expected, T desired) {
:info:build ^~~~~~~~~~~
:info:build atoi
:info:build /usr/include/stdlib.h:132:6: note: 'atoi' declared here
:info:build int atoi(const char *);
:info:build ^
:info:build In file included from /opt/local/var/macports/build/_opt_local_var_macports_sources_rsync.macports.org_release_tarballs_ports_lang_libomp/libomp/work/openmp-11.0.0.src/runtime/src/kmp_global.cpp:13:
:info:build In file included from /opt/local/var/macports/build/_opt_local_var_macports_sources_rsync.macports.org_release_tarballs_ports_lang_libomp/libomp/work/openmp-11.0.0.src/runtime/src/kmp.h:79:
:info:build /opt/local/var/macports/build/_opt_local_var_macports_sources_rsync.macports.org_release_tarballs_ports_lang_libomp/libomp/work/openmp-11.0.0.src/runtime/src/kmp_os.h:1028:45: error: 'T' does not refer to a value
:info:build bool __kmp_atomic_compare_store(std::atomic<T> *p, T expected, T desired) {
:info:build ^
:info:build /opt/local/var/macports/build/_opt_local_var_macports_sources_rsync.macports.org_release_tarballs_ports_lang_libomp/libomp/work/openmp-11.0.0.src/runtime/src/kmp_os.h:1027:20: note: declared here
:info:build template <typename T>
:info:build ^
:info:build /opt/local/var/macports/build/_opt_local_var_macports_sources_rsync.macports.org_release_tarballs_ports_lang_libomp/libomp/work/openmp-11.0.0.src/runtime/src/kmp_os.h/opt/local/var/macports/build/_opt_local_var_macports_sources_rsync.macports.org_release_tarballs_ports_lang_libomp/libomp/work/openmp-11.0.0.src/runtime/src/kmp_os.h:1028/opt/local/var/macports/build/_opt_local_var_macports_sources_rsync.macports.org_release_tarballs_ports_lang_libomp/libomp/work/openmp-11.0.0.src/runtime/src/kmp_os.h:49/opt/local/var/macports/build/_opt_local_var_macports_sources_rsync.macports.org_release_tarballs_ports_lang_libomp/libomp/work/openmp-11.0.0.src/runtime/src/kmp_os.h/opt/local/var/macports/build/_opt_local_var_macports_sources_rsync.macports.org_release_tarballs_ports_lang_libomp/libomp/work/openmp-11.0.0.src/runtime/src/kmp_os.h/opt/local/var/macports/build/_opt_local_var_macports_sources_rsync.macports.org_release_tarballs_ports_lang_libomp/libomp/work/openmp-11.0.0.src/runtime/src/kmp_os.h/opt/local/var/macports/build/_opt_local_var_macports_sources_rsync.macports.org_release_tarballs_ports_lang_libomp/libomp/work/openmp-11.0.0.src/runtime/src/kmp_os.h:::1028/opt/local/var/macports/build/_opt_local_var_macports_sources_rsync.macports.org_release_tarballs_ports_lang_libomp/libomp/work/openmp-11.0.0.src/runtime/src/kmp_os.h:1028:102849 ::::error491028:102849::1028: ::49::use of undeclared identifier 'p': 49error: 1028error : ::: use of undeclared identifier 'p'use of undeclared identifier 'p'
:info:build 49error::
:info:build erroruse of undeclared identifier 'p'
:info:build 49: error: use of undeclared identifier 'p'error: : use of undeclared identifier 'p'use of undeclared identifier 'p'
:info:build bool __kmp_atomic_compare_store(std::atomic<T> *p, T expected, T desired) {
:info:build ^
:info:build bool __kmp_atomic_compare_store(std::atomic<T> *p, T expected, T desired) {
:info:build bool __kmp_atomic_compare_store(std::atomic<T> *p, T expected, T desired) { ^
:info:build ^
:info:build bool __kmp_atomic_compare_store(std::atomic<T> *p, T expected, T desired) {
:info:build bool __kmp_atomic_compare_store(std::atomic<T> *p, T expected, T desired) {
:info:build ^
:info:build ^
:info:build error: use of undeclared identifier 'p'
:info:build bool __kmp_atomic_compare_store(std::atomic<T> *p, T expected, T desired) {
:info:build ^bool __kmp_atomic_compare_store(std::atomic<T> *p, T expected, T desired) {bool __kmp_atomic_compare_store(std::atomic<T> *p, T expected, T desired) {
:info:build ^
:info:build ^
:info:build /opt/local/var/macports/build/_opt_local_var_macports_sources_rsync.macports.org_release_tarballs_ports_lang_libomp/libomp/work/openmp-11.0.0.src/runtime/src/kmp_os.h:/opt/local/var/macports/build/_opt_local_var_macports_sources_rsync.macports.org_release_tarballs_ports_lang_libomp/libomp/work/openmp-11.0.0.src/runtime/src/kmp_os.h/opt/local/var/macports/build/_opt_local_var_macports_sources_rsync.macports.org_release_tarballs_ports_lang_libomp/libomp/work/openmp-11.0.0.src/runtime/src/kmp_os.h::10281028:1028:74/opt/local/var/macports/build/_opt_local_var_macports_sources_rsync.macports.org_release_tarballs_ports_lang_libomp/libomp/work/openmp-11.0.0.src/runtime/src/kmp_os.h:/opt/local/var/macports/build/_opt_local_var_macports_sources_rsync.macports.org_release_tarballs_ports_lang_libomp/libomp/work/openmp-11.0.0.src/runtime/src/kmp_os.h:/opt/local/var/macports/build/_opt_local_var_macports_sources_rsync.macports.org_release_tarballs_ports_lang_libomp/libomp/work/openmp-11.0.0.src/runtime/src/kmp_os.h::/opt/local/var/macports/build/_opt_local_var_macports_sources_rsync.macports.org_release_tarballs_ports_lang_libomp/libomp/work/openmp-11.0.0.src/runtime/src/kmp_os.h 74::error1028: /opt/local/var/macports/build/_opt_local_var_macports_sources_rsync.macports.org_release_tarballs_ports_lang_libomp/libomp/work/openmp-11.0.0.src/runtime/src/kmp_os.h :error1028: 1028:1028:74:: 74expected ';' at end of declaration:expected ';' at end of declaration
:info:build :error74: :102874expected ';' at end of declaration:74
:info:build ::74 :error : :expected ';' at end of declaration
:info:build errorerror: : bool __kmp_atomic_compare_store(std::atomic<T> *p, T expected, T desired) {errorexpected ';' at end of declaration:
:info:build expected ';' at end of declaration
:info:build ^
:info:build ;
:info:build bool __kmp_atomic_compare_store(std::atomic<T> *p, T expected, T desired) {
:info:build ^
:info:build /opt/local/var/macports/build/_opt_local_var_macports_sources_rsync.macports.org_release_tarballs_ports_lang_libomp/libomp/work/openmp-11.0.0.src/runtime/src/kmp_os.h ;:
:info:build 1028:75bool __kmp_atomic_compare_store(std::atomic<T> *p, T expected, T desired) {:
:info:build ^error
:info:build : ;/opt/local/var/macports/build/_opt_local_var_macports_sources_rsync.macports.org_release_tarballs_ports_lang_libomp/libomp/work/openmp-11.0.0.src/runtime/src/kmp_os.h
:info:build :expected unqualified-idbool __kmp_atomic_compare_store(std::atomic<T> *p, T expected, T desired) {
:info:build expected ';' at end of declaration ^1028
:info:build ;
:info:build error:/opt/local/var/macports/build/_opt_local_var_macports_sources_rsync.macports.org_release_tarballs_ports_lang_libomp/libomp/work/openmp-11.0.0.src/runtime/src/kmp_os.h
:info:build 75/opt/local/var/macports/build/_opt_local_var_macports_sources_rsync.macports.org_release_tarballs_ports_lang_libomp/libomp/work/openmp-11.0.0.src/runtime/src/kmp_os.hbool __kmp_atomic_compare_store(std::atomic<T> *p, T expected, T desired) {:
:info:build 1028 ^
:info:build ;:bool __kmp_atomic_compare_store(std::atomic<T> *p, T expected, T desired) { :error::
:info:build 1028
:info:build ^:
:info:build 75: bool __kmp_atomic_compare_store(std::atomic<T> *p, T expected, T desired) {error
:info:build : ^expected unqualified-id
:info:build ;75:expected unqualified-id/opt/local/var/macports/build/_opt_local_var_macports_sources_rsync.macports.org_release_tarballs_ports_lang_libomp/libomp/work/openmp-11.0.0.src/runtime/src/kmp_os.h
:info:build :1028:75: error
:info:build error: bool __kmp_atomic_compare_store(std::atomic<T> *p, T expected, T desired) {expected unqualified-id
:info:build ^
:info:build ;
:info:build /opt/local/var/macports/build/_opt_local_var_macports_sources_rsync.macports.org_release_tarballs_ports_lang_libomp/libomp/work/openmp-11.0.0.src/runtime/src/kmp_os.h:1028:75:: bool __kmp_atomic_compare_store(std::atomic<T> *p, T expected, T desired) {
:info:build : expected ';' at end of declarationerrorexpected unqualified-id ^: bool __kmp_atomic_compare_store(std::atomic<T> *p, T expected, T desired) {bool __kmp_atomic_compare_store(std::atomic<T> *p, T expected, T desired) {
:info:build /opt/local/var/macports/build/_opt_local_var_macports_sources_rsync.macports.org_release_tarballs_ports_lang_libomp/libomp/work/openmp-11.0.0.src/runtime/src/kmp_os.h:1028:75: error: expected unqualified-id
:info:build ^
:info:build bool __kmp_atomic_compare_store(std::atomic<T> *p, T expected, T desired) {
:info:build ^
:info:build expected unqualified-id ^
:info:build bool __kmp_atomic_compare_store(std::atomic<T> *p, T expected, T desired) {
:info:build ^
:info:build bool __kmp_atomic_compare_store(std::atomic<T> *p, T expected, T desired) {
:info:build ^
:info:build bool __kmp_atomic_compare_store(std::atomic<T> *p, T expected, T desired) {
:info:build ^
:info:build ;
:info:build /opt/local/var/macports/build/_opt_local_var_macports_sources_rsync.macports.org_release_tarballs_ports_lang_libomp/libomp/work/openmp-11.0.0.src/runtime/src/kmp_os.h:1028:75: error: expected unqualified-id
:info:build bool __kmp_atomic_compare_store(std::atomic<T> *p, T expected, T desired) {
:info:build ^
:info:build /opt/local/var/macports/build/_opt_local_var_macports_sources_rsync.macports.org_release_tarballs_ports_lang_libomp/libomp/work/openmp-11.0.0.src/runtime/src/kmp_os.h:1034:6: warning: variable templates are a C++1y extension [-Wc++1y-extensions]
:info:build bool __kmp_atomic_compare_store_acq(std::atomic<T> *p, T expected, T desired) {
:info:build ^/opt/local/var/macports/build/_opt_local_var_macports_sources_rsync.macports.org_release_tarballs_ports_lang_libomp/libomp/work/openmp-11.0.0.src/runtime/src/kmp_os.h:1034:6: warning:
:info:build variable templates are a C++1y extension [-Wc++1y-extensions]
:info:build /opt/local/var/macports/build/_opt_local_var_macports_sources_rsync.macports.org_release_tarballs_ports_lang_libomp/libomp/work/openmp-11.0.0.src/runtime/src/kmp_os.h:1034:6: warning: variable templates are a C++1y extension [-Wc++1y-extensions]
:info:build bool __kmp_atomic_compare_store_acq(std::atomic<T> *p, T expected, T desired) {
:info:build ^
:info:build bool __kmp_atomic_compare_store_acq(std::atomic<T> *p, T expected, T desired) {
:info:build ^
:info:build /opt/local/var/macports/build/_opt_local_var_macports_sources_rsync.macports.org_release_tarballs_ports_lang_libomp/libomp/work/openmp-11.0.0.src/runtime/src/kmp_os.h:1034:6: warning: variable templates are a C++1y extension [-Wc++1y-extensions]
:info:build bool __kmp_atomic_compare_store_acq(std::atomic<T> *p, T expected, T desired) {
:info:build ^
:info:build /opt/local/var/macports/build/_opt_local_var_macports_sources_rsync.macports.org_release_tarballs_ports_lang_libomp/libomp/work/openmp-11.0.0.src/runtime/src/kmp_os.h:1034:6: warning: variable templates are a C++1y extension [-Wc++1y-extensions]
:info:build bool __kmp_atomic_compare_store_acq(std::atomic<T> *p, T expected, T desired) {
:info:build ^
:info:build /opt/local/var/macports/build/_opt_local_var_macports_sources_rsync.macports.org_release_tarballs_ports_lang_libomp/libomp/work/openmp-11.0.0.src/runtime/src/kmp_os.h:1034:6: warning: variable templates are a C++1y extension [-Wc++1y-extensions]
:info:build bool __kmp_atomic_compare_store_acq(std::atomic<T> *p, T expected, T desired) {
:info:build ^
:info:build /opt/local/var/macports/build/_opt_local_var_macports_sources_rsync.macports.org_release_tarballs_ports_lang_libomp/libomp/work/openmp-11.0.0.src/runtime/src/kmp_os.h:1034:6: warning: variable templates are a C++1y extension [-Wc++1y-extensions]
:info:build bool __kmp_atomic_compare_store_acq(std::atomic<T> *p, T expected, T desired) {
:info:build ^
:info:build /opt/local/var/macports/build/_opt_local_var_macports_sources_rsync.macports.org_release_tarballs_ports_lang_libomp/libomp/work/openmp-11.0.0.src/runtime/src/kmp_os.h:1034:6: warning: variable templates are a C++1y extension [-Wc++1y-extensions]
:info:build bool __kmp_atomic_compare_store_acq(std::atomic<T> *p, T expected, T desired) {
:info:build /opt/local/var/macports/build/_opt_local_var_macports_sources_rsync.macports.org_release_tarballs_ports_lang_libomp/libomp/work/openmp-11.0.0.src/runtime/src/kmp_os.h:1034:37: error: no member named 'atomic' in namespace 'std'; did you mean 'atoi'?
:info:build ^
:info:build bool __kmp_atomic_compare_store_acq(std::atomic<T> *p, T expected, T desired) {
:info:build ^~~~~~~~~~~
:info:build atoi
:info:build /usr/include/stdlib.h:132:6: note: 'atoi' declared here
:info:build int atoi(const char *);
:info:build /opt/local/var/macports/build/_opt_local_var_macports_sources_rsync.macports.org_release_tarballs_ports_lang_libomp/libomp/work/openmp-11.0.0.src/runtime/src/kmp_os.h:1034:37: error: no member named 'atomic' in namespace 'std'; did you mean 'atoi'?
:info:build /opt/local/var/macports/build/_opt_local_var_macports_sources_rsync.macports.org_release_tarballs_ports_lang_libomp/libomp/work/openmp-11.0.0.src/runtime/src/kmp_os.h:1034:37: error: no member named 'atomic' in namespace 'std'; did you mean 'atoi'?
:info:build bool __kmp_atomic_compare_store_acq(std::atomic<T> *p, T expected, T desired) {
:info:build ^~~~~~~~~~~
:info:build atoi ^
:info:build bool __kmp_atomic_compare_store_acq(std::atomic<T> *p, T expected, T desired) {
:info:build ^~~~~~~~~~~
:info:build atoiIn file included from /opt/local/var/macports/build/_opt_local_var_macports_sources_rsync.macports.org_release_tarballs_ports_lang_libomp/libomp/work/openmp-11.0.0.src/runtime/src/kmp_atomic.cpp:13
:info:build :
:info:build In file included from /opt/local/var/macports/build/_opt_local_var_macports_sources_rsync.macports.org_release_tarballs_ports_lang_libomp/libomp/work/openmp-11.0.0.src/runtime/src/kmp_atomic.h:16/usr/include/stdlib.h
:info:build :
:info:build In file included from /opt/local/var/macports/build/_opt_local_var_macports_sources_rsync.macports.org_release_tarballs_ports_lang_libomp/libomp/work/openmp-11.0.0.src/runtime/src/kmp_lock.h:20:
:info:build /opt/local/var/macports/build/_opt_local_var_macports_sources_rsync.macports.org_release_tarballs_ports_lang_libomp/libomp/work/openmp-11.0.0.src/runtime/src/kmp_os.h/usr/include/stdlib.h::132132::66:: notenote: : 'atoi' declared here'atoi' declared here
:info:build int atoi(const char *);int atoi(const char *);
:info:build ^ ^
:info:build In file included from /opt/local/var/macports/build/_opt_local_var_macports_sources_rsync.macports.org_release_tarballs_ports_lang_libomp/libomp/work/openmp-11.0.0.src/runtime/src/kmp_debug.cppIn file included from /opt/local/var/macports/build/_opt_local_var_macports_sources_rsync.macports.org_release_tarballs_ports_lang_libomp/libomp/work/openmp-11.0.0.src/runtime/src/kmp_environment.cpp:::1353:
:info:build In file included from 1034/opt/local/var/macports/build/_opt_local_var_macports_sources_rsync.macports.org_release_tarballs_ports_lang_libomp/libomp/work/openmp-11.0.0.src/runtime/src/kmp.h::
:info:build In file included from :/opt/local/var/macports/build/_opt_local_var_macports_sources_rsync.macports.org_release_tarballs_ports_lang_libomp/libomp/work/openmp-11.0.0.src/runtime/src/kmp.h49::7979:
:info:build /opt/local/var/macports/build/_opt_local_var_macports_sources_rsync.macports.org_release_tarballs_ports_lang_libomp/libomp/work/openmp-11.0.0.src/runtime/src/kmp_os.h:1034::
:info:build 49:/opt/local/var/macports/build/_opt_local_var_macports_sources_rsync.macports.org_release_tarballs_ports_lang_libomp/libomp/work/openmp-11.0.0.src/runtime/src/kmp_os.h :error1034: :'T' does not refer to a value49
:info:build : error: 'T' does not refer to a value
:info:build bool __kmp_atomic_compare_store_acq(std::atomic<T> *p, T expected, T desired) {
:info:build ^
:info:build bool __kmp_atomic_compare_store_acq(std::atomic<T> *p, T expected, T desired) {
:info:build /opt/local/var/macports/build/_opt_local_var_macports_sources_rsync.macports.org_release_tarballs_ports_lang_libomp/libomp/work/openmp-11.0.0.src/runtime/src/kmp_os.h: ^
:info:build 1033:20:/opt/local/var/macports/build/_opt_local_var_macports_sources_rsync.macports.org_release_tarballs_ports_lang_libomp/libomp/work/openmp-11.0.0.src/runtime/src/kmp_os.h :note1033: :declared here20
:info:build : note: declared here
:info:build template <typename T>
:info:build ^
:info:build template <typename T>
:info:build ^
:info:build /opt/local/var/macports/build/_opt_local_var_macports_sources_rsync.macports.org_release_tarballs_ports_lang_libomp/libomp/work/openmp-11.0.0.src/runtime/src/kmp_os.h:1034:37: error: no member named 'atomic' in namespace 'std'; did you mean 'atoi'?
:info:build bool __kmp_atomic_compare_store_acq(std::atomic<T> *p, T expected, T desired) {
:info:build ^~~~~~~~~~~
:info:build atoi
:info:build /usr/include/stdlib.h:132:6: error/opt/local/var/macports/build/_opt_local_var_macports_sources_rsync.macports.org_release_tarballs_ports_lang_libomp/libomp/work/openmp-11.0.0.src/runtime/src/kmp_os.hnote:: 1034'atoi' declared here:
:info:build 37: error: no member named 'atomic' in namespace 'std'; did you mean 'atoi'?
:info:build int atoi(const char *);
:info:build ^
:info:build In file included from /opt/local/var/macports/build/_opt_local_var_macports_sources_rsync.macports.org_release_tarballs_ports_lang_libomp/libomp/work/openmp-11.0.0.src/runtime/src/kmp_csupport.cpp:15:
:info:build In file included from /opt/local/var/macports/build/_opt_local_var_macports_sources_rsync.macports.org_release_tarballs_ports_lang_libomp/libomp/work/openmp-11.0.0.src/runtime/src/kmp.h:79:
:info:build /opt/local/var/macports/build/_opt_local_var_macports_sources_rsync.macports.org_release_tarballs_ports_lang_libomp/libomp/work/openmp-11.0.0.src/runtime/src/kmp_os.h:1034:49: errorbool __kmp_atomic_compare_store_acq(std::atomic<T> *p, T expected, T desired) {
:info:build ^~~~~~~~~~~
:info:build : 'T' does not refer to a value
:info:build : /opt/local/var/macports/build/_opt_local_var_macports_sources_rsync.macports.org_release_tarballs_ports_lang_libomp/libomp/work/openmp-11.0.0.src/runtime/src/kmp_os.h atoi:
:info:build 1034:/opt/local/var/macports/build/_opt_local_var_macports_sources_rsync.macports.org_release_tarballs_ports_lang_libomp/libomp/work/openmp-11.0.0.src/runtime/src/kmp_os.h/usr/include/stdlib.h'T' does not refer to a value:13237:: error
:info:build : no member named 'atomic' in namespace 'std'; did you mean 'atoi'?
:info:build bool __kmp_atomic_compare_store_acq(std::atomic<T> *p, T expected, T desired) {
:info:build ^
:info:build /opt/local/var/macports/build/_opt_local_var_macports_sources_rsync.macports.org_release_tarballs_ports_lang_libomp/libomp/work/openmp-11.0.0.src/runtime/src/kmp_os.h:1033:20: note: declared here
:info:build template <typename T>
:info:build ^
:info:build bool __kmp_atomic_compare_store_acq(std::atomic<T> *p, T expected, T desired) {
:info:build ^
:info:build bool __kmp_atomic_compare_store_acq(std::atomic<T> *p, T expected, T desired) {
:info:build ^~~~~~~~~~~/opt/local/var/macports/build/_opt_local_var_macports_sources_rsync.macports.org_release_tarballs_ports_lang_libomp/libomp/work/openmp-11.0.0.src/runtime/src/kmp_os.h
:info:build : atoi1033
:info:build :20: note: /usr/include/stdlib.h:132:declared here6
:info:build : note: 'atoi' declared here
:info:build template <typename T>
:info:build ^
:info:build int atoi(const char *);
:info:build ^
:info:build In file included from /opt/local/var/macports/build/_opt_local_var_macports_sources_rsync.macports.org_release_tarballs_ports_lang_libomp/libomp/work/openmp-11.0.0.src/runtime/src/kmp_alloc.cpp:13:
:info:build In file included from /opt/local/var/macports/build/_opt_local_var_macports_sources_rsync.macports.org_release_tarballs_ports_lang_libomp/libomp/work/openmp-11.0.0.src/runtime/src/kmp.h:79:
:info:build /opt/local/var/macports/build/_opt_local_var_macports_sources_rsync.macports.org_release_tarballs_ports_lang_libomp/libomp/work/openmp-11.0.0.src/runtime/src/kmp_os.h:1034:49: error: 'T' does not refer to a value
:info:build bool __kmp_atomic_compare_store_acq(std::atomic<T> *p, T expected, T desired) {
:info:build ^
:info:build /opt/local/var/macports/build/_opt_local_var_macports_sources_rsync.macports.org_release_tarballs_ports_lang_libomp/libomp/work/openmp-11.0.0.src/runtime/src/kmp_os.h:1033:20: note: declared here
:info:build template <typename T>
:info:build ^
:info:build /opt/local/var/macports/build/_opt_local_var_macports_sources_rsync.macports.org_release_tarballs_ports_lang_libomp/libomp/work/openmp-11.0.0.src/runtime/src/kmp_os.h:1034:53: error: use of undeclared identifier 'p'
:info:build bool __kmp_atomic_compare_store_acq(std::atomic<T> *p, T expected, T desired) {
:info:build ^
:info:build /opt/local/var/macports/build/_opt_local_var_macports_sources_rsync.macports.org_release_tarballs_ports_lang_libomp/libomp/work/openmp-11.0.0.src/runtime/src/kmp_os.h:1034:53: error: use of undeclared identifier 'p'
:info:build /opt/local/var/macports/build/_opt_local_var_macports_sources_rsync.macports.org_release_tarballs_ports_lang_libomp/libomp/work/openmp-11.0.0.src/runtime/src/kmp_os.h:1034:78: error: expected ';' at end of declaration
:info:build bool __kmp_atomic_compare_store_acq(std::atomic<T> *p, T expected, T desired) {
:info:build ^
:info:build bool __kmp_atomic_compare_store_acq(std::atomic<T> *p, T expected, T desired) {
:info:build ^
:info:build ;
:info:build /opt/local/var/macports/build/_opt_local_var_macports_sources_rsync.macports.org_release_tarballs_ports_lang_libomp/libomp/work/openmp-11.0.0.src/runtime/src/kmp_os.h:1034:78:6:/opt/local/var/macports/build/_opt_local_var_macports_sources_rsync.macports.org_release_tarballs_ports_lang_libomp/libomp/work/openmp-11.0.0.src/runtime/src/kmp_os.h note: :'atoi' declared here
:info:build error: expected ';' at end of declaration
:info:build int atoi(const char *);
:info:build ^
:info:build In file included from /opt/local/var/macports/build/_opt_local_var_macports_sources_rsync.macports.org_release_tarballs_ports_lang_libomp/libomp/work/openmp-11.0.0.src/runtime/src/kmp_itt.cpp:16/opt/local/var/macports/build/_opt_local_var_macports_sources_rsync.macports.org_release_tarballs_ports_lang_libomp/libomp/work/openmp-11.0.0.src/runtime/src/kmp_os.h:1034:1034::
:info:build bool __kmp_atomic_compare_store_acq(std::atomic<T> *p, T expected, T desired) {
:info:build : ^
:info:build In file included from 1034/opt/local/var/macports/build/_opt_local_var_macports_sources_rsync.macports.org_release_tarballs_ports_lang_libomp/libomp/work/openmp-11.0.0.src/runtime/src/kmp_itt.h:17 ;:
:info:build 79/opt/local/var/macports/build/_opt_local_var_macports_sources_rsync.macports.org_release_tarballs_ports_lang_libomp/libomp/work/openmp-11.0.0.src/runtime/src/kmp_os.h5337:::
:info:build :In file included from : error/opt/local/var/macports/build/_opt_local_var_macports_sources_rsync.macports.org_release_tarballs_ports_lang_libomp/libomp/work/openmp-11.0.0.src/runtime/src/kmp_lock.h/opt/local/var/macports/build/_opt_local_var_macports_sources_rsync.macports.org_release_tarballs_ports_lang_libomp/libomp/work/openmp-11.0.0.src/runtime/src/kmp_os.herror: 1034expected unqualified-id:: :103420:
:info:build /opt/local/var/macports/build/_opt_local_var_macports_sources_rsync.macports.org_release_tarballs_ports_lang_libomp/libomp/work/openmp-11.0.0.src/runtime/src/kmp_os.h::use of undeclared identifier 'p'
:info:build 79::53 :error : errorexpected unqualified-id:
:info:build use of undeclared identifier 'p'
:info:build bool __kmp_atomic_compare_store_acq(std::atomic<T> *p, T expected, T desired) {
:info:build ^
:info:build bool __kmp_atomic_compare_store_acq(std::atomic<T> *p, T expected, T desired) {/opt/local/var/macports/build/_opt_local_var_macports_sources_rsync.macports.org_release_tarballs_ports_lang_libomp/libomp/work/openmp-11.0.0.src/runtime/src/kmp_os.h:1034:
:info:build 1034 ^:78:bool __kmp_atomic_compare_store_acq(std::atomic<T> *p, T expected, T desired) {
:info:build error: expected ';' at end of declaration
:info:build bool __kmp_atomic_compare_store_acq(std::atomic<T> *p, T expected, T desired) {
:info:build ^
:info:build /opt/local/var/macports/build/_opt_local_var_macports_sources_rsync.macports.org_release_tarballs_ports_lang_libomp/libomp/work/openmp-11.0.0.src/runtime/src/kmp_os.h:1034:53: error: use of undeclared identifier 'p'bool __kmp_atomic_compare_store_acq(std::atomic<T> *p, T expected, T desired) {
:info:build ^49:
:info:build error
:info:build : ;'T' does not refer to a value
:info:build /opt/local/var/macports/build/_opt_local_var_macports_sources_rsync.macports.org_release_tarballs_ports_lang_libomp/libomp/work/openmp-11.0.0.src/runtime/src/kmp_os.h:1034:79: error: expected unqualified-id
:info:build bool __kmp_atomic_compare_store_acq(std::atomic<T> *p, T expected, T desired) {
:info:build ^
:info:build /opt/local/var/macports/build/_opt_local_var_macports_sources_rsync.macports.org_release_tarballs_ports_lang_libomp/libomp/work/openmp-11.0.0.src/runtime/src/kmp_os.h:1033:20: note: declared herebool __kmp_atomic_compare_store_acq(std::atomic<T> *p, T expected, T desired) {
:info:build ^
:info:build ^
:info:build /opt/local/var/macports/build/_opt_local_var_macports_sources_rsync.macports.org_release_tarballs_ports_lang_libomp/libomp/work/openmp-11.0.0.src/runtime/src/kmp_os.h:1034:78: error: expected ';' at end of declaration
:info:build bool __kmp_atomic_compare_store_acq(std::atomic<T> *p, T expected, T desired) {
:info:build ^
:info:build bool __kmp_atomic_compare_store_acq(std::atomic<T> *p, T expected, T desired) {
:info:build ^
:info:build ;
:info:build /opt/local/var/macports/build/_opt_local_var_macports_sources_rsync.macports.org_release_tarballs_ports_lang_libomp/libomp/work/openmp-11.0.0.src/runtime/src/kmp_os.h:1034:78:/opt/local/var/macports/build/_opt_local_var_macports_sources_rsync.macports.org_release_tarballs_ports_lang_libomp/libomp/work/openmp-11.0.0.src/runtime/src/kmp_os.h :error1034: :expected ';' at end of declaration79
:info:build : error: expected unqualified-id
:info:build bool __kmp_atomic_compare_store_acq(std::atomic<T> *p, T expected, T desired) {
:info:build ^
:info:build bool __kmp_atomic_compare_store_acq(std::atomic<T> *p, T expected, T desired) { ;
:info:build ^
:info:build /opt/local/var/macports/build/_opt_local_var_macports_sources_rsync.macports.org_release_tarballs_ports_lang_libomp/libomp/work/openmp-11.0.0.src/runtime/src/kmp_os.h:1034:79: error: expected unqualified-id
:info:build bool __kmp_atomic_compare_store_acq(std::atomic<T> *p, T expected, T desired) {
:info:build ^
:info:build template <typename T>
:info:build ^
:info:build /opt/local/var/macports/build/_opt_local_var_macports_sources_rsync.macports.org_release_tarballs_ports_lang_libomp/libomp/work/openmp-11.0.0.src/runtime/src/kmp_os.h:1034: error: no member named 'atomic' in namespace 'std'; did you mean 'atoi'?
:info:build bool __kmp_atomic_compare_store_acq(std::atomic<T> *p, T expected, T desired) {
:info:build ^~~~~~~~~~~
:info:build atoi
:info:build /opt/local/var/macports/build/_opt_local_var_macports_sources_rsync.macports.org_release_tarballs_ports_lang_libomp/libomp/work/openmp-11.0.0.src/runtime/src/kmp_os.h/usr/include/stdlib.h:132::10346: note: 'atoi' declared here
:info:build 37: :53: error: int atoi(const char *);
:info:build error ^
:info:build use of undeclared identifier 'p'
:info:build In file included from /opt/local/var/macports/build/_opt_local_var_macports_sources_rsync.macports.org_release_tarballs_ports_lang_libomp/libomp/work/openmp-11.0.0.src/runtime/src/kmp_error.cpp:13:
:info:build In file included from /opt/local/var/macports/build/_opt_local_var_macports_sources_rsync.macports.org_release_tarballs_ports_lang_libomp/libomp/work/openmp-11.0.0.src/runtime/src/kmp.h:79:
:info:build /opt/local/var/macports/build/_opt_local_var_macports_sources_rsync.macports.org_release_tarballs_ports_lang_libomp/libomp/work/openmp-11.0.0.src/runtime/src/kmp_os.h:1034:49: error: 'T' does not refer to a value
:info:build bool __kmp_atomic_compare_store_acq(std::atomic<T> *p, T expected, T desired) {
:info:build ^
:info:build /opt/local/var/macports/build/_opt_local_var_macports_sources_rsync.macports.org_release_tarballs_ports_lang_libomp/libomp/work/openmp-11.0.0.src/runtime/src/kmp_os.hbool __kmp_atomic_compare_store_acq(std::atomic<T> *p, T expected, T desired) {
:info:build ^
:info:build /opt/local/var/macports/build/_opt_local_var_macports_sources_rsync.macports.org_release_tarballs_ports_lang_libomp/libomp/work/openmp-11.0.0.src/runtime/src/kmp_os.h:1033:20: note: declared here
:info:build template <typename T>
:info:build ^
:info:build :1034:78: error: expected ';' at end of declaration
:info:build : no member named 'atomic' in namespace 'std'; did you mean 'atoi'?
:info:build bool __kmp_atomic_compare_store_acq(std::atomic<T> *p, T expected, T desired) {
:info:build ^
:info:build ;
:info:build /opt/local/var/macports/build/_opt_local_var_macports_sources_rsync.macports.org_release_tarballs_ports_lang_libomp/libomp/work/openmp-11.0.0.src/runtime/src/kmp_os.h:1034bool __kmp_atomic_compare_store_acq(std::atomic<T> *p, T expected, T desired) {
:info:build ^~~~~~~~~~~
:info:build atoi
:info:build /usr/include/stdlib.h:132:6: note: 'atoi' declared here
:info:build int atoi(const char *);
:info:build ^
:info:build In file included from /opt/local/var/macports/build/_opt_local_var_macports_sources_rsync.macports.org_release_tarballs_ports_lang_libomp/libomp/work/openmp-11.0.0.src/runtime/src/kmp_global.cpp:13:
:info:build In file included from /opt/local/var/macports/build/_opt_local_var_macports_sources_rsync.macports.org_release_tarballs_ports_lang_libomp/libomp/work/openmp-11.0.0.src/runtime/src/kmp.h:79:
:info:build /opt/local/var/macports/build/_opt_local_var_macports_sources_rsync.macports.org_release_tarballs_ports_lang_libomp/libomp/work/openmp-11.0.0.src/runtime/src/kmp_os.h:1034:49: error: 'T' does not refer to a value
:info:build bool __kmp_atomic_compare_store_acq(std::atomic<T> *p, T expected, T desired) {
:info:build ^
:info:build /opt/local/var/macports/build/_opt_local_var_macports_sources_rsync.macports.org_release_tarballs_ports_lang_libomp/libomp/work/openmp-11.0.0.src/runtime/src/kmp_os.h:1033:20: note: declared here
:info:build template <typename T>
:info:build ^
:info:build :79: error: expected unqualified-id
:info:build /opt/local/var/macports/build/_opt_local_var_macports_sources_rsync.macports.org_release_tarballs_ports_lang_libomp/libomp/work/openmp-11.0.0.src/runtime/src/kmp_os.h:1034bool __kmp_atomic_compare_store_acq(std::atomic<T> *p, T expected, T desired) {
:info:build ^
:info:build /opt/local/var/macports/build/_opt_local_var_macports_sources_rsync.macports.org_release_tarballs_ports_lang_libomp/libomp/work/openmp-11.0.0.src/runtime/src/kmp_os.h:1040:6: warning: variable templates are a C++1y extension [-Wc++1y-extensions]
:info:build :53:bool __kmp_atomic_compare_store_rel(std::atomic<T> *p, T expected, T desired) {
:info:build ^/opt/local/var/macports/build/_opt_local_var_macports_sources_rsync.macports.org_release_tarballs_ports_lang_libomp/libomp/work/openmp-11.0.0.src/runtime/src/kmp_os.h:1040:6: error:
:info:build warning: variable templates are a C++1y extension [-Wc++1y-extensions]
:info:build /opt/local/var/macports/build/_opt_local_var_macports_sources_rsync.macports.org_release_tarballs_ports_lang_libomp/libomp/work/openmp-11.0.0.src/runtime/src/kmp_os.h:1040:6: warning: variable templates are a C++1y extension [-Wc++1y-extensions]
:info:build bool __kmp_atomic_compare_store_rel(std::atomic<T> *p, T expected, T desired) {
:info:build ^
:info:build /opt/local/var/macports/build/_opt_local_var_macports_sources_rsync.macports.org_release_tarballs_ports_lang_libomp/libomp/work/openmp-11.0.0.src/runtime/src/kmp_os.h:1040:6: warning: variable templates are a C++1y extension [-Wc++1y-extensions]
:info:build use of undeclared identifier 'p'bool __kmp_atomic_compare_store_rel(std::atomic<T> *p, T expected, T desired) {
:info:build ^
:info:build bool __kmp_atomic_compare_store_rel(std::atomic<T> *p, T expected, T desired) {
:info:build ^
:info:build /opt/local/var/macports/build/_opt_local_var_macports_sources_rsync.macports.org_release_tarballs_ports_lang_libomp/libomp/work/openmp-11.0.0.src/runtime/src/kmp_os.h:1034:53:/opt/local/var/macports/build/_opt_local_var_macports_sources_rsync.macports.org_release_tarballs_ports_lang_libomp/libomp/work/openmp-11.0.0.src/runtime/src/kmp_os.h error: :1040:6:bool __kmp_atomic_compare_store_acq(std::atomic<T> *p, T expected, T desired) {
:info:build warninguse of undeclared identifier 'p':
:info:build variable templates are a C++1y extension [-Wc++1y-extensions]
:info:build bool __kmp_atomic_compare_store_acq(std::atomic<T> *p, T expected, T desired) {
:info:build ^
:info:build bool __kmp_atomic_compare_store_rel(std::atomic<T> *p, T expected, T desired) {
:info:build ^
:info:build /opt/local/var/macports/build/_opt_local_var_macports_sources_rsync.macports.org_release_tarballs_ports_lang_libomp/libomp/work/openmp-11.0.0.src/runtime/src/kmp_os.h:1034:78: error: /opt/local/var/macports/build/_opt_local_var_macports_sources_rsync.macports.org_release_tarballs_ports_lang_libomp/libomp/work/openmp-11.0.0.src/runtime/src/kmp_os.h:1034:expected ';' at end of declaration78
:info:build : error: expected ';' at end of declaration
:info:build bool __kmp_atomic_compare_store_acq(std::atomic<T> *p, T expected, T desired) {
:info:build ^
:info:build bool __kmp_atomic_compare_store_acq(std::atomic<T> *p, T expected, T desired) { ;
:info:build ^
:info:build ;
:info:build /opt/local/var/macports/build/_opt_local_var_macports_sources_rsync.macports.org_release_tarballs_ports_lang_libomp/libomp/work/openmp-11.0.0.src/runtime/src/kmp_os.h:1034:79/opt/local/var/macports/build/_opt_local_var_macports_sources_rsync.macports.org_release_tarballs_ports_lang_libomp/libomp/work/openmp-11.0.0.src/runtime/src/kmp_os.h:: 1034error:: 79: ^
:info:build expected unqualified-id
:info:build bool __kmp_atomic_compare_store_acq(std::atomic<T> *p, T expected, T desired) {
:info:build ^
:info:build /opt/local/var/macports/build/_opt_local_var_macports_sources_rsync.macports.org_release_tarballs_ports_lang_libomp/libomp/work/openmp-11.0.0.src/runtime/src/kmp_os.h:1040:37: error: no member named 'atomic' in namespace 'std'; did you mean 'atoi'?
:info:build bool __kmp_atomic_compare_store_rel(std::atomic<T> *p, T expected, T desired) {
:info:build ^~~~~~~~~~~
:info:build /opt/local/var/macports/build/_opt_local_var_macports_sources_rsync.macports.org_release_tarballs_ports_lang_libomp/libomp/work/openmp-11.0.0.src/runtime/src/kmp_os.h:1040:6: warning: variable templates are a C++1y extension [-Wc++1y-extensions]
:info:build bool __kmp_atomic_compare_store_rel(std::atomic<T> *p, T expected, T desired) {
:info:build ^
:info:build atoi
:info:build /opt/local/var/macports/build/_opt_local_var_macports_sources_rsync.macports.org_release_tarballs_ports_lang_libomp/libomp/work/openmp-11.0.0.src/runtime/src/kmp_os.h:1040:37: error: no member named 'atomic' in namespace 'std'; did you mean 'atoi'?
:info:build /opt/local/var/macports/build/_opt_local_var_macports_sources_rsync.macports.org_release_tarballs_ports_lang_libomp/libomp/work/openmp-11.0.0.src/runtime/src/kmp_os.h:1040:37: error: no member named 'atomic' in namespace 'std'; did you mean 'atoi'?bool __kmp_atomic_compare_store_rel(std::atomic<T> *p, T expected, T desired) {
:info:build ^~~~~~~~~~~
:info:build atoi
:info:build /usr/include/stdlib.h:132:6: note: 'atoi' declared here
:info:build bool __kmp_atomic_compare_store_rel(std::atomic<T> *p, T expected, T desired) {
:info:build int atoi(const char *);
:info:build ^
:info:build /usr/include/stdlib.h:132:6: note: ^~~~~~~~~~~'atoi' declared here
:info:build In file included from /opt/local/var/macports/build/_opt_local_var_macports_sources_rsync.macports.org_release_tarballs_ports_lang_libomp/libomp/work/openmp-11.0.0.src/runtime/src/kmp_csupport.cpp:15:
:info:build In file included from /opt/local/var/macports/build/_opt_local_var_macports_sources_rsync.macports.org_release_tarballs_ports_lang_libomp/libomp/work/openmp-11.0.0.src/runtime/src/kmp.h:79:
:info:build /opt/local/var/macports/build/_opt_local_var_macports_sources_rsync.macports.org_release_tarballs_ports_lang_libomp/libomp/work/openmp-11.0.0.src/runtime/src/kmp_os.h:1040:49
:info:build atoiint atoi(const char *);: error
:info:build : ^'T' does not refer to a value
:info:build In file included from /opt/local/var/macports/build/_opt_local_var_macports_sources_rsync.macports.org_release_tarballs_ports_lang_libomp/libomp/work/openmp-11.0.0.src/runtime/src/kmp_atomic.cpp/opt/local/var/macports/build/_opt_local_var_macports_sources_rsync.macports.org_release_tarballs_ports_lang_libomp/libomp/work/openmp-11.0.0.src/runtime/src/kmp_os.h
:info:build :1040:37: /usr/include/stdlib.herror:: 132no member named 'atomic' in namespace 'std'; did you mean 'atoi'?:
:info:build 6: note: 'atoi' declared here
:info:build bool __kmp_atomic_compare_store_rel(std::atomic<T> *p, T expected, T desired) {
:info:build ^
:info:build int atoi(const char *);
:info:build /opt/local/var/macports/build/_opt_local_var_macports_sources_rsync.macports.org_release_tarballs_ports_lang_libomp/libomp/work/openmp-11.0.0.src/runtime/src/kmp_os.h ^:
:info:build 1039:20: note: declared here
:info:build In file included from /opt/local/var/macports/build/_opt_local_var_macports_sources_rsync.macports.org_release_tarballs_ports_lang_libomp/libomp/work/openmp-11.0.0.src/runtime/src/kmp_environment.cpp:53:
:info:build In file included from /opt/local/var/macports/build/_opt_local_var_macports_sources_rsync.macports.org_release_tarballs_ports_lang_libomp/libomp/work/openmp-11.0.0.src/runtime/src/kmp.h:79bool __kmp_atomic_compare_store_rel(std::atomic<T> *p, T expected, T desired) {template <typename T>
:info:build :
:info:build /opt/local/var/macports/build/_opt_local_var_macports_sources_rsync.macports.org_release_tarballs_ports_lang_libomp/libomp/work/openmp-11.0.0.src/runtime/src/kmp_os.h : ^13:error
:info:build : :
:info:build expected unqualified-id
:info:build In file included from /opt/local/var/macports/build/_opt_local_var_macports_sources_rsync.macports.org_release_tarballs_ports_lang_libomp/libomp/work/openmp-11.0.0.src/runtime/src/kmp_atomic.h ^~~~~~~~~~~:
:info:build atoi
:info:build 1040:49: /usr/include/stdlib.h16:
:info:build error:In file included from : /opt/local/var/macports/build/_opt_local_var_macports_sources_rsync.macports.org_release_tarballs_ports_lang_libomp/libomp/work/openmp-11.0.0.src/runtime/src/kmp_lock.h:13220::
:info:build 6/opt/local/var/macports/build/_opt_local_var_macports_sources_rsync.macports.org_release_tarballs_ports_lang_libomp/libomp/work/openmp-11.0.0.src/runtime/src/kmp_os.h:: 1040note:bool __kmp_atomic_compare_store_acq(std::atomic<T> *p, T expected, T desired) {49
:info:build :: 'atoi' declared hereerror'T' does not refer to a value:
:info:build 'T' does not refer to a value
:info:build int atoi(const char *);
:info:build ^
:info:build In file included from /opt/local/var/macports/build/_opt_local_var_macports_sources_rsync.macports.org_release_tarballs_ports_lang_libomp/libomp/work/openmp-11.0.0.src/runtime/src/kmp_debug.cpp:13bool __kmp_atomic_compare_store_rel(std::atomic<T> *p, T expected, T desired) {:
:info:build In file included from ^/opt/local/var/macports/build/_opt_local_var_macports_sources_rsync.macports.org_release_tarballs_ports_lang_libomp/libomp/work/openmp-11.0.0.src/runtime/src/kmp.h
:info:build :bool __kmp_atomic_compare_store_rel(std::atomic<T> *p, T expected, T desired) {79
:info:build :
:info:build ^/opt/local/var/macports/build/_opt_local_var_macports_sources_rsync.macports.org_release_tarballs_ports_lang_libomp/libomp/work/openmp-11.0.0.src/runtime/src/kmp_os.h
:info:build :1040:49: /opt/local/var/macports/build/_opt_local_var_macports_sources_rsync.macports.org_release_tarballs_ports_lang_libomp/libomp/work/openmp-11.0.0.src/runtime/src/kmp_os.h:/opt/local/var/macports/build/_opt_local_var_macports_sources_rsync.macports.org_release_tarballs_ports_lang_libomp/libomp/work/openmp-11.0.0.src/runtime/src/kmp_os.h1039:error20: :'T' does not refer to a value
:info:build note: declared here
:info:build template <typename T>
:info:build ^
:info:build bool __kmp_atomic_compare_store_rel(std::atomic<T> *p, T expected, T desired) {
:info:build ^
:info:build /opt/local/var/macports/build/_opt_local_var_macports_sources_rsync.macports.org_release_tarballs_ports_lang_libomp/libomp/work/openmp-11.0.0.src/runtime/src/kmp_os.h:1039:20: note: declared here
:info:build template <typename T>
:info:build ^
:info:build /opt/local/var/macports/build/_opt_local_var_macports_sources_rsync.macports.org_release_tarballs_ports_lang_libomp/libomp/work/openmp-11.0.0.src/runtime/src/kmp_os.h:1040:37: error: no member named 'atomic' in namespace 'std'; did you mean 'atoi'?
:info:build bool __kmp_atomic_compare_store_rel(std::atomic<T> *p, T expected, T desired) {
:info:build ^~~~~~~~~~~
:info:build atoi
:info:build /usr/include/stdlib.h:132:6: note: 'atoi' declared here
:info:build int atoi(const char *);
:info:build ^
:info:build In file included from /opt/local/var/macports/build/_opt_local_var_macports_sources_rsync.macports.org_release_tarballs_ports_lang_libomp/libomp/work/openmp-11.0.0.src/runtime/src/kmp_alloc.cpp:13:
:info:build In file included from /opt/local/var/macports/build/_opt_local_var_macports_sources_rsync.macports.org_release_tarballs_ports_lang_libomp/libomp/work/openmp-11.0.0.src/runtime/src/kmp.h:79:
:info:build /opt/local/var/macports/build/_opt_local_var_macports_sources_rsync.macports.org_release_tarballs_ports_lang_libomp/libomp/work/openmp-11.0.0.src/runtime/src/kmp_os.h:1040:49: error: 'T' does not refer to a value
:info:build bool __kmp_atomic_compare_store_rel(std::atomic<T> *p, T expected, T desired) {
:info:build ^
:info:build :/opt/local/var/macports/build/_opt_local_var_macports_sources_rsync.macports.org_release_tarballs_ports_lang_libomp/libomp/work/openmp-11.0.0.src/runtime/src/kmp_os.h1039::103920::20 :note : notedeclared here:
:info:build declared here
:info:build template <typename T>template <typename T>
:info:build ^ ^
:info:build /opt/local/var/macports/build/_opt_local_var_macports_sources_rsync.macports.org_release_tarballs_ports_lang_libomp/libomp/work/openmp-11.0.0.src/runtime/src/kmp_os.h:1040:53: error: use of undeclared identifier 'p'
:info:build bool __kmp_atomic_compare_store_rel(std::atomic<T> *p, T expected, T desired) {
:info:build ^
:info:build /opt/local/var/macports/build/_opt_local_var_macports_sources_rsync.macports.org_release_tarballs_ports_lang_libomp/libomp/work/openmp-11.0.0.src/runtime/src/kmp_os.h:1040:78: error: expected ';' at end of declaration
:info:build bool __kmp_atomic_compare_store_rel(std::atomic<T> *p, T expected, T desired) {
:info:build ^
:info:build ;
:info:build /opt/local/var/macports/build/_opt_local_var_macports_sources_rsync.macports.org_release_tarballs_ports_lang_libomp/libomp/work/openmp-11.0.0.src/runtime/src/kmp_os.h:1040:79: error: /opt/local/var/macports/build/_opt_local_var_macports_sources_rsync.macports.org_release_tarballs_ports_lang_libomp/libomp/work/openmp-11.0.0.src/runtime/src/kmp_os.h:1040 ^
:info:build expected unqualified-id
:info:build /opt/local/var/macports/build/_opt_local_var_macports_sources_rsync.macports.org_release_tarballs_ports_lang_libomp/libomp/work/openmp-11.0.0.src/runtime/src/kmp_os.h:1040:53: error: use of undeclared identifier 'p'
:info:build bool __kmp_atomic_compare_store_rel(std::atomic<T> *p, T expected, T desired) {
:info:build ^
:info:build bool __kmp_atomic_compare_store_rel(std::atomic<T> *p, T expected, T desired) {
:info:build ^
:info:build /opt/local/var/macports/build/_opt_local_var_macports_sources_rsync.macports.org_release_tarballs_ports_lang_libomp/libomp/work/openmp-11.0.0.src/runtime/src/kmp_os.h:1040:78: error: expected ';' at end of declaration
:info:build /opt/local/var/macports/build/_opt_local_var_macports_sources_rsync.macports.org_release_tarballs_ports_lang_libomp/libomp/work/openmp-11.0.0.src/runtime/src/kmp_os.h:1040:6: warning: variable templates are a C++1y extension [-Wc++1y-extensions]
:info:build bool __kmp_atomic_compare_store_rel(std::atomic<T> *p, T expected, T desired) {
:info:build ^
:info:build ;
:info:build /opt/local/var/macports/build/_opt_local_var_macports_sources_rsync.macports.org_release_tarballs_ports_lang_libomp/libomp/work/openmp-11.0.0.src/runtime/src/kmp_os.h:1040:79: error: expected unqualified-id
:info:build bool __kmp_atomic_compare_store_rel(std::atomic<T> *p, T expected, T desired) {
:info:build ^
:info:build bool __kmp_atomic_compare_store_rel(std::atomic<T> *p, T expected, T desired) {
:info:build ^
:info:build /opt/local/var/macports/build/_opt_local_var_macports_sources_rsync.macports.org_release_tarballs_ports_lang_libomp/libomp/work/openmp-11.0.0.src/runtime/src/kmp_os.h:53: error: use of undeclared identifier 'p'
:info:build /opt/local/var/macports/build/_opt_local_var_macports_sources_rsync.macports.org_release_tarballs_ports_lang_libomp/libomp/work/openmp-11.0.0.src/runtime/src/kmp_os.h:1040:53: error: use of undeclared identifier 'p'
:info:build bool __kmp_atomic_compare_store_rel(std::atomic<T> *p, T expected, T desired) {
:info:build ^
:info:build /opt/local/var/macports/build/_opt_local_var_macports_sources_rsync.macports.org_release_tarballs_ports_lang_libomp/libomp/work/openmp-11.0.0.src/runtime/src/kmp_os.h:1040:78: error: expected ';' at end of declarationbool __kmp_atomic_compare_store_rel(std::atomic<T> *p, T expected, T desired) {
:info:build ^
:info:build /opt/local/var/macports/build/_opt_local_var_macports_sources_rsync.macports.org_release_tarballs_ports_lang_libomp/libomp/work/openmp-11.0.0.src/runtime/src/kmp_os.h:1040:78: error: expected ';' at end of declaration
:info:build bool __kmp_atomic_compare_store_rel(std::atomic<T> *p, T expected, T desired) {
:info:build ^
:info:build ;
:info:build /opt/local/var/macports/build/_opt_local_var_macports_sources_rsync.macports.org_release_tarballs_ports_lang_libomp/libomp/work/openmp-11.0.0.src/runtime/src/kmp_os.h:1040:79: error: expected unqualified-id:1040:bool __kmp_atomic_compare_store_rel(std::atomic<T> *p, T expected, T desired) {
:info:build 53 ^:
:info:build ;error
:info:build : use of undeclared identifier 'p'
:info:build /opt/local/var/macports/build/_opt_local_var_macports_sources_rsync.macports.org_release_tarballs_ports_lang_libomp/libomp/work/openmp-11.0.0.src/runtime/src/kmp_os.h:1040:79: error: expected unqualified-id
:info:build bool __kmp_atomic_compare_store_rel(std::atomic<T> *p, T expected, T desired) {
:info:build ^
:info:build bool __kmp_atomic_compare_store_rel(std::atomic<T> *p, T expected, T desired) {
:info:build ^/opt/local/var/macports/build/_opt_local_var_macports_sources_rsync.macports.org_release_tarballs_ports_lang_libomp/libomp/work/openmp-11.0.0.src/runtime/src/kmp_os.h
:info:build :1040:78: error: expected ';' at end of declaration
:info:build bool __kmp_atomic_compare_store_rel(std::atomic<T> *p, T expected, T desired) {
:info:build ^
:info:build ;
:info:build /opt/local/var/macports/build/_opt_local_var_macports_sources_rsync.macports.org_release_tarballs_ports_lang_libomp/libomp/work/openmp-11.0.0.src/runtime/src/kmp_os.h:1040:79: error: expected unqualified-id
:info:build bool __kmp_atomic_compare_store_rel(std::atomic<T> *p, T expected, T desired) {
:info:build ^
:info:build bool __kmp_atomic_compare_store_rel(std::atomic<T> *p, T expected, T desired) {
:info:build ^
:info:build /opt/local/var/macports/build/_opt_local_var_macports_sources_rsync.macports.org_release_tarballs_ports_lang_libomp/libomp/work/openmp-11.0.0.src/runtime/src/kmp_os.h:1040:37: error: no member named 'atomic' in namespace 'std'; did you mean 'atoi'?
:info:build bool __kmp_atomic_compare_store_rel(std::atomic<T> *p, T expected, T desired) {
:info:build ^~~~~~~~~~~
:info:build atoi
:info:build /usr/include/stdlib.h:132:6: note: 'atoi' declared here
:info:build int atoi(const char *);
:info:build ^
:info:build In file included from /opt/local/var/macports/build/_opt_local_var_macports_sources_rsync.macports.org_release_tarballs_ports_lang_libomp/libomp/work/openmp-11.0.0.src/runtime/src/kmp_itt.cpp:16:
:info:build In file included from /opt/local/var/macports/build/_opt_local_var_macports_sources_rsync.macports.org_release_tarballs_ports_lang_libomp/libomp/work/openmp-11.0.0.src/runtime/src/kmp_itt.h:17:
:info:build In file included from /opt/local/var/macports/build/_opt_local_var_macports_sources_rsync.macports.org_release_tarballs_ports_lang_libomp/libomp/work/openmp-11.0.0.src/runtime/src/kmp_lock.h:20:
:info:build /opt/local/var/macports/build/_opt_local_var_macports_sources_rsync.macports.org_release_tarballs_ports_lang_libomp/libomp/work/openmp-11.0.0.src/runtime/src/kmp_os.h:1040:49: error: 'T' does not refer to a value
:info:build bool __kmp_atomic_compare_store_rel(std::atomic<T> *p, T expected, T desired) {
:info:build ^
:info:build /opt/local/var/macports/build/_opt_local_var_macports_sources_rsync.macports.org_release_tarballs_ports_lang_libomp/libomp/work/openmp-11.0.0.src/runtime/src/kmp_os.h:1039:20: note: declared here
:info:build template <typename T>
:info:build ^
:info:build /opt/local/var/macports/build/_opt_local_var_macports_sources_rsync.macports.org_release_tarballs_ports_lang_libomp/libomp/work/openmp-11.0.0.src/runtime/src/kmp_os.h:1040:53: error: use of undeclared identifier 'p'
:info:build bool __kmp_atomic_compare_store_rel(std::atomic<T> *p, T expected, T desired) {
:info:build ^
:info:build /opt/local/var/macports/build/_opt_local_var_macports_sources_rsync.macports.org_release_tarballs_ports_lang_libomp/libomp/work/openmp-11.0.0.src/runtime/src/kmp_os.h:1040:78: error: expected ';' at end of declaration
:info:build bool __kmp_atomic_compare_store_rel(std::atomic<T> *p, T expected, T desired) {
:info:build ^
:info:build ;
:info:build /opt/local/var/macports/build/_opt_local_var_macports_sources_rsync.macports.org_release_tarballs_ports_lang_libomp/libomp/work/openmp-11.0.0.src/runtime/src/kmp_os.h:1040:79: error: expected unqualified-id
:info:build bool __kmp_atomic_compare_store_rel(std::atomic<T> *p, T expected, T desired) {
:info:build ^
:info:build /opt/local/var/macports/build/_opt_local_var_macports_sources_rsync.macports.org_release_tarballs_ports_lang_libomp/libomp/work/openmp-11.0.0.src/runtime/src/kmp_os.h:1040:37: error: no member named 'atomic' in namespace 'std'; did you mean 'atoi'?
:info:build bool __kmp_atomic_compare_store_rel(std::atomic<T> *p, T expected, T desired) {
:info:build ^~~~~~~~~~~
:info:build atoi
:info:build /usr/include/stdlib.h:132:6: note: 'atoi' declared here
:info:build /opt/local/var/macports/build/_opt_local_var_macports_sources_rsync.macports.org_release_tarballs_ports_lang_libomp/libomp/work/openmp-11.0.0.src/runtime/src/kmp_os.h:1040:6: int atoi(const char *);warning
:info:build : ^variable templates are a C++1y extension [-Wc++1y-extensions]
:info:build In file included from /opt/local/var/macports/build/_opt_local_var_macports_sources_rsync.macports.org_release_tarballs_ports_lang_libomp/libomp/work/openmp-11.0.0.src/runtime/src/kmp_global.cpp:13:
:info:build In file included from /opt/local/var/macports/build/_opt_local_var_macports_sources_rsync.macports.org_release_tarballs_ports_lang_libomp/libomp/work/openmp-11.0.0.src/runtime/src/kmp.h:79:
:info:build /opt/local/var/macports/build/_opt_local_var_macports_sources_rsync.macports.org_release_tarballs_ports_lang_libomp/libomp/work/openmp-11.0.0.src/runtime/src/kmp_os.h:1040:49: error: 'T' does not refer to a value
:info:build bool __kmp_atomic_compare_store_rel(std::atomic<T> *p, T expected, T desired) {
:info:build ^
:info:build bool __kmp_atomic_compare_store_rel(std::atomic<T> *p, T expected, T desired) {
:info:build ^
:info:build /opt/local/var/macports/build/_opt_local_var_macports_sources_rsync.macports.org_release_tarballs_ports_lang_libomp/libomp/work/openmp-11.0.0.src/runtime/src/kmp_os.h:1039:20: note: declared here
:info:build template <typename T>
:info:build ^
:info:build /opt/local/var/macports/build/_opt_local_var_macports_sources_rsync.macports.org_release_tarballs_ports_lang_libomp/libomp/work/openmp-11.0.0.src/runtime/src/kmp_os.h:1040:53: error: use of undeclared identifier 'p'
:info:build bool __kmp_atomic_compare_store_rel(std::atomic<T> *p, T expected, T desired) {
:info:build ^
:info:build /opt/local/var/macports/build/_opt_local_var_macports_sources_rsync.macports.org_release_tarballs_ports_lang_libomp/libomp/work/openmp-11.0.0.src/runtime/src/kmp_os.h:1040:78: error: expected ';' at end of declaration
:info:build bool __kmp_atomic_compare_store_rel(std::atomic<T> *p, T expected, T desired) {
:info:build ^
:info:build ;
:info:build /opt/local/var/macports/build/_opt_local_var_macports_sources_rsync.macports.org_release_tarballs_ports_lang_libomp/libomp/work/openmp-11.0.0.src/runtime/src/kmp_os.h:1040:79: error: expected unqualified-id
:info:build bool __kmp_atomic_compare_store_rel(std::atomic<T> *p, T expected, T desired) {
:info:build ^
:info:build In file included from /opt/local/var/macports/build/_opt_local_var_macports_sources_rsync.macports.org_release_tarballs_ports_lang_libomp/libomp/work/openmp-11.0.0.src/runtime/src/kmp_atomic.cpp:13:
:info:build In file included from /opt/local/var/macports/build/_opt_local_var_macports_sources_rsync.macports.org_release_tarballs_ports_lang_libomp/libomp/work/openmp-11.0.0.src/runtime/src/kmp_atomic.h:16:
:info:build /opt/local/var/macports/build/_opt_local_var_macports_sources_rsync.macports.org_release_tarballs_ports_lang_libomp/libomp/work/openmp-11.0.0.src/runtime/src/kmp_lock.h:123:8: error: no type named 'atomic' in namespace 'std'
:info:build std::atomic<kmp_int32> poll;
:info:build ~~~~~^
:info:build /opt/local/var/macports/build/_opt_local_var_macports_sources_rsync.macports.org_release_tarballs_ports_lang_libomp/libomp/work/openmp-11.0.0.src/runtime/src/kmp_lock.h:123:14: error: expected member name or ';' after declaration specifiers
:info:build std::atomic<kmp_int32> poll;
:info:build ~~~~~~~~~~~^
:info:build /opt/local/var/macports/build/_opt_local_var_macports_sources_rsync.macports.org_release_tarballs_ports_lang_libomp/libomp/work/openmp-11.0.0.src/runtime/src/kmp_os.h:1040:37: error: no member named 'atomic' in namespace 'std'; did you mean 'atoi'?
:info:build In file included from /opt/local/var/macports/build/_opt_local_var_macports_sources_rsync.macports.org_release_tarballs_ports_lang_libomp/libomp/work/openmp-11.0.0.src/runtime/src/kmp_itt.cpp:16:
:info:build In file included from /opt/local/var/macports/build/_opt_local_var_macports_sources_rsync.macports.org_release_tarballs_ports_lang_libomp/libomp/work/openmp-11.0.0.src/runtime/src/kmp_itt.h:17:
:info:build /opt/local/var/macports/build/_opt_local_var_macports_sources_rsync.macports.org_release_tarballs_ports_lang_libomp/libomp/work/openmp-11.0.0.src/runtime/src/kmp_lock.h:123:8: error: no type named 'atomic' in namespace 'std'
:info:build std::atomic<kmp_int32> poll;
:info:build ~~~~~^
:info:build /opt/local/var/macports/build/_opt_local_var_macports_sources_rsync.macports.org_release_tarballs_ports_lang_libomp/libomp/work/openmp-11.0.0.src/runtime/src/kmp_lock.h:123:14: error: expected member name or ';' after declaration specifiers
:info:build bool __kmp_atomic_compare_store_rel(std::atomic<T> *p, T expected, T desired) {
:info:build ^~~~~~~~~~~
:info:build atoi
:info:build std::atomic<kmp_int32> poll;/usr/include/stdlib.h:
:info:build ~~~~~~~~~~~^
:info:build 132:6: note: 'atoi' declared here
:info:build int atoi(const char *);
:info:build ^
:info:build In file included from /opt/local/var/macports/build/_opt_local_var_macports_sources_rsync.macports.org_release_tarballs_ports_lang_libomp/libomp/work/openmp-11.0.0.src/runtime/src/kmp_error.cpp:13:
:info:build In file included from /opt/local/var/macports/build/_opt_local_var_macports_sources_rsync.macports.org_release_tarballs_ports_lang_libomp/libomp/work/openmp-11.0.0.src/runtime/src/kmp.h:79:
:info:build /opt/local/var/macports/build/_opt_local_var_macports_sources_rsync.macports.org_release_tarballs_ports_lang_libomp/libomp/work/openmp-11.0.0.src/runtime/src/kmp_os.h:1040:49: error: 'T' does not refer to a value
:info:build bool __kmp_atomic_compare_store_rel(std::atomic<T> *p, T expected, T desired) {
:info:build ^
:info:build /opt/local/var/macports/build/_opt_local_var_macports_sources_rsync.macports.org_release_tarballs_ports_lang_libomp/libomp/work/openmp-11.0.0.src/runtime/src/kmp_os.h:1039:20: note: declared here
:info:build template <typename T>
:info:build ^
:info:build /opt/local/var/macports/build/_opt_local_var_macports_sources_rsync.macports.org_release_tarballs_ports_lang_libomp/libomp/work/openmp-11.0.0.src/runtime/src/kmp_os.h:1040:53: error: use of undeclared identifier 'p'
:info:build bool __kmp_atomic_compare_store_rel(std::atomic<T> *p, T expected, T desired) {
:info:build ^
:info:build /opt/local/var/macports/build/_opt_local_var_macports_sources_rsync.macports.org_release_tarballs_ports_lang_libomp/libomp/work/openmp-11.0.0.src/runtime/src/kmp_os.h:1040:78: error: expected ';' at end of declaration
:info:build bool __kmp_atomic_compare_store_rel(std::atomic<T> *p, T expected, T desired) {
:info:build ^
:info:build ;
:info:build /opt/local/var/macports/build/_opt_local_var_macports_sources_rsync.macports.org_release_tarballs_ports_lang_libomp/libomp/work/openmp-11.0.0.src/runtime/src/kmp_os.h:1040:79: error: expected unqualified-id
:info:build bool __kmp_atomic_compare_store_rel(std::atomic<T> *p, T expected, T desired) {
:info:build ^
:info:build /opt/local/var/macports/build/_opt_local_var_macports_sources_rsync.macports.org_release_tarballs_ports_lang_libomp/libomp/work/openmp-11.0.0.src/runtime/src/kmp_lock.h:243:8: error: no type named 'atomic' in namespace 'std'
:info:build std::atomic<bool> initialized;
:info:build ~~~~~^
:info:build fatal error: too many errors emitted, stopping now [-ferror-limit=]
:info:build /opt/local/var/macports/build/_opt_local_var_macports_sources_rsync.macports.org_release_tarballs_ports_lang_libomp/libomp/work/openmp-11.0.0.src/runtime/src/kmp_lock.h:243:8: error: no type named 'atomic' in namespace 'std'
:info:build std::atomic<bool> initialized;
:info:build ~~~~~^
:info:build fatal error: too many errors emitted, stopping now [-ferror-limit=]
:info:build In file included from /opt/local/var/macports/build/_opt_local_var_macports_sources_rsync.macports.org_release_tarballs_ports_lang_libomp/libomp/work/openmp-11.0.0.src/runtime/src/kmp_global.cpp:13:
:info:build In file included from /opt/local/var/macports/build/_opt_local_var_macports_sources_rsync.macports.org_release_tarballs_ports_lang_libomp/libomp/work/openmp-11.0.0.src/runtime/src/kmp.hIn file included from /opt/local/var/macports/build/_opt_local_var_macports_sources_rsync.macports.org_release_tarballs_ports_lang_libomp/libomp/work/openmp-11.0.0.src/runtime/src/kmp_debug.cpp::114:
:info:build /opt/local/var/macports/build/_opt_local_var_macports_sources_rsync.macports.org_release_tarballs_ports_lang_libomp/libomp/work/openmp-11.0.0.src/runtime/src/kmp_lock.h:123:8: errorIn file included from /opt/local/var/macports/build/_opt_local_var_macports_sources_rsync.macports.org_release_tarballs_ports_lang_libomp/libomp/work/openmp-11.0.0.src/runtime/src/kmp_environment.cpp: no type named 'atomic' in namespace 'std':
:info:build 53:
:info:build In file included from /opt/local/var/macports/build/_opt_local_var_macports_sources_rsync.macports.org_release_tarballs_ports_lang_libomp/libomp/work/openmp-11.0.0.src/runtime/src/kmp.h:114:
:info:build /opt/local/var/macports/build/_opt_local_var_macports_sources_rsync.macports.org_release_tarballs_ports_lang_libomp/libomp/work/openmp-11.0.0.src/runtime/src/kmp_lock.h: std::atomic<kmp_int32> poll;
:info:build 13 ~~~~~^
:info:build 123:8: error: no type named 'atomic' in namespace 'std'
:info:build :
:info:build In file included from /opt/local/var/macports/build/_opt_local_var_macports_sources_rsync.macports.org_release_tarballs_ports_lang_libomp/libomp/work/openmp-11.0.0.src/runtime/src/kmp.h:114:
:info:build /opt/local/var/macports/build/_opt_local_var_macports_sources_rsync.macports.org_release_tarballs_ports_lang_libomp/libomp/work/openmp-11.0.0.src/runtime/src/kmp_lock.h:123:8: error: no type named 'atomic' in namespace 'std'
:info:build std::atomic<kmp_int32> poll;
:info:build ~~~~~^
:info:build /opt/local/var/macports/build/_opt_local_var_macports_sources_rsync.macports.org_release_tarballs_ports_lang_libomp/libomp/work/openmp-11.0.0.src/runtime/src/kmp_lock.h: std::atomic<kmp_int32> poll;123
:info:build : ~~~~~^
:info:build /opt/local/var/macports/build/_opt_local_var_macports_sources_rsync.macports.org_release_tarballs_ports_lang_libomp/libomp/work/openmp-11.0.0.src/runtime/src/kmp_lock.h:123:14:/opt/local/var/macports/build/_opt_local_var_macports_sources_rsync.macports.org_release_tarballs_ports_lang_libomp/libomp/work/openmp-11.0.0.src/runtime/src/kmp_lock.h:14123:: 14error:: expected member name or ';' after declaration specifierserror
:info:build : expected member name or ';' after declaration specifiers
:info:build std::atomic<kmp_int32> poll;
:info:build error: ~~~~~~~~~~~^expected member name or ';' after declaration specifiers
:info:build std::atomic<kmp_int32> poll;
:info:build std::atomic<kmp_int32> poll;
:info:build ~~~~~~~~~~~^
:info:build In file included from /opt/local/var/macports/build/_opt_local_var_macports_sources_rsync.macports.org_release_tarballs_ports_lang_libomp/libomp/work/openmp-11.0.0.src/runtime/src/kmp_alloc.cpp:13:
:info:build In file included from /opt/local/var/macports/build/_opt_local_var_macports_sources_rsync.macports.org_release_tarballs_ports_lang_libomp/libomp/work/openmp-11.0.0.src/runtime/src/kmp.h:114:
:info:build /opt/local/var/macports/build/_opt_local_var_macports_sources_rsync.macports.org_release_tarballs_ports_lang_libomp/libomp/work/openmp-11.0.0.src/runtime/src/kmp_lock.h:123:8: error: no type named 'atomic' in namespace 'std'
:info:build std::atomic<kmp_int32> poll;
:info:build ~~~~~^
:info:build /opt/local/var/macports/build/_opt_local_var_macports_sources_rsync.macports.org_release_tarballs_ports_lang_libomp/libomp/work/openmp-11.0.0.src/runtime/src/kmp_lock.h:123:14: error: expected member name or ';' after declaration specifiers
:info:build std::atomic<kmp_int32> poll;
:info:build ~~~~~~~~~~~^
:info:build ~~~~~~~~~~~^
:info:build /opt/local/var/macports/build/_opt_local_var_macports_sources_rsync.macports.org_release_tarballs_ports_lang_libomp/libomp/work/openmp-11.0.0.src/runtime/src/kmp_lock.h:243:8: error: no type named 'atomic' in namespace 'std'
:info:build std::atomic<bool> initialized;
:info:build ~~~~~^
:info:build fatal error: too many errors emitted, stopping now [-ferror-limit=]
:info:build /opt/local/var/macports/build/_opt_local_var_macports_sources_rsync.macports.org_release_tarballs_ports_lang_libomp/libomp/work/openmp-11.0.0.src/runtime/src/kmp_lock.h:243:8: error: no type named 'atomic' in namespace 'std'
:info:build std::atomic<bool> initialized;
:info:build ~~~~~^
:info:build fatal error: too many errors emitted, stopping now [-ferror-limit=]
:info:build /opt/local/var/macports/build/_opt_local_var_macports_sources_rsync.macports.org_release_tarballs_ports_lang_libomp/libomp/work/openmp-11.0.0.src/runtime/src/kmp_lock.h:243:8: error: no type named 'atomic' in namespace 'std'
:info:build std::atomic<bool> initialized;
:info:build ~~~~~^
:info:build fatal error: too many errors emitted, stopping now [-ferror-limit=]
:info:build In file included from /opt/local/var/macports/build/_opt_local_var_macports_sources_rsync.macports.org_release_tarballs_ports_lang_libomp/libomp/work/openmp-11.0.0.src/runtime/src/kmp_error.cpp:13:
:info:build In file included from /opt/local/var/macports/build/_opt_local_var_macports_sources_rsync.macports.org_release_tarballs_ports_lang_libomp/libomp/work/openmp-11.0.0.src/runtime/src/kmp.h:114:
:info:build /opt/local/var/macports/build/_opt_local_var_macports_sources_rsync.macports.org_release_tarballs_ports_lang_libomp/libomp/work/openmp-11.0.0.src/runtime/src/kmp_lock.h:123:8: error: no type named 'atomic' in namespace 'std'
:info:build std::atomic<kmp_int32> poll;
:info:build ~~~~~^
:info:build /opt/local/var/macports/build/_opt_local_var_macports_sources_rsync.macports.org_release_tarballs_ports_lang_libomp/libomp/work/openmp-11.0.0.src/runtime/src/kmp_lock.h:123:14: error: expected member name or ';' after declaration specifiers
:info:build std::atomic<kmp_int32> poll;
:info:build ~~~~~~~~~~~^In file included from /opt/local/var/macports/build/_opt_local_var_macports_sources_rsync.macports.org_release_tarballs_ports_lang_libomp/libomp/work/openmp-11.0.0.src/runtime/src/kmp_csupport.cpp:15:
:info:build In file included from /opt/local/var/macports/build/_opt_local_var_macports_sources_rsync.macports.org_release_tarballs_ports_lang_libomp/libomp/work/openmp-11.0.0.src/runtime/src/kmp.h:114:
:info:build /opt/local/var/macports/build/_opt_local_var_macports_sources_rsync.macports.org_release_tarballs_ports_lang_libomp/libomp/work/openmp-11.0.0.src/runtime/src/kmp_lock.h:123:8: error: no type named 'atomic' in namespace 'std'
:info:build std::atomic<kmp_int32> poll;
:info:build ~~~~~^
:info:build /opt/local/var/macports/build/_opt_local_var_macports_sources_rsync.macports.org_release_tarballs_ports_lang_libomp/libomp/work/openmp-11.0.0.src/runtime/src/kmp_lock.h:123:14: error: expected member name or ';' after declaration specifiers
:info:build std::atomic<kmp_int32> poll;
:info:build ~~~~~~~~~~~^
:info:build /opt/local/var/macports/build/_opt_local_var_macports_sources_rsync.macports.org_release_tarballs_ports_lang_libomp/libomp/work/openmp-11.0.0.src/runtime/src/kmp_lock.h:243:8: error: no type named 'atomic' in namespace 'std'
:info:build std::atomic<bool> initialized;
:info:build ~~~~~^
:info:build fatal error: too many errors emitted, stopping now [-ferror-limit=]
:info:build /opt/local/var/macports/build/_opt_local_var_macports_sources_rsync.macports.org_release_tarballs_ports_lang_libomp/libomp/work/openmp-11.0.0.src/runtime/src/kmp_lock.h:243:8: error: no type named 'atomic' in namespace 'std'
:info:build std::atomic<bool> initialized;
:info:build ~~~~~^
:info:build fatal error: too many errors emitted, stopping now [-ferror-limit=]
:info:build /opt/local/var/macports/build/_opt_local_var_macports_sources_rsync.macports.org_release_tarballs_ports_lang_libomp/libomp/work/openmp-11.0.0.src/runtime/src/kmp_lock.h:243:8: error: no type named 'atomic' in namespace 'std'
:info:build std::atomic<bool> initialized;
:info:build ~~~~~^
:info:build fatal error: too many errors emitted, stopping now [-ferror-limit=]
:info:build 3 warnings and 20 errors generated.
:info:build 3 warnings and 20 errors generated.
:info:build make[2]: *** [runtime/src/CMakeFiles/omp.dir/kmp_debug.cpp.o] Error 1
:info:build make[2]: *** Waiting for unfinished jobs....
:info:build 3 warnings and 20 errors generated.
:info:build 3 warnings and 20 errors generated.
:info:build make[2]: *** [runtime/src/CMakeFiles/omp.dir/kmp_environment.cpp.o] Error 1
:info:build make[2]: *** [runtime/src/CMakeFiles/omp.dir/kmp_global.cpp.o] Error 1
:info:build make[2]: *** [runtime/src/CMakeFiles/omp.dir/kmp_error.cpp.o] Error 1
:info:build 3 warnings and 20 errors generated.
:info:build make[2]: *** [runtime/src/CMakeFiles/omp.dir/kmp_alloc.cpp.o] Error 1
:info:build 3 warnings and 20 errors generated.
:info:build make[2]: *** [runtime/src/CMakeFiles/omp.dir/kmp_itt.cpp.o] Error 1
:info:build 3 warnings and 20 errors generated.
:info:build make[2]: *** [runtime/src/CMakeFiles/omp.dir/kmp_csupport.cpp.o] Error 1
:info:build 3 warnings and 20 errors generated.
:info:build make[2]: *** [runtime/src/CMakeFiles/omp.dir/kmp_atomic.cpp.o] Error 1
:info:build make[2]: Leaving directory `/opt/local/var/macports/build/_opt_local_var_macports_sources_rsync.macports.org_release_tarballs_ports_lang_libomp/libomp/work/build-x86_64'
:info:build make[1]: *** [runtime/src/CMakeFiles/omp.dir/all] Error 2
:info:build make[1]: Leaving directory `/opt/local/var/macports/build/_opt_local_var_macports_sources_rsync.macports.org_release_tarballs_ports_lang_libomp/libomp/work/build-x86_64'
:info:build make: *** [all] Error 2
:info:build make: Leaving directory `/opt/local/var/macports/build/_opt_local_var_macports_sources_rsync.macports.org_release_tarballs_ports_lang_libomp/libomp/work/build-x86_64'
:info:build Command failed: cd "/opt/local/var/macports/build/_opt_local_var_macports_sources_rsync.macports.org_release_tarballs_ports_lang_libomp/libomp/work/build-x86_64" && /usr/bin/make -j8 -w all VERBOSE=ON
:info:build Exit code: 2
:error:build Failed to build libomp: command execution failed
:debug:build Error code: NONE
:debug:build Backtrace: command execution failed
:debug:build while executing
:debug:build "$procedure $targetname"
:error:build See /opt/local/var/macports/logs/_opt_local_var_macports_sources_rsync.macports.org_release_tarballs_ports_lang_libomp/libomp/main.log for details.
Sign up for free to join this conversation on GitHub. Already have an account? Sign in to comment