Skip to content

Instantly share code, notes, and snippets.

@kinow kinow/log.txt
Created May 12, 2017

Embed
What would you like to do?
Error for Commons Compress ZIP integration tests
-------------------------------------------------------
T E S T S
-------------------------------------------------------
Running org.apache.commons.compress.archivers.zip.Zip64SupportIT
Tests run: 79, Failures: 16, Errors: 0, Skipped: 0, Time elapsed: 771.153 sec <<< FAILURE! - in org.apache.commons.compress.archivers.zip.Zip64SupportIT
writeSmallStoredEntryKnownSizeToFileModeAlways(org.apache.commons.compress.archivers.zip.Zip64SupportIT) Time elapsed: 0.101 sec <<< FAILURE!
org.junit.internal.ArrayComparisonFailure: arrays first differed at element [4]; expected:<64> but was:<-1>
at org.apache.commons.compress.archivers.zip.Zip64SupportIT.withTemporaryArchive(Zip64SupportIT.java:2323)
at org.apache.commons.compress.archivers.zip.Zip64SupportIT.writeSmallStoredEntryKnownSizeToFileModeAlways(Zip64SupportIT.java:1618)
Caused by: java.lang.AssertionError: expected:<64> but was:<-1>
at org.apache.commons.compress.archivers.zip.Zip64SupportIT.withTemporaryArchive(Zip64SupportIT.java:2323)
at org.apache.commons.compress.archivers.zip.Zip64SupportIT.writeSmallStoredEntryKnownSizeToFileModeAlways(Zip64SupportIT.java:1618)
writeBigDeflatedEntryUnknownSizeToStreamModeAlways(org.apache.commons.compress.archivers.zip.Zip64SupportIT) Time elapsed: 30.046 sec <<< FAILURE!
org.junit.internal.ArrayComparisonFailure: arrays first differed at element [14]; expected:<20> but was:<28>
at org.apache.commons.compress.archivers.zip.Zip64SupportIT.withTemporaryArchive(Zip64SupportIT.java:2323)
at org.apache.commons.compress.archivers.zip.Zip64SupportIT.writeBigDeflatedEntryUnknownSizeToStreamModeAlways(Zip64SupportIT.java:980)
Caused by: java.lang.AssertionError: expected:<20> but was:<28>
at org.apache.commons.compress.archivers.zip.Zip64SupportIT.withTemporaryArchive(Zip64SupportIT.java:2323)
at org.apache.commons.compress.archivers.zip.Zip64SupportIT.writeBigDeflatedEntryUnknownSizeToStreamModeAlways(Zip64SupportIT.java:980)
writeSmallDeflatedEntryKnownSizeToStreamModeAlways(org.apache.commons.compress.archivers.zip.Zip64SupportIT) Time elapsed: 0.008 sec <<< FAILURE!
org.junit.internal.ArrayComparisonFailure: arrays first differed at element [0]; expected:<64> but was:<-1>
at org.apache.commons.compress.archivers.zip.Zip64SupportIT.withTemporaryArchive(Zip64SupportIT.java:2323)
at org.apache.commons.compress.archivers.zip.Zip64SupportIT.writeSmallDeflatedEntryKnownSizeToStreamModeAlways(Zip64SupportIT.java:1963)
Caused by: java.lang.AssertionError: expected:<64> but was:<-1>
at org.apache.commons.compress.archivers.zip.Zip64SupportIT.withTemporaryArchive(Zip64SupportIT.java:2323)
at org.apache.commons.compress.archivers.zip.Zip64SupportIT.writeSmallDeflatedEntryKnownSizeToStreamModeAlways(Zip64SupportIT.java:1963)
writeSmallDeflatedEntryKnownSizeToFileModeAlways(org.apache.commons.compress.archivers.zip.Zip64SupportIT) Time elapsed: 0.009 sec <<< FAILURE!
org.junit.internal.ArrayComparisonFailure: arrays first differed at element [0]; expected:<64> but was:<-1>
at org.apache.commons.compress.archivers.zip.Zip64SupportIT.withTemporaryArchive(Zip64SupportIT.java:2323)
at org.apache.commons.compress.archivers.zip.Zip64SupportIT.writeSmallDeflatedEntryKnownSizeToFileModeAlways(Zip64SupportIT.java:2297)
Caused by: java.lang.AssertionError: expected:<64> but was:<-1>
at org.apache.commons.compress.archivers.zip.Zip64SupportIT.withTemporaryArchive(Zip64SupportIT.java:2323)
at org.apache.commons.compress.archivers.zip.Zip64SupportIT.writeSmallDeflatedEntryKnownSizeToFileModeAlways(Zip64SupportIT.java:2297)
writeBigDeflatedEntryKnownSizeToStreamModeAlways(org.apache.commons.compress.archivers.zip.Zip64SupportIT) Time elapsed: 29.764 sec <<< FAILURE!
org.junit.internal.ArrayComparisonFailure: arrays first differed at element [14]; expected:<20> but was:<28>
at org.apache.commons.compress.archivers.zip.Zip64SupportIT.withTemporaryArchive(Zip64SupportIT.java:2323)
at org.apache.commons.compress.archivers.zip.Zip64SupportIT.writeBigDeflatedEntryKnownSizeToStreamModeAlways(Zip64SupportIT.java:972)
Caused by: java.lang.AssertionError: expected:<20> but was:<28>
at org.apache.commons.compress.archivers.zip.Zip64SupportIT.withTemporaryArchive(Zip64SupportIT.java:2323)
at org.apache.commons.compress.archivers.zip.Zip64SupportIT.writeBigDeflatedEntryKnownSizeToStreamModeAlways(Zip64SupportIT.java:972)
writeBigDeflatedEntryKnownSizeToFileModeAlways(org.apache.commons.compress.archivers.zip.Zip64SupportIT) Time elapsed: 30.217 sec <<< FAILURE!
org.junit.internal.ArrayComparisonFailure: arrays first differed at element [14]; expected:<20> but was:<28>
at org.apache.commons.compress.archivers.zip.Zip64SupportIT.withTemporaryArchive(Zip64SupportIT.java:2323)
at org.apache.commons.compress.archivers.zip.Zip64SupportIT.writeBigDeflatedEntryKnownSizeToFileModeAlways(Zip64SupportIT.java:1198)
Caused by: java.lang.AssertionError: expected:<20> but was:<28>
at org.apache.commons.compress.archivers.zip.Zip64SupportIT.withTemporaryArchive(Zip64SupportIT.java:2323)
at org.apache.commons.compress.archivers.zip.Zip64SupportIT.writeBigDeflatedEntryKnownSizeToFileModeAlways(Zip64SupportIT.java:1198)
writeSmallStoredEntryToStreamModeAlways(org.apache.commons.compress.archivers.zip.Zip64SupportIT) Time elapsed: 0.031 sec <<< FAILURE!
org.junit.internal.ArrayComparisonFailure: arrays first differed at element [4]; expected:<64> but was:<-1>
at org.apache.commons.compress.archivers.zip.Zip64SupportIT.withTemporaryArchive(Zip64SupportIT.java:2323)
at org.apache.commons.compress.archivers.zip.Zip64SupportIT.writeSmallStoredEntryToStreamModeAlways(Zip64SupportIT.java:1611)
Caused by: java.lang.AssertionError: expected:<64> but was:<-1>
at org.apache.commons.compress.archivers.zip.Zip64SupportIT.withTemporaryArchive(Zip64SupportIT.java:2323)
at org.apache.commons.compress.archivers.zip.Zip64SupportIT.writeSmallStoredEntryToStreamModeAlways(Zip64SupportIT.java:1611)
write3EntriesCreatingBigArchiveFileModeAlways(org.apache.commons.compress.archivers.zip.Zip64SupportIT) Time elapsed: 20.286 sec <<< FAILURE!
org.junit.internal.ArrayComparisonFailure: arrays first differed at element [0]; expected:<80> but was:<-1>
at org.apache.commons.compress.archivers.zip.Zip64SupportIT.withTemporaryArchive(Zip64SupportIT.java:2323)
at org.apache.commons.compress.archivers.zip.Zip64SupportIT.write3EntriesCreatingBigArchiveFileModeAlways(Zip64SupportIT.java:472)
Caused by: java.lang.AssertionError: expected:<80> but was:<-1>
at org.apache.commons.compress.archivers.zip.Zip64SupportIT.withTemporaryArchive(Zip64SupportIT.java:2323)
at org.apache.commons.compress.archivers.zip.Zip64SupportIT.write3EntriesCreatingBigArchiveFileModeAlways(Zip64SupportIT.java:472)
writeSmallDeflatedEntryUnknownSizeToStreamModeAlways(org.apache.commons.compress.archivers.zip.Zip64SupportIT) Time elapsed: 0.007 sec <<< FAILURE!
org.junit.internal.ArrayComparisonFailure: arrays first differed at element [0]; expected:<64> but was:<-1>
at org.apache.commons.compress.archivers.zip.Zip64SupportIT.withTemporaryArchive(Zip64SupportIT.java:2323)
at org.apache.commons.compress.archivers.zip.Zip64SupportIT.writeSmallDeflatedEntryUnknownSizeToStreamModeAlways(Zip64SupportIT.java:1970)
Caused by: java.lang.AssertionError: expected:<64> but was:<-1>
at org.apache.commons.compress.archivers.zip.Zip64SupportIT.withTemporaryArchive(Zip64SupportIT.java:2323)
at org.apache.commons.compress.archivers.zip.Zip64SupportIT.writeSmallDeflatedEntryUnknownSizeToStreamModeAlways(Zip64SupportIT.java:1970)
writeBigStoredEntryKnownSizeToFileModeAlways(org.apache.commons.compress.archivers.zip.Zip64SupportIT) Time elapsed: 22.246 sec <<< FAILURE!
org.junit.internal.ArrayComparisonFailure: arrays first differed at element [14]; expected:<20> but was:<28>
at org.apache.commons.compress.archivers.zip.Zip64SupportIT.withTemporaryArchive(Zip64SupportIT.java:2323)
at org.apache.commons.compress.archivers.zip.Zip64SupportIT.writeBigStoredEntryKnownSizeToFileModeAlways(Zip64SupportIT.java:733)
Caused by: java.lang.AssertionError: expected:<20> but was:<28>
at org.apache.commons.compress.archivers.zip.Zip64SupportIT.withTemporaryArchive(Zip64SupportIT.java:2323)
at org.apache.commons.compress.archivers.zip.Zip64SupportIT.writeBigStoredEntryKnownSizeToFileModeAlways(Zip64SupportIT.java:733)
writeSmallDeflatedEntryUnknownSizeToFileModeAlways(org.apache.commons.compress.archivers.zip.Zip64SupportIT) Time elapsed: 0.034 sec <<< FAILURE!
org.junit.internal.ArrayComparisonFailure: arrays first differed at element [0]; expected:<64> but was:<-1>
at org.apache.commons.compress.archivers.zip.Zip64SupportIT.withTemporaryArchive(Zip64SupportIT.java:2323)
at org.apache.commons.compress.archivers.zip.Zip64SupportIT.writeSmallDeflatedEntryUnknownSizeToFileModeAlways(Zip64SupportIT.java:2304)
Caused by: java.lang.AssertionError: expected:<64> but was:<-1>
at org.apache.commons.compress.archivers.zip.Zip64SupportIT.withTemporaryArchive(Zip64SupportIT.java:2323)
at org.apache.commons.compress.archivers.zip.Zip64SupportIT.writeSmallDeflatedEntryUnknownSizeToFileModeAlways(Zip64SupportIT.java:2304)
writeBigStoredEntryToStreamModeAlways(org.apache.commons.compress.archivers.zip.Zip64SupportIT) Time elapsed: 22.885 sec <<< FAILURE!
org.junit.internal.ArrayComparisonFailure: arrays first differed at element [14]; expected:<20> but was:<28>
at org.apache.commons.compress.archivers.zip.Zip64SupportIT.withTemporaryArchive(Zip64SupportIT.java:2323)
at org.apache.commons.compress.archivers.zip.Zip64SupportIT.writeBigStoredEntryToStreamModeAlways(Zip64SupportIT.java:726)
Caused by: java.lang.AssertionError: expected:<20> but was:<28>
at org.apache.commons.compress.archivers.zip.Zip64SupportIT.withTemporaryArchive(Zip64SupportIT.java:2323)
at org.apache.commons.compress.archivers.zip.Zip64SupportIT.writeBigStoredEntryToStreamModeAlways(Zip64SupportIT.java:726)
writeSmallStoredEntryUnnownSizeToFileModeAlways(org.apache.commons.compress.archivers.zip.Zip64SupportIT) Time elapsed: 0.004 sec <<< FAILURE!
org.junit.internal.ArrayComparisonFailure: arrays first differed at element [4]; expected:<64> but was:<-1>
at org.apache.commons.compress.archivers.zip.Zip64SupportIT.withTemporaryArchive(Zip64SupportIT.java:2323)
at org.apache.commons.compress.archivers.zip.Zip64SupportIT.writeSmallStoredEntryUnnownSizeToFileModeAlways(Zip64SupportIT.java:1625)
Caused by: java.lang.AssertionError: expected:<64> but was:<-1>
at org.apache.commons.compress.archivers.zip.Zip64SupportIT.withTemporaryArchive(Zip64SupportIT.java:2323)
at org.apache.commons.compress.archivers.zip.Zip64SupportIT.writeSmallStoredEntryUnnownSizeToFileModeAlways(Zip64SupportIT.java:1625)
writeBigDeflatedEntryUnknownSizeToFileModeAlways(org.apache.commons.compress.archivers.zip.Zip64SupportIT) Time elapsed: 30.231 sec <<< FAILURE!
org.junit.internal.ArrayComparisonFailure: arrays first differed at element [14]; expected:<20> but was:<28>
at org.apache.commons.compress.archivers.zip.Zip64SupportIT.withTemporaryArchive(Zip64SupportIT.java:2323)
at org.apache.commons.compress.archivers.zip.Zip64SupportIT.writeBigDeflatedEntryUnknownSizeToFileModeAlways(Zip64SupportIT.java:1205)
Caused by: java.lang.AssertionError: expected:<20> but was:<28>
at org.apache.commons.compress.archivers.zip.Zip64SupportIT.withTemporaryArchive(Zip64SupportIT.java:2323)
at org.apache.commons.compress.archivers.zip.Zip64SupportIT.writeBigDeflatedEntryUnknownSizeToFileModeAlways(Zip64SupportIT.java:1205)
writeBigStoredEntryUnnownSizeToFileModeAlways(org.apache.commons.compress.archivers.zip.Zip64SupportIT) Time elapsed: 20.08 sec <<< FAILURE!
org.junit.internal.ArrayComparisonFailure: arrays first differed at element [14]; expected:<20> but was:<28>
at org.apache.commons.compress.archivers.zip.Zip64SupportIT.withTemporaryArchive(Zip64SupportIT.java:2323)
at org.apache.commons.compress.archivers.zip.Zip64SupportIT.writeBigStoredEntryUnnownSizeToFileModeAlways(Zip64SupportIT.java:740)
Caused by: java.lang.AssertionError: expected:<20> but was:<28>
at org.apache.commons.compress.archivers.zip.Zip64SupportIT.withTemporaryArchive(Zip64SupportIT.java:2323)
at org.apache.commons.compress.archivers.zip.Zip64SupportIT.writeBigStoredEntryUnnownSizeToFileModeAlways(Zip64SupportIT.java:740)
write3EntriesCreatingBigArchiveStreamModeAlways(org.apache.commons.compress.archivers.zip.Zip64SupportIT) Time elapsed: 20.524 sec <<< FAILURE!
org.junit.internal.ArrayComparisonFailure: arrays first differed at element [0]; expected:<80> but was:<-1>
at org.apache.commons.compress.archivers.zip.Zip64SupportIT.withTemporaryArchive(Zip64SupportIT.java:2323)
at org.apache.commons.compress.archivers.zip.Zip64SupportIT.write3EntriesCreatingBigArchiveStreamModeAlways(Zip64SupportIT.java:479)
Caused by: java.lang.AssertionError: expected:<80> but was:<-1>
at org.apache.commons.compress.archivers.zip.Zip64SupportIT.withTemporaryArchive(Zip64SupportIT.java:2323)
at org.apache.commons.compress.archivers.zip.Zip64SupportIT.write3EntriesCreatingBigArchiveStreamModeAlways(Zip64SupportIT.java:479)
Results :
Failed tests:
Zip64SupportIT.write3EntriesCreatingBigArchiveFileModeAlways:472->withTemporaryArchive:2323 arrays first differed at element [0]; expected:<80> but was:<-1>
Zip64SupportIT.write3EntriesCreatingBigArchiveStreamModeAlways:479->withTemporaryArchive:2323 arrays first differed at element [0]; expected:<80> but was:<-1>
Zip64SupportIT.writeBigDeflatedEntryKnownSizeToFileModeAlways:1198->withTemporaryArchive:2323 arrays first differed at element [14]; expected:<20> but was:<28>
Zip64SupportIT.writeBigDeflatedEntryKnownSizeToStreamModeAlways:972->withTemporaryArchive:2323 arrays first differed at element [14]; expected:<20> but was:<28>
Zip64SupportIT.writeBigDeflatedEntryUnknownSizeToFileModeAlways:1205->withTemporaryArchive:2323 arrays first differed at element [14]; expected:<20> but was:<28>
Zip64SupportIT.writeBigDeflatedEntryUnknownSizeToStreamModeAlways:980->withTemporaryArchive:2323 arrays first differed at element [14]; expected:<20> but was:<28>
Zip64SupportIT.writeBigStoredEntryKnownSizeToFileModeAlways:733->withTemporaryArchive:2323 arrays first differed at element [14]; expected:<20> but was:<28>
Zip64SupportIT.writeBigStoredEntryToStreamModeAlways:726->withTemporaryArchive:2323 arrays first differed at element [14]; expected:<20> but was:<28>
Zip64SupportIT.writeBigStoredEntryUnnownSizeToFileModeAlways:740->withTemporaryArchive:2323 arrays first differed at element [14]; expected:<20> but was:<28>
Zip64SupportIT.writeSmallDeflatedEntryKnownSizeToFileModeAlways:2297->withTemporaryArchive:2323 arrays first differed at element [0]; expected:<64> but was:<-1>
Zip64SupportIT.writeSmallDeflatedEntryKnownSizeToStreamModeAlways:1963->withTemporaryArchive:2323 arrays first differed at element [0]; expected:<64> but was:<-1>
Zip64SupportIT.writeSmallDeflatedEntryUnknownSizeToFileModeAlways:2304->withTemporaryArchive:2323 arrays first differed at element [0]; expected:<64> but was:<-1>
Zip64SupportIT.writeSmallDeflatedEntryUnknownSizeToStreamModeAlways:1970->withTemporaryArchive:2323 arrays first differed at element [0]; expected:<64> but was:<-1>
Zip64SupportIT.writeSmallStoredEntryKnownSizeToFileModeAlways:1618->withTemporaryArchive:2323 arrays first differed at element [4]; expected:<64> but was:<-1>
Zip64SupportIT.writeSmallStoredEntryToStreamModeAlways:1611->withTemporaryArchive:2323 arrays first differed at element [4]; expected:<64> but was:<-1>
Zip64SupportIT.writeSmallStoredEntryUnnownSizeToFileModeAlways:1625->withTemporaryArchive:2323 arrays first differed at element [4]; expected:<64> but was:<-1>
Tests run: 79, Failures: 16, Errors: 0, Skipped: 0
------
Sign up for free to join this conversation on GitHub. Already have an account? Sign in to comment
You can’t perform that action at this time.