Skip to content

Instantly share code, notes, and snippets.

@kulcsarm
Created November 6, 2023 17:37
Show Gist options
  • Save kulcsarm/e0c59e30892f79c9c3194698dc3dc453 to your computer and use it in GitHub Desktop.
Save kulcsarm/e0c59e30892f79c9c3194698dc3dc453 to your computer and use it in GitHub Desktop.
make.log
==========================================
See documentation/faq.html and documentation/bugreporting.html
for help with installation problems. Please send EVERYTHING
printed out below when reporting problems. Please check the
mailing list archives and consider subscribing.
https://petsc.org/release/community/mailing/
==========================================
Starting make run on vn01 at Mon, 06 Nov 2023 18:22:21 +0100
Machine characteristics: Linux vn01 4.18.0-372.9.1.el8.x86_64 #1 SMP Fri Apr 15 22:12:19 EDT 2022 x86_64 x86_64 x86_64 GNU/Linux
-----------------------------------------
Using PETSc directory: /home/p_mvgkm/p_mvgopt02/FreeFem/petsc
Using PETSc arch: arch-FreeFem-complex
-----------------------------------------
PETSC_VERSION_RELEASE 1
PETSC_VERSION_MAJOR 3
PETSC_VERSION_MINOR 20
PETSC_VERSION_SUBMINOR 1
PETSC_VERSION_DATE "unknown"
PETSC_VERSION_GIT "unknown"
PETSC_VERSION_DATE_GIT "unknown"
-----------------------------------------
Using configure Options: --with-mpi-dir=/opt/cray/pe/mpich/8.1.27/ofi/cray/16.0/ --with-fc=0 --download-f2cblaslapack --with-parmetis-dir=arch-FreeFem --with-metis-dir=arch-FreeFem --with-superlu-dir=arch-FreeFem --with-superlu_dist-dir=arch-FreeFem --download-slepc --download-hpddm --download-htool --with-ptscotch-dir=arch-FreeFem --with-suitesparse-dir=arch-FreeFem --with-tetgen-dir=arch-FreeFem --with-fortran-bindings=no --with-scalar-type=complex --with-debugging=no --with-packages-download-dir=/home/p_mvgkm/p_mvgopt02/FreeFem/buildetc
Using configuration flags:
#define PETSC_ARCH "arch-FreeFem-complex"
#define PETSC_ATTRIBUTEALIGNED(size) __attribute((aligned(size)))
#define PETSC_BLASLAPACK_UNDERSCORE 1
#define PETSC_CLANGUAGE_C 1
#define PETSC_CXX_RESTRICT __restrict
#define PETSC_DEPRECATED_ENUM_BASE(string_literal_why) __attribute__((deprecated(string_literal_why)))
#define PETSC_DEPRECATED_FUNCTION_BASE(string_literal_why) __attribute__((deprecated(string_literal_why)))
#define PETSC_DEPRECATED_MACRO_BASE(string_literal_why) PETSC_DEPRECATED_MACRO_BASE_(GCC warning string_literal_why)
#define PETSC_DEPRECATED_MACRO_BASE_(why) _Pragma(#why)
#define PETSC_DEPRECATED_OBJECT_BASE(string_literal_why) __attribute__((deprecated(string_literal_why)))
#define PETSC_DEPRECATED_TYPEDEF_BASE(string_literal_why) __attribute__((deprecated(string_literal_why)))
#define PETSC_DIR "/home/p_mvgkm/p_mvgopt02/FreeFem/petsc"
#define PETSC_DIR_SEPARATOR '/'
#define PETSC_FUNCTION_NAME_C __func__
#define PETSC_FUNCTION_NAME_CXX __func__
#define PETSC_HAVE_ACCESS 1
#define PETSC_HAVE_ATOLL 1
#define PETSC_HAVE_ATTRIBUTEALIGNED 1
#define PETSC_HAVE_BUILTIN_EXPECT 1
#define PETSC_HAVE_BZERO 1
#define PETSC_HAVE_C99_COMPLEX 1
#define PETSC_HAVE_CLOCK 1
#define PETSC_HAVE_CXX 1
#define PETSC_HAVE_CXX_ATOMIC 1
#define PETSC_HAVE_CXX_COMPLEX 1
#define PETSC_HAVE_CXX_COMPLEX_FIX 1
#define PETSC_HAVE_CXX_DIALECT_CXX11 1
#define PETSC_HAVE_CXX_DIALECT_CXX14 1
#define PETSC_HAVE_CXX_DIALECT_CXX17 1
#define PETSC_HAVE_CXX_DIALECT_CXX20 1
#define PETSC_HAVE_DLADDR 1
#define PETSC_HAVE_DLCLOSE 1
#define PETSC_HAVE_DLERROR 1
#define PETSC_HAVE_DLFCN_H 1
#define PETSC_HAVE_DLOPEN 1
#define PETSC_HAVE_DLSYM 1
#define PETSC_HAVE_DOUBLE_ALIGN_MALLOC 1
#define PETSC_HAVE_DRAND48 1
#define PETSC_HAVE_DYNAMIC_LIBRARIES 1
#define PETSC_HAVE_ERF 1
#define PETSC_HAVE_EXECUTABLE_EXPORT 1
#define PETSC_HAVE_F2CBLASLAPACK 1
#define PETSC_HAVE_FCNTL_H 1
#define PETSC_HAVE_FENV_H 1
#define PETSC_HAVE_FE_VALUES 1
#define PETSC_HAVE_FLOAT_H 1
#define PETSC_HAVE_FORK 1
#define PETSC_HAVE_GETCWD 1
#define PETSC_HAVE_GETDOMAINNAME 1
#define PETSC_HAVE_GETHOSTBYNAME 1
#define PETSC_HAVE_GETHOSTNAME 1
#define PETSC_HAVE_GETPAGESIZE 1
#define PETSC_HAVE_GETRUSAGE 1
#define PETSC_HAVE_HPDDM 1
#define PETSC_HAVE_HTOOL 1
#define PETSC_HAVE_IMMINTRIN_H 1
#define PETSC_HAVE_INTTYPES_H 1
#define PETSC_HAVE_ISINF 1
#define PETSC_HAVE_ISNAN 1
#define PETSC_HAVE_ISNORMAL 1
#define PETSC_HAVE_LGAMMA 1
#define PETSC_HAVE_LINUX 1
#define PETSC_HAVE_LOG2 1
#define PETSC_HAVE_LSEEK 1
#define PETSC_HAVE_MALLOC_H 1
#define PETSC_HAVE_MEMMOVE 1
#define PETSC_HAVE_METIS 1
#define PETSC_HAVE_MKSTEMP 1
#define PETSC_HAVE_MMAP 1
#define PETSC_HAVE_MPICH_NUMVERSION 30400002
#define PETSC_HAVE_MPIIO 1
#define PETSC_HAVE_MPI_COMBINER_CONTIGUOUS 1
#define PETSC_HAVE_MPI_COMBINER_DUP 1
#define PETSC_HAVE_MPI_COMBINER_NAMED 1
#define PETSC_HAVE_MPI_F90MODULE_VISIBILITY 1
#define PETSC_HAVE_MPI_FEATURE_DYNAMIC_WINDOW 1
#define PETSC_HAVE_MPI_GET_ACCUMULATE 1
#define PETSC_HAVE_MPI_GET_LIBRARY_VERSION 1
#define PETSC_HAVE_MPI_INIT_THREAD 1
#define PETSC_HAVE_MPI_INT64_T 1
#define PETSC_HAVE_MPI_LONG_DOUBLE 1
#define PETSC_HAVE_MPI_NEIGHBORHOOD_COLLECTIVES 1
#define PETSC_HAVE_MPI_NONBLOCKING_COLLECTIVES 1
#define PETSC_HAVE_MPI_ONE_SIDED 1
#define PETSC_HAVE_MPI_PROCESS_SHARED_MEMORY 1
#define PETSC_HAVE_MPI_REDUCE_LOCAL 1
#define PETSC_HAVE_MPI_REDUCE_SCATTER_BLOCK 1
#define PETSC_HAVE_MPI_RGET 1
#define PETSC_HAVE_MPI_WIN_CREATE 1
#define PETSC_HAVE_NANOSLEEP 1
#define PETSC_HAVE_NETDB_H 1
#define PETSC_HAVE_NETINET_IN_H 1
#define PETSC_HAVE_PACKAGES ":blaslapack:f2cblaslapack:hpddm:htool:mathlib:metis:mpi:parmetis:pthread:ptscotch:regex:suitesparse:superlu:superlu_dist:tetgen:x11:"
#define PETSC_HAVE_PARMETIS 1
#define PETSC_HAVE_POPEN 1
#define PETSC_HAVE_POSIX_MEMALIGN 1
#define PETSC_HAVE_PTHREAD 1
#define PETSC_HAVE_PTSCOTCH 1
#define PETSC_HAVE_PWD_H 1
#define PETSC_HAVE_RAND 1
#define PETSC_HAVE_READLINK 1
#define PETSC_HAVE_REALPATH 1
#define PETSC_HAVE_REAL___FLOAT128 1
#define PETSC_HAVE_REGEX 1
#define PETSC_HAVE_RTLD_GLOBAL 1
#define PETSC_HAVE_RTLD_LAZY 1
#define PETSC_HAVE_RTLD_LOCAL 1
#define PETSC_HAVE_RTLD_NOW 1
#define PETSC_HAVE_SETJMP_H 1
#define PETSC_HAVE_SLEEP 1
#define PETSC_HAVE_SLEPC 1
#define PETSC_HAVE_SNPRINTF 1
#define PETSC_HAVE_SOCKET 1
#define PETSC_HAVE_SO_REUSEADDR 1
#define PETSC_HAVE_STDATOMIC_H 1
#define PETSC_HAVE_STDINT_H 1
#define PETSC_HAVE_STRCASECMP 1
#define PETSC_HAVE_STRINGS_H 1
#define PETSC_HAVE_STRUCT_SIGACTION 1
#define PETSC_HAVE_SUITESPARSE 1
#define PETSC_HAVE_SUPERLU 1
#define PETSC_HAVE_SUPERLU_DIST 1
#define PETSC_HAVE_SYS_PARAM_H 1
#define PETSC_HAVE_SYS_PROCFS_H 1
#define PETSC_HAVE_SYS_RESOURCE_H 1
#define PETSC_HAVE_SYS_SOCKET_H 1
#define PETSC_HAVE_SYS_TIMES_H 1
#define PETSC_HAVE_SYS_TIME_H 1
#define PETSC_HAVE_SYS_TYPES_H 1
#define PETSC_HAVE_SYS_UTSNAME_H 1
#define PETSC_HAVE_SYS_WAIT_H 1
#define PETSC_HAVE_TAU_PERFSTUBS 1
#define PETSC_HAVE_TETGEN 1
#define PETSC_HAVE_TETGEN_TETLIBRARY_NEEDED 1
#define PETSC_HAVE_TGAMMA 1
#define PETSC_HAVE_TIME 1
#define PETSC_HAVE_TIME_H 1
#define PETSC_HAVE_UNAME 1
#define PETSC_HAVE_UNISTD_H 1
#define PETSC_HAVE_USLEEP 1
#define PETSC_HAVE_VA_COPY 1
#define PETSC_HAVE_VSNPRINTF 1
#define PETSC_HAVE_X 1
#define PETSC_HAVE_XMMINTRIN_H 1
#define PETSC_INTPTR_T intptr_t
#define PETSC_INTPTR_T_FMT "#" PRIxPTR
#define PETSC_IS_COLORING_MAX USHRT_MAX
#define PETSC_IS_COLORING_VALUE_TYPE short
#define PETSC_IS_COLORING_VALUE_TYPE_F integer2
#define PETSC_LEVEL1_DCACHE_LINESIZE 64
#define PETSC_LIB_DIR "/home/p_mvgkm/p_mvgopt02/FreeFem/petsc/arch-FreeFem-complex/lib"
#define PETSC_MAX_PATH_LEN 4096
#define PETSC_MEMALIGN 16
#define PETSC_MPICC_SHOW "craycc -I/opt/cray/pe/mpich/8.1.27/ofi/cray/16.0/include -L/opt/cray/pe/mpich/8.1.27/ofi/cray/16.0/lib -lmpi_cray"
#define PETSC_MPIU_IS_COLORING_VALUE_TYPE MPI_UNSIGNED_SHORT
#define PETSC_OMAKE "/usr/bin/gmake --no-print-directory"
#define PETSC_PREFETCH_HINT_NTA _MM_HINT_NTA
#define PETSC_PREFETCH_HINT_T0 _MM_HINT_T0
#define PETSC_PREFETCH_HINT_T1 _MM_HINT_T1
#define PETSC_PREFETCH_HINT_T2 _MM_HINT_T2
#define PETSC_PYTHON_EXE "/opt/cray/pe/python/3.10.10/bin/python3"
#define PETSC_Prefetch(a,b,c) _mm_prefetch((const char*)(a),(c))
#define PETSC_REPLACE_DIR_SEPARATOR '\\'
#define PETSC_SIGNAL_CAST
#define PETSC_SIZEOF_INT 4
#define PETSC_SIZEOF_LONG 8
#define PETSC_SIZEOF_LONG_LONG 8
#define PETSC_SIZEOF_SIZE_T 8
#define PETSC_SIZEOF_VOID_P 8
#define PETSC_SLSUFFIX "so"
#define PETSC_UINTPTR_T uintptr_t
#define PETSC_UINTPTR_T_FMT "#" PRIxPTR
#define PETSC_UNUSED __attribute((unused))
#define PETSC_USE_AVX512_KERNELS 1
#define PETSC_USE_BACKWARD_LOOP 1
#define PETSC_USE_COMPLEX 1
#define PETSC_USE_CTABLE 1
#define PETSC_USE_DEBUGGER "gdb"
#define PETSC_USE_DMLANDAU_2D 1
#define PETSC_USE_INFO 1
#define PETSC_USE_ISATTY 1
#define PETSC_USE_LOG 1
#define PETSC_USE_MALLOC_COALESCED 1
#define PETSC_USE_PROC_FOR_SIZE 1
#define PETSC_USE_REAL_DOUBLE 1
#define PETSC_USE_SHARED_LIBRARIES 1
#define PETSC_USE_SINGLE_LIBRARY 1
#define PETSC_USE_SOCKET_VIEWER 1
#define PETSC_USE_VISIBILITY_C 1
#define PETSC_USE_VISIBILITY_CXX 1
#define PETSC_USING_64BIT_PTR 1
#define PETSC_VERSION_BRANCH_GIT "release"
#define PETSC_VERSION_DATE_GIT "2023-11-06 05:16:30 +0000"
#define PETSC_VERSION_GIT "v3.20.1-26-gd00665f148d"
#define PETSC__BSD_SOURCE 1
#define PETSC__DEFAULT_SOURCE 1
#define PETSC__GNU_SOURCE 1
-----------------------------------------
Using C compile: /opt/cray/pe/mpich/8.1.27/ofi/cray/16.0/bin/mpicc -o .o -c -fPIC -Wall -Wwrite-strings -Wno-unknown-pragmas -fstack-protector -Qunused-arguments -fvisibility=hidden -g -O3
mpicc -show: craycc -I/opt/cray/pe/mpich/8.1.27/ofi/cray/16.0/include -L/opt/cray/pe/mpich/8.1.27/ofi/cray/16.0/lib -lmpi_cray
C compiler version: Cray clang version 16.0.1 (6d4824324d375100ba18ca639dfc956fe6546d06)
Using C++ compile: /opt/cray/pe/mpich/8.1.27/ofi/cray/16.0/bin/mpicxx -o .o -c -Wall -Wwrite-strings -Wno-strict-aliasing -Wno-unknown-pragmas -fstack-protector -fvisibility=hidden -g -O3 -std=gnu++20 -fPIC -I/home/p_mvgkm/p_mvgopt02/FreeFem/petsc/include -I/home/p_mvgkm/p_mvgopt02/FreeFem/petsc/arch-FreeFem-complex/include -I/project/p_mvgopt02/FreeFem/petsc/arch-FreeFem/include -I/opt/cray/pe/mpich/8.1.27/ofi/cray/16.0/include
mpicxx -show: crayCC -I/opt/cray/pe/mpich/8.1.27/ofi/cray/16.0/include -L/opt/cray/pe/mpich/8.1.27/ofi/cray/16.0/lib -lmpi_cray
C++ compiler version: Cray clang version 16.0.1 (6d4824324d375100ba18ca639dfc956fe6546d06)
-----------------------------------------
Using C/C++ linker: /opt/cray/pe/mpich/8.1.27/ofi/cray/16.0/bin/mpicc
Using C/C++ flags: -fPIC -Wall -Wwrite-strings -Wno-unknown-pragmas -fstack-protector -Qunused-arguments -fvisibility=hidden -g -O3
-----------------------------------------
Using system modules: craype-x86-rome:libfabric/1.15.2.0:craype-network-ofi:perftools-base/23.09.0:cce/16.0.1:craype/2.7.23:cray-dsmml/0.2.2:cray-mpich/8.1.27:cray-libsci/23.09.1.1:PrgEnv-cray/8.4.0:sbank:cray-python/3.10.10:gcc/12.2.0
Using mpi.h: # 1 "/opt/cray/pe/mpich/8.1.27/ofi/cray/16.0/include/mpi.h" 1
-----------------------------------------
Using libraries: -Wl,-rpath,/home/p_mvgkm/p_mvgopt02/FreeFem/petsc/arch-FreeFem-complex/lib -L/home/p_mvgkm/p_mvgopt02/FreeFem/petsc/arch-FreeFem-complex/lib -Wl,-rpath,/project/p_mvgopt02/FreeFem/petsc/arch-FreeFem/lib -L/project/p_mvgopt02/FreeFem/petsc/arch-FreeFem/lib -Wl,-rpath,/home/p_mvgkm/p_mvgopt02/FreeFem/petsc/arch-FreeFem-complex/lib -L/home/p_mvgkm/p_mvgopt02/FreeFem/petsc/arch-FreeFem-complex/lib -lpetsc -lspqr -lumfpack -lklu -lcholmod -lbtf -lccolamd -lcolamd -lcamd -lamd -lsuitesparseconfig -lsuperlu -lsuperlu_dist -lf2clapack -lf2cblas -lptesmumps -lptscotchparmetisv3 -lptscotch -lptscotcherr -lesmumps -lscotch -lscotcherr -lparmetis -lmetis -ltet -lX11 -lstdc++ -lquadmath -ldl
------------------------------------------
Using mpiexec: /bin/false
------------------------------------------
Using MAKE: /usr/bin/gmake
Default MAKEFLAGS: MAKE_NP:49 MAKE_LOAD:131.2 MAKEFLAGS: --no-print-directory -- PETSC_ARCH=arch-FreeFem-complex PETSC_DIR=/home/p_mvgkm/p_mvgopt02/FreeFem/petsc
==========================================
/usr/bin/gmake --print-directory -f gmakefile -j49 -l131.2 --output-sync=recurse V= libs
CC arch-FreeFem-complex/obj/src/sys/memory/mhbw.o
In file included from /project/p_mvgopt02/FreeFem/petsc/src/sys/memory/mhbw.c:1:
In file included from /home/p_mvgkm/p_mvgopt02/FreeFem/petsc/include/petscsys.h:193:
/home/p_mvgkm/p_mvgopt02/FreeFem/petsc/include/petscmath.h:429:45: error: unknown type name '__complex128'
PETSC_EXTERN MPI_Datatype MPIU___COMPLEX128 MPIU___COMPLEX128_ATTR_TAG;
^
/home/p_mvgkm/p_mvgopt02/FreeFem/petsc/include/petscmath.h:424:71: note: expanded from macro 'MPIU___COMPLEX128_ATTR_TAG'
#define MPIU___COMPLEX128_ATTR_TAG PETSC_ATTRIBUTE_MPI_TYPE_TAG(__complex128)
^
1 error generated.
gmake[3]: *** [gmakefile:197: arch-FreeFem-complex/obj/src/sys/memory/mhbw.o] Error 1
gmake[3]: *** Waiting for unfinished jobs....
CC arch-FreeFem-complex/obj/src/sys/utils/ctable.o
In file included from /project/p_mvgopt02/FreeFem/petsc/src/sys/utils/ctable.c:5:
In file included from /home/p_mvgkm/p_mvgopt02/FreeFem/petsc/include/petsc/private/petscimpl.h:5:
In file included from /home/p_mvgkm/p_mvgopt02/FreeFem/petsc/include/petscsys.h:193:
/home/p_mvgkm/p_mvgopt02/FreeFem/petsc/include/petscmath.h:429:45: error: unknown type name '__complex128'
PETSC_EXTERN MPI_Datatype MPIU___COMPLEX128 MPIU___COMPLEX128_ATTR_TAG;
^
/home/p_mvgkm/p_mvgopt02/FreeFem/petsc/include/petscmath.h:424:71: note: expanded from macro 'MPIU___COMPLEX128_ATTR_TAG'
#define MPIU___COMPLEX128_ATTR_TAG PETSC_ATTRIBUTE_MPI_TYPE_TAG(__complex128)
^
1 error generated.
gmake[3]: *** [gmakefile:197: arch-FreeFem-complex/obj/src/sys/utils/ctable.o] Error 1
CC arch-FreeFem-complex/obj/src/sys/time/cputime.o
In file included from /project/p_mvgopt02/FreeFem/petsc/src/sys/time/cputime.c:6:
In file included from /home/p_mvgkm/p_mvgopt02/FreeFem/petsc/include/petscsys.h:193:
/home/p_mvgkm/p_mvgopt02/FreeFem/petsc/include/petscmath.h:429:45: error: unknown type name '__complex128'
PETSC_EXTERN MPI_Datatype MPIU___COMPLEX128 MPIU___COMPLEX128_ATTR_TAG;
^
/home/p_mvgkm/p_mvgopt02/FreeFem/petsc/include/petscmath.h:424:71: note: expanded from macro 'MPIU___COMPLEX128_ATTR_TAG'
#define MPIU___COMPLEX128_ATTR_TAG PETSC_ATTRIBUTE_MPI_TYPE_TAG(__complex128)
^
1 error generated.
gmake[3]: *** [gmakefile:197: arch-FreeFem-complex/obj/src/sys/time/cputime.o] Error 1
CC arch-FreeFem-complex/obj/src/sys/objects/fcallback.o
In file included from /project/p_mvgopt02/FreeFem/petsc/src/sys/objects/fcallback.c:1:
In file included from /home/p_mvgkm/p_mvgopt02/FreeFem/petsc/include/petsc/private/petscimpl.h:5:
In file included from /home/p_mvgkm/p_mvgopt02/FreeFem/petsc/include/petscsys.h:193:
/home/p_mvgkm/p_mvgopt02/FreeFem/petsc/include/petscmath.h:429:45: error: unknown type name '__complex128'
PETSC_EXTERN MPI_Datatype MPIU___COMPLEX128 MPIU___COMPLEX128_ATTR_TAG;
^
/home/p_mvgkm/p_mvgopt02/FreeFem/petsc/include/petscmath.h:424:71: note: expanded from macro 'MPIU___COMPLEX128_ATTR_TAG'
#define MPIU___COMPLEX128_ATTR_TAG PETSC_ATTRIBUTE_MPI_TYPE_TAG(__complex128)
^
1 error generated.
gmake[3]: *** [gmakefile:197: arch-FreeFem-complex/obj/src/sys/objects/fcallback.o] Error 1
CC arch-FreeFem-complex/obj/src/sys/objects/gcomm.o
In file included from /project/p_mvgopt02/FreeFem/petsc/src/sys/objects/gcomm.c:4:
In file included from /home/p_mvgkm/p_mvgopt02/FreeFem/petsc/include/petsc/private/petscimpl.h:5:
In file included from /home/p_mvgkm/p_mvgopt02/FreeFem/petsc/include/petscsys.h:193:
/home/p_mvgkm/p_mvgopt02/FreeFem/petsc/include/petscmath.h:429:45: error: unknown type name '__complex128'
PETSC_EXTERN MPI_Datatype MPIU___COMPLEX128 MPIU___COMPLEX128_ATTR_TAG;
^
/home/p_mvgkm/p_mvgopt02/FreeFem/petsc/include/petscmath.h:424:71: note: expanded from macro 'MPIU___COMPLEX128_ATTR_TAG'
#define MPIU___COMPLEX128_ATTR_TAG PETSC_ATTRIBUTE_MPI_TYPE_TAG(__complex128)
^
1 error generated.
gmake[3]: *** [gmakefile:197: arch-FreeFem-complex/obj/src/sys/objects/gcomm.o] Error 1
CC arch-FreeFem-complex/obj/src/sys/objects/gtype.o
In file included from /project/p_mvgopt02/FreeFem/petsc/src/sys/objects/gtype.c:4:
In file included from /home/p_mvgkm/p_mvgopt02/FreeFem/petsc/include/petsc/private/petscimpl.h:5:
In file included from /home/p_mvgkm/p_mvgopt02/FreeFem/petsc/include/petscsys.h:193:
/home/p_mvgkm/p_mvgopt02/FreeFem/petsc/include/petscmath.h:429:45: error: unknown type name '__complex128'
PETSC_EXTERN MPI_Datatype MPIU___COMPLEX128 MPIU___COMPLEX128_ATTR_TAG;
^
/home/p_mvgkm/p_mvgopt02/FreeFem/petsc/include/petscmath.h:424:71: note: expanded from macro 'MPIU___COMPLEX128_ATTR_TAG'
#define MPIU___COMPLEX128_ATTR_TAG PETSC_ATTRIBUTE_MPI_TYPE_TAG(__complex128)
^
1 error generated.
gmake[3]: *** [gmakefile:197: arch-FreeFem-complex/obj/src/sys/objects/gtype.o] Error 1
CC arch-FreeFem-complex/obj/src/sys/objects/pgname.o
In file included from /project/p_mvgopt02/FreeFem/petsc/src/sys/objects/pgname.c:1:
In file included from /home/p_mvgkm/p_mvgopt02/FreeFem/petsc/include/petsc/private/petscimpl.h:5:
In file included from /home/p_mvgkm/p_mvgopt02/FreeFem/petsc/include/petscsys.h:193:
/home/p_mvgkm/p_mvgopt02/FreeFem/petsc/include/petscmath.h:429:45: error: unknown type name '__complex128'
PETSC_EXTERN MPI_Datatype MPIU___COMPLEX128 MPIU___COMPLEX128_ATTR_TAG;
^
/home/p_mvgkm/p_mvgopt02/FreeFem/petsc/include/petscmath.h:424:71: note: expanded from macro 'MPIU___COMPLEX128_ATTR_TAG'
#define MPIU___COMPLEX128_ATTR_TAG PETSC_ATTRIBUTE_MPI_TYPE_TAG(__complex128)
^
1 error generated.
gmake[3]: *** [gmakefile:197: arch-FreeFem-complex/obj/src/sys/objects/pgname.o] Error 1
CC arch-FreeFem-complex/obj/src/sys/objects/gcookie.o
In file included from /project/p_mvgopt02/FreeFem/petsc/src/sys/objects/gcookie.c:4:
In file included from /home/p_mvgkm/p_mvgopt02/FreeFem/petsc/include/petsc/private/petscimpl.h:5:
In file included from /home/p_mvgkm/p_mvgopt02/FreeFem/petsc/include/petscsys.h:193:
/home/p_mvgkm/p_mvgopt02/FreeFem/petsc/include/petscmath.h:429:45: error: unknown type name '__complex128'
PETSC_EXTERN MPI_Datatype MPIU___COMPLEX128 MPIU___COMPLEX128_ATTR_TAG;
^
/home/p_mvgkm/p_mvgopt02/FreeFem/petsc/include/petscmath.h:424:71: note: expanded from macro 'MPIU___COMPLEX128_ATTR_TAG'
#define MPIU___COMPLEX128_ATTR_TAG PETSC_ATTRIBUTE_MPI_TYPE_TAG(__complex128)
^
1 error generated.
gmake[3]: *** [gmakefile:197: arch-FreeFem-complex/obj/src/sys/objects/gcookie.o] Error 1
CC arch-FreeFem-complex/obj/src/sys/objects/olist.o
In file included from /project/p_mvgopt02/FreeFem/petsc/src/sys/objects/olist.c:5:
In file included from /home/p_mvgkm/p_mvgopt02/FreeFem/petsc/include/petsc/private/petscimpl.h:5:
In file included from /home/p_mvgkm/p_mvgopt02/FreeFem/petsc/include/petscsys.h:193:
/home/p_mvgkm/p_mvgopt02/FreeFem/petsc/include/petscmath.h:429:45: error: unknown type name '__complex128'
PETSC_EXTERN MPI_Datatype MPIU___COMPLEX128 MPIU___COMPLEX128_ATTR_TAG;
^
/home/p_mvgkm/p_mvgopt02/FreeFem/petsc/include/petscmath.h:424:71: note: expanded from macro 'MPIU___COMPLEX128_ATTR_TAG'
#define MPIU___COMPLEX128_ATTR_TAG PETSC_ATTRIBUTE_MPI_TYPE_TAG(__complex128)
^
1 error generated.
gmake[3]: *** [gmakefile:197: arch-FreeFem-complex/obj/src/sys/objects/olist.o] Error 1
CC arch-FreeFem-complex/obj/src/sys/objects/package.o
In file included from /project/p_mvgopt02/FreeFem/petsc/src/sys/objects/package.c:1:
In file included from /home/p_mvgkm/p_mvgopt02/FreeFem/petsc/include/petsc/private/petscimpl.h:5:
In file included from /home/p_mvgkm/p_mvgopt02/FreeFem/petsc/include/petscsys.h:193:
/home/p_mvgkm/p_mvgopt02/FreeFem/petsc/include/petscmath.h:429:45: error: unknown type name '__complex128'
PETSC_EXTERN MPI_Datatype MPIU___COMPLEX128 MPIU___COMPLEX128_ATTR_TAG;
^
/home/p_mvgkm/p_mvgopt02/FreeFem/petsc/include/petscmath.h:424:71: note: expanded from macro 'MPIU___COMPLEX128_ATTR_TAG'
#define MPIU___COMPLEX128_ATTR_TAG PETSC_ATTRIBUTE_MPI_TYPE_TAG(__complex128)
^
1 error generated.
gmake[3]: *** [gmakefile:197: arch-FreeFem-complex/obj/src/sys/objects/package.o] Error 1
CC arch-FreeFem-complex/obj/src/sys/objects/prefix.o
In file included from /project/p_mvgopt02/FreeFem/petsc/src/sys/objects/prefix.c:4:
In file included from /home/p_mvgkm/p_mvgopt02/FreeFem/petsc/include/petsc/private/petscimpl.h:5:
In file included from /home/p_mvgkm/p_mvgopt02/FreeFem/petsc/include/petscsys.h:193:
/home/p_mvgkm/p_mvgopt02/FreeFem/petsc/include/petscmath.h:429:45: error: unknown type name '__complex128'
PETSC_EXTERN MPI_Datatype MPIU___COMPLEX128 MPIU___COMPLEX128_ATTR_TAG;
^
/home/p_mvgkm/p_mvgopt02/FreeFem/petsc/include/petscmath.h:424:71: note: expanded from macro 'MPIU___COMPLEX128_ATTR_TAG'
#define MPIU___COMPLEX128_ATTR_TAG PETSC_ATTRIBUTE_MPI_TYPE_TAG(__complex128)
^
1 error generated.
gmake[3]: *** [gmakefile:197: arch-FreeFem-complex/obj/src/sys/objects/prefix.o] Error 1
CC arch-FreeFem-complex/obj/src/sys/objects/ptype.o
In file included from /project/p_mvgopt02/FreeFem/petsc/src/sys/objects/ptype.c:4:
In file included from /home/p_mvgkm/p_mvgopt02/FreeFem/petsc/include/petscsys.h:193:
/home/p_mvgkm/p_mvgopt02/FreeFem/petsc/include/petscmath.h:429:45: error: unknown type name '__complex128'
PETSC_EXTERN MPI_Datatype MPIU___COMPLEX128 MPIU___COMPLEX128_ATTR_TAG;
^
/home/p_mvgkm/p_mvgopt02/FreeFem/petsc/include/petscmath.h:424:71: note: expanded from macro 'MPIU___COMPLEX128_ATTR_TAG'
#define MPIU___COMPLEX128_ATTR_TAG PETSC_ATTRIBUTE_MPI_TYPE_TAG(__complex128)
^
1 error generated.
gmake[3]: *** [gmakefile:197: arch-FreeFem-complex/obj/src/sys/objects/ptype.o] Error 1
CC arch-FreeFem-complex/obj/src/sys/objects/version.o
In file included from /project/p_mvgopt02/FreeFem/petsc/src/sys/objects/version.c:1:
In file included from /home/p_mvgkm/p_mvgopt02/FreeFem/petsc/include/petscsys.h:193:
/home/p_mvgkm/p_mvgopt02/FreeFem/petsc/include/petscmath.h:429:45: error: unknown type name '__complex128'
PETSC_EXTERN MPI_Datatype MPIU___COMPLEX128 MPIU___COMPLEX128_ATTR_TAG;
^
/home/p_mvgkm/p_mvgopt02/FreeFem/petsc/include/petscmath.h:424:71: note: expanded from macro 'MPIU___COMPLEX128_ATTR_TAG'
#define MPIU___COMPLEX128_ATTR_TAG PETSC_ATTRIBUTE_MPI_TYPE_TAG(__complex128)
^
1 error generated.
gmake[3]: *** [gmakefile:197: arch-FreeFem-complex/obj/src/sys/objects/version.o] Error 1
CC arch-FreeFem-complex/obj/src/sys/objects/destroy.o
In file included from /project/p_mvgopt02/FreeFem/petsc/src/sys/objects/destroy.c:4:
In file included from /home/p_mvgkm/p_mvgopt02/FreeFem/petsc/include/petsc/private/petscimpl.h:5:
In file included from /home/p_mvgkm/p_mvgopt02/FreeFem/petsc/include/petscsys.h:193:
/home/p_mvgkm/p_mvgopt02/FreeFem/petsc/include/petscmath.h:429:45: error: unknown type name '__complex128'
PETSC_EXTERN MPI_Datatype MPIU___COMPLEX128 MPIU___COMPLEX128_ATTR_TAG;
^
/home/p_mvgkm/p_mvgopt02/FreeFem/petsc/include/petscmath.h:424:71: note: expanded from macro 'MPIU___COMPLEX128_ATTR_TAG'
#define MPIU___COMPLEX128_ATTR_TAG PETSC_ATTRIBUTE_MPI_TYPE_TAG(__complex128)
^
1 error generated.
gmake[3]: *** [gmakefile:197: arch-FreeFem-complex/obj/src/sys/objects/destroy.o] Error 1
CC arch-FreeFem-complex/obj/src/sys/objects/tagm.o
In file included from /project/p_mvgopt02/FreeFem/petsc/src/sys/objects/tagm.c:1:
In file included from /home/p_mvgkm/p_mvgopt02/FreeFem/petsc/include/petsc/private/petscimpl.h:5:
In file included from /home/p_mvgkm/p_mvgopt02/FreeFem/petsc/include/petscsys.h:193:
/home/p_mvgkm/p_mvgopt02/FreeFem/petsc/include/petscmath.h:429:45: error: unknown type name '__complex128'
PETSC_EXTERN MPI_Datatype MPIU___COMPLEX128 MPIU___COMPLEX128_ATTR_TAG;
^
/home/p_mvgkm/p_mvgopt02/FreeFem/petsc/include/petscmath.h:424:71: note: expanded from macro 'MPIU___COMPLEX128_ATTR_TAG'
#define MPIU___COMPLEX128_ATTR_TAG PETSC_ATTRIBUTE_MPI_TYPE_TAG(__complex128)
^
1 error generated.
gmake[3]: *** [gmakefile:197: arch-FreeFem-complex/obj/src/sys/objects/tagm.o] Error 1
CC arch-FreeFem-complex/obj/src/sys/utils/matheq.o
In file included from /project/p_mvgopt02/FreeFem/petsc/src/sys/utils/matheq.c:1:
In file included from /home/p_mvgkm/p_mvgopt02/FreeFem/petsc/include/petscsys.h:193:
/home/p_mvgkm/p_mvgopt02/FreeFem/petsc/include/petscmath.h:429:45: error: unknown type name '__complex128'
PETSC_EXTERN MPI_Datatype MPIU___COMPLEX128 MPIU___COMPLEX128_ATTR_TAG;
^
/home/p_mvgkm/p_mvgopt02/FreeFem/petsc/include/petscmath.h:424:71: note: expanded from macro 'MPIU___COMPLEX128_ATTR_TAG'
#define MPIU___COMPLEX128_ATTR_TAG PETSC_ATTRIBUTE_MPI_TYPE_TAG(__complex128)
^
1 error generated.
gmake[3]: *** [gmakefile:197: arch-FreeFem-complex/obj/src/sys/utils/matheq.o] Error 1
CC arch-FreeFem-complex/obj/src/sys/utils/mathclose.o
In file included from /project/p_mvgopt02/FreeFem/petsc/src/sys/utils/mathclose.c:1:
In file included from /home/p_mvgkm/p_mvgopt02/FreeFem/petsc/include/petscsys.h:193:
/home/p_mvgkm/p_mvgopt02/FreeFem/petsc/include/petscmath.h:429:45: error: unknown type name '__complex128'
PETSC_EXTERN MPI_Datatype MPIU___COMPLEX128 MPIU___COMPLEX128_ATTR_TAG;
^
/home/p_mvgkm/p_mvgopt02/FreeFem/petsc/include/petscmath.h:424:71: note: expanded from macro 'MPIU___COMPLEX128_ATTR_TAG'
#define MPIU___COMPLEX128_ATTR_TAG PETSC_ATTRIBUTE_MPI_TYPE_TAG(__complex128)
^
1 error generated.
gmake[3]: *** [gmakefile:197: arch-FreeFem-complex/obj/src/sys/utils/mathclose.o] Error 1
CC arch-FreeFem-complex/obj/src/sys/objects/subcomm.o
In file included from /project/p_mvgopt02/FreeFem/petsc/src/sys/objects/subcomm.c:4:
In file included from /home/p_mvgkm/p_mvgopt02/FreeFem/petsc/include/petscsys.h:193:
/home/p_mvgkm/p_mvgopt02/FreeFem/petsc/include/petscmath.h:429:45: error: unknown type name '__complex128'
PETSC_EXTERN MPI_Datatype MPIU___COMPLEX128 MPIU___COMPLEX128_ATTR_TAG;
^
/home/p_mvgkm/p_mvgopt02/FreeFem/petsc/include/petscmath.h:424:71: note: expanded from macro 'MPIU___COMPLEX128_ATTR_TAG'
#define MPIU___COMPLEX128_ATTR_TAG PETSC_ATTRIBUTE_MPI_TYPE_TAG(__complex128)
^
1 error generated.
gmake[3]: *** [gmakefile:197: arch-FreeFem-complex/obj/src/sys/objects/subcomm.o] Error 1
CC arch-FreeFem-complex/obj/src/sys/objects/inherit.o
In file included from /project/p_mvgopt02/FreeFem/petsc/src/sys/objects/inherit.c:4:
In file included from /home/p_mvgkm/p_mvgopt02/FreeFem/petsc/include/petsc/private/petscimpl.h:5:
In file included from /home/p_mvgkm/p_mvgopt02/FreeFem/petsc/include/petscsys.h:193:
/home/p_mvgkm/p_mvgopt02/FreeFem/petsc/include/petscmath.h:429:45: error: unknown type name '__complex128'
PETSC_EXTERN MPI_Datatype MPIU___COMPLEX128 MPIU___COMPLEX128_ATTR_TAG;
^
/home/p_mvgkm/p_mvgopt02/FreeFem/petsc/include/petscmath.h:424:71: note: expanded from macro 'MPIU___COMPLEX128_ATTR_TAG'
#define MPIU___COMPLEX128_ATTR_TAG PETSC_ATTRIBUTE_MPI_TYPE_TAG(__complex128)
^
1 error generated.
gmake[3]: *** [gmakefile:197: arch-FreeFem-complex/obj/src/sys/objects/inherit.o] Error 1
CC arch-FreeFem-complex/obj/src/sys/dll/dlimpl.o
In file included from /project/p_mvgopt02/FreeFem/petsc/src/sys/dll/dlimpl.c:12:
In file included from /home/p_mvgkm/p_mvgopt02/FreeFem/petsc/include/petsc/private/petscimpl.h:5:
In file included from /home/p_mvgkm/p_mvgopt02/FreeFem/petsc/include/petscsys.h:193:
/home/p_mvgkm/p_mvgopt02/FreeFem/petsc/include/petscmath.h:429:45: error: unknown type name '__complex128'
PETSC_EXTERN MPI_Datatype MPIU___COMPLEX128 MPIU___COMPLEX128_ATTR_TAG;
^
/home/p_mvgkm/p_mvgopt02/FreeFem/petsc/include/petscmath.h:424:71: note: expanded from macro 'MPIU___COMPLEX128_ATTR_TAG'
#define MPIU___COMPLEX128_ATTR_TAG PETSC_ATTRIBUTE_MPI_TYPE_TAG(__complex128)
^
1 error generated.
gmake[3]: *** [gmakefile:197: arch-FreeFem-complex/obj/src/sys/dll/dlimpl.o] Error 1
CC arch-FreeFem-complex/obj/src/sys/memory/mtr.o
In file included from /project/p_mvgopt02/FreeFem/petsc/src/sys/memory/mtr.c:4:
In file included from /home/p_mvgkm/p_mvgopt02/FreeFem/petsc/include/petsc/private/petscimpl.h:5:
In file included from /home/p_mvgkm/p_mvgopt02/FreeFem/petsc/include/petscsys.h:193:
/home/p_mvgkm/p_mvgopt02/FreeFem/petsc/include/petscmath.h:429:45: error: unknown type name '__complex128'
PETSC_EXTERN MPI_Datatype MPIU___COMPLEX128 MPIU___COMPLEX128_ATTR_TAG;
^
/home/p_mvgkm/p_mvgopt02/FreeFem/petsc/include/petscmath.h:424:71: note: expanded from macro 'MPIU___COMPLEX128_ATTR_TAG'
#define MPIU___COMPLEX128_ATTR_TAG PETSC_ATTRIBUTE_MPI_TYPE_TAG(__complex128)
^
1 error generated.
gmake[3]: *** [gmakefile:197: arch-FreeFem-complex/obj/src/sys/memory/mtr.o] Error 1
CC arch-FreeFem-complex/obj/src/sys/objects/pname.o
In file included from /project/p_mvgopt02/FreeFem/petsc/src/sys/objects/pname.c:1:
In file included from /home/p_mvgkm/p_mvgopt02/FreeFem/petsc/include/petsc/private/petscimpl.h:5:
In file included from /home/p_mvgkm/p_mvgopt02/FreeFem/petsc/include/petscsys.h:193:
/home/p_mvgkm/p_mvgopt02/FreeFem/petsc/include/petscmath.h:429:45: error: unknown type name '__complex128'
PETSC_EXTERN MPI_Datatype MPIU___COMPLEX128 MPIU___COMPLEX128_ATTR_TAG;
^
/home/p_mvgkm/p_mvgopt02/FreeFem/petsc/include/petscmath.h:424:71: note: expanded from macro 'MPIU___COMPLEX128_ATTR_TAG'
#define MPIU___COMPLEX128_ATTR_TAG PETSC_ATTRIBUTE_MPI_TYPE_TAG(__complex128)
^
1 error generated.
gmake[3]: *** [gmakefile:197: arch-FreeFem-complex/obj/src/sys/objects/pname.o] Error 1
CC arch-FreeFem-complex/obj/src/sys/objects/device/util/devicereg.o
In file included from /project/p_mvgopt02/FreeFem/petsc/src/sys/objects/device/util/devicereg.c:1:
In file included from /home/p_mvgkm/p_mvgopt02/FreeFem/petsc/include/petsc/private/deviceimpl.h:3:
In file included from /home/p_mvgkm/p_mvgopt02/FreeFem/petsc/include/petscdevice.h:3:
In file included from /home/p_mvgkm/p_mvgopt02/FreeFem/petsc/include/petscdevicetypes.h:3:
In file included from /home/p_mvgkm/p_mvgopt02/FreeFem/petsc/include/petscsys.h:193:
/home/p_mvgkm/p_mvgopt02/FreeFem/petsc/include/petscmath.h:429:45: error: unknown type name '__complex128'
PETSC_EXTERN MPI_Datatype MPIU___COMPLEX128 MPIU___COMPLEX128_ATTR_TAG;
^
/home/p_mvgkm/p_mvgopt02/FreeFem/petsc/include/petscmath.h:424:71: note: expanded from macro 'MPIU___COMPLEX128_ATTR_TAG'
#define MPIU___COMPLEX128_ATTR_TAG PETSC_ATTRIBUTE_MPI_TYPE_TAG(__complex128)
^
1 error generated.
gmake[3]: *** [gmakefile:197: arch-FreeFem-complex/obj/src/sys/objects/device/util/devicereg.o] Error 1
CC arch-FreeFem-complex/obj/src/sys/utils/arch.o
In file included from /project/p_mvgopt02/FreeFem/petsc/src/sys/utils/arch.c:1:
In file included from /home/p_mvgkm/p_mvgopt02/FreeFem/petsc/include/petscsys.h:193:
/home/p_mvgkm/p_mvgopt02/FreeFem/petsc/include/petscmath.h:429:45: error: unknown type name '__complex128'
PETSC_EXTERN MPI_Datatype MPIU___COMPLEX128 MPIU___COMPLEX128_ATTR_TAG;
^
/home/p_mvgkm/p_mvgopt02/FreeFem/petsc/include/petscmath.h:424:71: note: expanded from macro 'MPIU___COMPLEX128_ATTR_TAG'
#define MPIU___COMPLEX128_ATTR_TAG PETSC_ATTRIBUTE_MPI_TYPE_TAG(__complex128)
^
1 error generated.
gmake[3]: *** [gmakefile:197: arch-FreeFem-complex/obj/src/sys/utils/arch.o] Error 1
CC arch-FreeFem-complex/obj/src/sys/objects/device/util/memory.o
In file included from /project/p_mvgopt02/FreeFem/petsc/src/sys/objects/device/util/memory.c:1:
In file included from /home/p_mvgkm/p_mvgopt02/FreeFem/petsc/include/petsc/private/deviceimpl.h:3:
In file included from /home/p_mvgkm/p_mvgopt02/FreeFem/petsc/include/petscdevice.h:3:
In file included from /home/p_mvgkm/p_mvgopt02/FreeFem/petsc/include/petscdevicetypes.h:3:
In file included from /home/p_mvgkm/p_mvgopt02/FreeFem/petsc/include/petscsys.h:193:
/home/p_mvgkm/p_mvgopt02/FreeFem/petsc/include/petscmath.h:429:45: error: unknown type name '__complex128'
PETSC_EXTERN MPI_Datatype MPIU___COMPLEX128 MPIU___COMPLEX128_ATTR_TAG;
^
/home/p_mvgkm/p_mvgopt02/FreeFem/petsc/include/petscmath.h:424:71: note: expanded from macro 'MPIU___COMPLEX128_ATTR_TAG'
#define MPIU___COMPLEX128_ATTR_TAG PETSC_ATTRIBUTE_MPI_TYPE_TAG(__complex128)
^
1 error generated.
gmake[3]: *** [gmakefile:197: arch-FreeFem-complex/obj/src/sys/objects/device/util/memory.o] Error 1
CC arch-FreeFem-complex/obj/src/sys/dll/reg.o
In file included from /project/p_mvgopt02/FreeFem/petsc/src/sys/dll/reg.c:5:
In file included from /home/p_mvgkm/p_mvgopt02/FreeFem/petsc/include/petsc/private/petscimpl.h:5:
In file included from /home/p_mvgkm/p_mvgopt02/FreeFem/petsc/include/petscsys.h:193:
/home/p_mvgkm/p_mvgopt02/FreeFem/petsc/include/petscmath.h:429:45: error: unknown type name '__complex128'
PETSC_EXTERN MPI_Datatype MPIU___COMPLEX128 MPIU___COMPLEX128_ATTR_TAG;
^
/home/p_mvgkm/p_mvgopt02/FreeFem/petsc/include/petscmath.h:424:71: note: expanded from macro 'MPIU___COMPLEX128_ATTR_TAG'
#define MPIU___COMPLEX128_ATTR_TAG PETSC_ATTRIBUTE_MPI_TYPE_TAG(__complex128)
^
1 error generated.
gmake[3]: *** [gmakefile:197: arch-FreeFem-complex/obj/src/sys/dll/reg.o] Error 1
CC arch-FreeFem-complex/obj/src/sys/utils/fuser.o
In file included from /project/p_mvgopt02/FreeFem/petsc/src/sys/utils/fuser.c:4:
In file included from /home/p_mvgkm/p_mvgopt02/FreeFem/petsc/include/petscsys.h:193:
/home/p_mvgkm/p_mvgopt02/FreeFem/petsc/include/petscmath.h:429:45: error: unknown type name '__complex128'
PETSC_EXTERN MPI_Datatype MPIU___COMPLEX128 MPIU___COMPLEX128_ATTR_TAG;
^
/home/p_mvgkm/p_mvgopt02/FreeFem/petsc/include/petscmath.h:424:71: note: expanded from macro 'MPIU___COMPLEX128_ATTR_TAG'
#define MPIU___COMPLEX128_ATTR_TAG PETSC_ATTRIBUTE_MPI_TYPE_TAG(__complex128)
^
1 error generated.
gmake[3]: *** [gmakefile:197: arch-FreeFem-complex/obj/src/sys/utils/fuser.o] Error 1
CC arch-FreeFem-complex/obj/src/sys/objects/aoptions.o
In file included from /project/p_mvgopt02/FreeFem/petsc/src/sys/objects/aoptions.c:7:
In file included from /home/p_mvgkm/p_mvgopt02/FreeFem/petsc/include/petsc/private/petscimpl.h:5:
In file included from /home/p_mvgkm/p_mvgopt02/FreeFem/petsc/include/petscsys.h:193:
/home/p_mvgkm/p_mvgopt02/FreeFem/petsc/include/petscmath.h:429:45: error: unknown type name '__complex128'
PETSC_EXTERN MPI_Datatype MPIU___COMPLEX128 MPIU___COMPLEX128_ATTR_TAG;
^
/home/p_mvgkm/p_mvgopt02/FreeFem/petsc/include/petscmath.h:424:71: note: expanded from macro 'MPIU___COMPLEX128_ATTR_TAG'
#define MPIU___COMPLEX128_ATTR_TAG PETSC_ATTRIBUTE_MPI_TYPE_TAG(__complex128)
^
1 error generated.
gmake[3]: *** [gmakefile:197: arch-FreeFem-complex/obj/src/sys/objects/aoptions.o] Error 1
CC arch-FreeFem-complex/obj/src/sys/time/fdate.o
In file included from /project/p_mvgopt02/FreeFem/petsc/src/sys/time/fdate.c:1:
In file included from /home/p_mvgkm/p_mvgopt02/FreeFem/petsc/include/petscsys.h:193:
/home/p_mvgkm/p_mvgopt02/FreeFem/petsc/include/petscmath.h:429:45: error: unknown type name '__complex128'
PETSC_EXTERN MPI_Datatype MPIU___COMPLEX128 MPIU___COMPLEX128_ATTR_TAG;
^
/home/p_mvgkm/p_mvgopt02/FreeFem/petsc/include/petscmath.h:424:71: note: expanded from macro 'MPIU___COMPLEX128_ATTR_TAG'
#define MPIU___COMPLEX128_ATTR_TAG PETSC_ATTRIBUTE_MPI_TYPE_TAG(__complex128)
^
1 error generated.
gmake[3]: *** [gmakefile:197: arch-FreeFem-complex/obj/src/sys/time/fdate.o] Error 1
CC arch-FreeFem-complex/obj/src/sys/utils/fhost.o
In file included from /project/p_mvgopt02/FreeFem/petsc/src/sys/utils/fhost.c:5:
In file included from /home/p_mvgkm/p_mvgopt02/FreeFem/petsc/include/petscsys.h:193:
/home/p_mvgkm/p_mvgopt02/FreeFem/petsc/include/petscmath.h:429:45: error: unknown type name '__complex128'
PETSC_EXTERN MPI_Datatype MPIU___COMPLEX128 MPIU___COMPLEX128_ATTR_TAG;
^
/home/p_mvgkm/p_mvgopt02/FreeFem/petsc/include/petscmath.h:424:71: note: expanded from macro 'MPIU___COMPLEX128_ATTR_TAG'
#define MPIU___COMPLEX128_ATTR_TAG PETSC_ATTRIBUTE_MPI_TYPE_TAG(__complex128)
^
1 error generated.
gmake[3]: *** [gmakefile:197: arch-FreeFem-complex/obj/src/sys/utils/fhost.o] Error 1
CC arch-FreeFem-complex/obj/src/sys/objects/state.o
In file included from /project/p_mvgopt02/FreeFem/petsc/src/sys/objects/state.c:4:
In file included from /home/p_mvgkm/p_mvgopt02/FreeFem/petsc/include/petsc/private/petscimpl.h:5:
In file included from /home/p_mvgkm/p_mvgopt02/FreeFem/petsc/include/petscsys.h:193:
/home/p_mvgkm/p_mvgopt02/FreeFem/petsc/include/petscmath.h:429:45: error: unknown type name '__complex128'
PETSC_EXTERN MPI_Datatype MPIU___COMPLEX128 MPIU___COMPLEX128_ATTR_TAG;
^
/home/p_mvgkm/p_mvgopt02/FreeFem/petsc/include/petscmath.h:424:71: note: expanded from macro 'MPIU___COMPLEX128_ATTR_TAG'
#define MPIU___COMPLEX128_ATTR_TAG PETSC_ATTRIBUTE_MPI_TYPE_TAG(__complex128)
^
1 error generated.
gmake[3]: *** [gmakefile:197: arch-FreeFem-complex/obj/src/sys/objects/state.o] Error 1
CC arch-FreeFem-complex/obj/src/sys/objects/garbage.o
In file included from /project/p_mvgopt02/FreeFem/petsc/src/sys/objects/garbage.c:1:
In file included from /home/p_mvgkm/p_mvgopt02/FreeFem/petsc/include/petsc/private/garbagecollector.h:3:
In file included from /home/p_mvgkm/p_mvgopt02/FreeFem/petsc/include/petsc/private/hashmapobj.h:3:
In file included from /home/p_mvgkm/p_mvgopt02/FreeFem/petsc/include/petsc/private/hashmap.h:3:
In file included from /home/p_mvgkm/p_mvgopt02/FreeFem/petsc/include/petsc/private/hashtable.h:3:
In file included from /home/p_mvgkm/p_mvgopt02/FreeFem/petsc/include/petsc/private/petscimpl.h:5:
In file included from /home/p_mvgkm/p_mvgopt02/FreeFem/petsc/include/petscsys.h:193:
/home/p_mvgkm/p_mvgopt02/FreeFem/petsc/include/petscmath.h:429:45: error: unknown type name '__complex128'
PETSC_EXTERN MPI_Datatype MPIU___COMPLEX128 MPIU___COMPLEX128_ATTR_TAG;
^
/home/p_mvgkm/p_mvgopt02/FreeFem/petsc/include/petscmath.h:424:71: note: expanded from macro 'MPIU___COMPLEX128_ATTR_TAG'
#define MPIU___COMPLEX128_ATTR_TAG PETSC_ATTRIBUTE_MPI_TYPE_TAG(__complex128)
^
1 error generated.
gmake[3]: *** [gmakefile:197: arch-FreeFem-complex/obj/src/sys/objects/garbage.o] Error 1
CC arch-FreeFem-complex/obj/src/sys/dll/dl.o
In file included from /project/p_mvgopt02/FreeFem/petsc/src/sys/dll/dl.c:6:
In file included from /home/p_mvgkm/p_mvgopt02/FreeFem/petsc/include/petsc/private/petscimpl.h:5:
In file included from /home/p_mvgkm/p_mvgopt02/FreeFem/petsc/include/petscsys.h:193:
/home/p_mvgkm/p_mvgopt02/FreeFem/petsc/include/petscmath.h:429:45: error: unknown type name '__complex128'
PETSC_EXTERN MPI_Datatype MPIU___COMPLEX128 MPIU___COMPLEX128_ATTR_TAG;
^
/home/p_mvgkm/p_mvgopt02/FreeFem/petsc/include/petscmath.h:424:71: note: expanded from macro 'MPIU___COMPLEX128_ATTR_TAG'
#define MPIU___COMPLEX128_ATTR_TAG PETSC_ATTRIBUTE_MPI_TYPE_TAG(__complex128)
^
1 error generated.
gmake[3]: *** [gmakefile:197: arch-FreeFem-complex/obj/src/sys/dll/dl.o] Error 1
CC arch-FreeFem-complex/obj/src/sys/objects/init.o
In file included from /project/p_mvgopt02/FreeFem/petsc/src/sys/objects/init.c:8:
In file included from /home/p_mvgkm/p_mvgopt02/FreeFem/petsc/include/petsc/private/petscimpl.h:5:
In file included from /home/p_mvgkm/p_mvgopt02/FreeFem/petsc/include/petscsys.h:193:
/home/p_mvgkm/p_mvgopt02/FreeFem/petsc/include/petscmath.h:429:45: error: unknown type name '__complex128'
PETSC_EXTERN MPI_Datatype MPIU___COMPLEX128 MPIU___COMPLEX128_ATTR_TAG;
^
/home/p_mvgkm/p_mvgopt02/FreeFem/petsc/include/petscmath.h:424:71: note: expanded from macro 'MPIU___COMPLEX128_ATTR_TAG'
#define MPIU___COMPLEX128_ATTR_TAG PETSC_ATTRIBUTE_MPI_TYPE_TAG(__complex128)
^
1 error generated.
gmake[3]: *** [gmakefile:197: arch-FreeFem-complex/obj/src/sys/objects/init.o] Error 1
CC arch-FreeFem-complex/obj/src/sys/memory/mal.o
In file included from /project/p_mvgopt02/FreeFem/petsc/src/sys/memory/mal.c:5:
In file included from /home/p_mvgkm/p_mvgopt02/FreeFem/petsc/include/petscsys.h:193:
/home/p_mvgkm/p_mvgopt02/FreeFem/petsc/include/petscmath.h:429:45: error: unknown type name '__complex128'
PETSC_EXTERN MPI_Datatype MPIU___COMPLEX128 MPIU___COMPLEX128_ATTR_TAG;
^
/home/p_mvgkm/p_mvgopt02/FreeFem/petsc/include/petscmath.h:424:71: note: expanded from macro 'MPIU___COMPLEX128_ATTR_TAG'
#define MPIU___COMPLEX128_ATTR_TAG PETSC_ATTRIBUTE_MPI_TYPE_TAG(__complex128)
^
1 error generated.
gmake[3]: *** [gmakefile:197: arch-FreeFem-complex/obj/src/sys/memory/mal.o] Error 1
CC arch-FreeFem-complex/obj/src/sys/memory/mem.o
In file included from /project/p_mvgopt02/FreeFem/petsc/src/sys/memory/mem.c:2:
In file included from /home/p_mvgkm/p_mvgopt02/FreeFem/petsc/include/petscsys.h:193:
/home/p_mvgkm/p_mvgopt02/FreeFem/petsc/include/petscmath.h:429:45: error: unknown type name '__complex128'
PETSC_EXTERN MPI_Datatype MPIU___COMPLEX128 MPIU___COMPLEX128_ATTR_TAG;
^
/home/p_mvgkm/p_mvgopt02/FreeFem/petsc/include/petscmath.h:424:71: note: expanded from macro 'MPIU___COMPLEX128_ATTR_TAG'
#define MPIU___COMPLEX128_ATTR_TAG PETSC_ATTRIBUTE_MPI_TYPE_TAG(__complex128)
^
1 error generated.
gmake[3]: *** [gmakefile:197: arch-FreeFem-complex/obj/src/sys/memory/mem.o] Error 1
CC arch-FreeFem-complex/obj/src/sys/perfstubs/pstimer.o
CC arch-FreeFem-complex/obj/src/sys/objects/options.o
In file included from /project/p_mvgopt02/FreeFem/petsc/src/sys/objects/options.c:12:
In file included from /home/p_mvgkm/p_mvgopt02/FreeFem/petsc/include/petsc/private/petscimpl.h:5:
In file included from /home/p_mvgkm/p_mvgopt02/FreeFem/petsc/include/petscsys.h:193:
/home/p_mvgkm/p_mvgopt02/FreeFem/petsc/include/petscmath.h:429:45: error: unknown type name '__complex128'
PETSC_EXTERN MPI_Datatype MPIU___COMPLEX128 MPIU___COMPLEX128_ATTR_TAG;
^
/home/p_mvgkm/p_mvgopt02/FreeFem/petsc/include/petscmath.h:424:71: note: expanded from macro 'MPIU___COMPLEX128_ATTR_TAG'
#define MPIU___COMPLEX128_ATTR_TAG PETSC_ATTRIBUTE_MPI_TYPE_TAG(__complex128)
^
1 error generated.
gmake[3]: *** [gmakefile:197: arch-FreeFem-complex/obj/src/sys/objects/options.o] Error 1
CC arch-FreeFem-complex/obj/src/sys/objects/pinit.o
In file included from /project/p_mvgopt02/FreeFem/petsc/src/sys/objects/pinit.c:5:
In file included from /home/p_mvgkm/p_mvgopt02/FreeFem/petsc/include/petsc/private/petscimpl.h:5:
In file included from /home/p_mvgkm/p_mvgopt02/FreeFem/petsc/include/petscsys.h:193:
/home/p_mvgkm/p_mvgopt02/FreeFem/petsc/include/petscmath.h:429:45: error: unknown type name '__complex128'
PETSC_EXTERN MPI_Datatype MPIU___COMPLEX128 MPIU___COMPLEX128_ATTR_TAG;
^
/home/p_mvgkm/p_mvgopt02/FreeFem/petsc/include/petscmath.h:424:71: note: expanded from macro 'MPIU___COMPLEX128_ATTR_TAG'
#define MPIU___COMPLEX128_ATTR_TAG PETSC_ATTRIBUTE_MPI_TYPE_TAG(__complex128)
^
1 error generated.
gmake[3]: *** [gmakefile:197: arch-FreeFem-complex/obj/src/sys/objects/pinit.o] Error 1
CC arch-FreeFem-complex/obj/src/sys/objects/optionsyaml.o
In file included from /project/p_mvgopt02/FreeFem/petsc/src/sys/objects/optionsyaml.c:2:
In file included from /home/p_mvgkm/p_mvgopt02/FreeFem/petsc/include/petsc/private/petscimpl.h:5:
In file included from /home/p_mvgkm/p_mvgopt02/FreeFem/petsc/include/petscsys.h:193:
/home/p_mvgkm/p_mvgopt02/FreeFem/petsc/include/petscmath.h:429:45: error: unknown type name '__complex128'
PETSC_EXTERN MPI_Datatype MPIU___COMPLEX128 MPIU___COMPLEX128_ATTR_TAG;
^
/home/p_mvgkm/p_mvgopt02/FreeFem/petsc/include/petscmath.h:424:71: note: expanded from macro 'MPIU___COMPLEX128_ATTR_TAG'
#define MPIU___COMPLEX128_ATTR_TAG PETSC_ATTRIBUTE_MPI_TYPE_TAG(__complex128)
^
1 error generated.
gmake[3]: *** [gmakefile:197: arch-FreeFem-complex/obj/src/sys/objects/optionsyaml.o] Error 1
CXX arch-FreeFem-complex/obj/src/sys/dll/cxx/demangle.o
CXX arch-FreeFem-complex/obj/src/sys/objects/device/impls/host/hostcontext.o
In file included from /project/p_mvgopt02/FreeFem/petsc/src/sys/objects/device/impls/host/hostcontext.cxx:1:
In file included from /home/p_mvgkm/p_mvgopt02/FreeFem/petsc/include/petsc/private/deviceimpl.h:3:
In file included from /home/p_mvgkm/p_mvgopt02/FreeFem/petsc/include/petscdevice.h:3:
In file included from /home/p_mvgkm/p_mvgopt02/FreeFem/petsc/include/petscdevicetypes.h:3:
In file included from /home/p_mvgkm/p_mvgopt02/FreeFem/petsc/include/petscsys.h:193:
/home/p_mvgkm/p_mvgopt02/FreeFem/petsc/include/petscmath.h:429:45: error: unknown type name '__complex128'
PETSC_EXTERN MPI_Datatype MPIU___COMPLEX128 MPIU___COMPLEX128_ATTR_TAG;
^
/home/p_mvgkm/p_mvgopt02/FreeFem/petsc/include/petscmath.h:424:71: note: expanded from macro 'MPIU___COMPLEX128_ATTR_TAG'
#define MPIU___COMPLEX128_ATTR_TAG PETSC_ATTRIBUTE_MPI_TYPE_TAG(__complex128)
^
1 error generated.
gmake[3]: *** [gmakefile:203: arch-FreeFem-complex/obj/src/sys/objects/device/impls/host/hostcontext.o] Error 1
CXX arch-FreeFem-complex/obj/src/sys/objects/device/impls/host/hostdevice.o
In file included from /project/p_mvgopt02/FreeFem/petsc/src/sys/objects/device/impls/host/hostdevice.cxx:1:
In file included from /project/p_mvgopt02/FreeFem/petsc/src/sys/objects/device/impls/host/hostdevice.hpp:3:
In file included from /project/p_mvgopt02/FreeFem/petsc/src/sys/objects/device/impls/host/../impldevicebase.hpp:3:
In file included from /home/p_mvgkm/p_mvgopt02/FreeFem/petsc/include/petsc/private/deviceimpl.h:3:
In file included from /home/p_mvgkm/p_mvgopt02/FreeFem/petsc/include/petscdevice.h:3:
In file included from /home/p_mvgkm/p_mvgopt02/FreeFem/petsc/include/petscdevicetypes.h:3:
In file included from /home/p_mvgkm/p_mvgopt02/FreeFem/petsc/include/petscsys.h:193:
/home/p_mvgkm/p_mvgopt02/FreeFem/petsc/include/petscmath.h:429:45: error: unknown type name '__complex128'
PETSC_EXTERN MPI_Datatype MPIU___COMPLEX128 MPIU___COMPLEX128_ATTR_TAG;
^
/home/p_mvgkm/p_mvgopt02/FreeFem/petsc/include/petscmath.h:424:71: note: expanded from macro 'MPIU___COMPLEX128_ATTR_TAG'
#define MPIU___COMPLEX128_ATTR_TAG PETSC_ATTRIBUTE_MPI_TYPE_TAG(__complex128)
^
1 error generated.
gmake[3]: *** [gmakefile:203: arch-FreeFem-complex/obj/src/sys/objects/device/impls/host/hostdevice.o] Error 1
CXX arch-FreeFem-complex/obj/src/sys/objects/device/interface/global_dcontext.o
In file included from /project/p_mvgopt02/FreeFem/petsc/src/sys/objects/device/interface/global_dcontext.cxx:1:
In file included from /project/p_mvgopt02/FreeFem/petsc/src/sys/objects/device/interface/petscdevice_interface_internal.hpp:3:
In file included from /home/p_mvgkm/p_mvgopt02/FreeFem/petsc/include/petsc/private/deviceimpl.h:3:
In file included from /home/p_mvgkm/p_mvgopt02/FreeFem/petsc/include/petscdevice.h:3:
In file included from /home/p_mvgkm/p_mvgopt02/FreeFem/petsc/include/petscdevicetypes.h:3:
In file included from /home/p_mvgkm/p_mvgopt02/FreeFem/petsc/include/petscsys.h:193:
/home/p_mvgkm/p_mvgopt02/FreeFem/petsc/include/petscmath.h:429:45: error: unknown type name '__complex128'
PETSC_EXTERN MPI_Datatype MPIU___COMPLEX128 MPIU___COMPLEX128_ATTR_TAG;
^
/home/p_mvgkm/p_mvgopt02/FreeFem/petsc/include/petscmath.h:424:71: note: expanded from macro 'MPIU___COMPLEX128_ATTR_TAG'
#define MPIU___COMPLEX128_ATTR_TAG PETSC_ATTRIBUTE_MPI_TYPE_TAG(__complex128)
^
1 error generated.
gmake[3]: *** [gmakefile:203: arch-FreeFem-complex/obj/src/sys/objects/device/interface/global_dcontext.o] Error 1
CXX arch-FreeFem-complex/obj/src/sys/objects/device/interface/memory.o
In file included from /project/p_mvgopt02/FreeFem/petsc/src/sys/objects/device/interface/memory.cxx:1:
In file included from /home/p_mvgkm/p_mvgopt02/FreeFem/petsc/include/petsc/private/deviceimpl.h:3:
In file included from /home/p_mvgkm/p_mvgopt02/FreeFem/petsc/include/petscdevice.h:3:
In file included from /home/p_mvgkm/p_mvgopt02/FreeFem/petsc/include/petscdevicetypes.h:3:
In file included from /home/p_mvgkm/p_mvgopt02/FreeFem/petsc/include/petscsys.h:193:
/home/p_mvgkm/p_mvgopt02/FreeFem/petsc/include/petscmath.h:429:45: error: unknown type name '__complex128'
PETSC_EXTERN MPI_Datatype MPIU___COMPLEX128 MPIU___COMPLEX128_ATTR_TAG;
^
/home/p_mvgkm/p_mvgopt02/FreeFem/petsc/include/petscmath.h:424:71: note: expanded from macro 'MPIU___COMPLEX128_ATTR_TAG'
#define MPIU___COMPLEX128_ATTR_TAG PETSC_ATTRIBUTE_MPI_TYPE_TAG(__complex128)
^
1 error generated.
gmake[3]: *** [gmakefile:203: arch-FreeFem-complex/obj/src/sys/objects/device/interface/memory.o] Error 1
CXX arch-FreeFem-complex/obj/src/sys/objects/device/interface/device.o
In file included from /project/p_mvgopt02/FreeFem/petsc/src/sys/objects/device/interface/device.cxx:1:
In file included from /project/p_mvgopt02/FreeFem/petsc/src/sys/objects/device/interface/petscdevice_interface_internal.hpp:3:
In file included from /home/p_mvgkm/p_mvgopt02/FreeFem/petsc/include/petsc/private/deviceimpl.h:3:
In file included from /home/p_mvgkm/p_mvgopt02/FreeFem/petsc/include/petscdevice.h:3:
In file included from /home/p_mvgkm/p_mvgopt02/FreeFem/petsc/include/petscdevicetypes.h:3:
In file included from /home/p_mvgkm/p_mvgopt02/FreeFem/petsc/include/petscsys.h:193:
/home/p_mvgkm/p_mvgopt02/FreeFem/petsc/include/petscmath.h:429:45: error: unknown type name '__complex128'
PETSC_EXTERN MPI_Datatype MPIU___COMPLEX128 MPIU___COMPLEX128_ATTR_TAG;
^
/home/p_mvgkm/p_mvgopt02/FreeFem/petsc/include/petscmath.h:424:71: note: expanded from macro 'MPIU___COMPLEX128_ATTR_TAG'
#define MPIU___COMPLEX128_ATTR_TAG PETSC_ATTRIBUTE_MPI_TYPE_TAG(__complex128)
^
1 error generated.
gmake[3]: *** [gmakefile:203: arch-FreeFem-complex/obj/src/sys/objects/device/interface/device.o] Error 1
CXX arch-FreeFem-complex/obj/src/sys/objects/cxx/object_pool.o
In file included from /project/p_mvgopt02/FreeFem/petsc/src/sys/objects/cxx/object_pool.cxx:1:
In file included from /home/p_mvgkm/p_mvgopt02/FreeFem/petsc/include/petsc/private/cpp/object_pool.hpp:3:
In file included from /home/p_mvgkm/p_mvgopt02/FreeFem/petsc/include/petsc/private/petscimpl.h:5:
In file included from /home/p_mvgkm/p_mvgopt02/FreeFem/petsc/include/petscsys.h:193:
/home/p_mvgkm/p_mvgopt02/FreeFem/petsc/include/petscmath.h:429:45: error: unknown type name '__complex128'
PETSC_EXTERN MPI_Datatype MPIU___COMPLEX128 MPIU___COMPLEX128_ATTR_TAG;
^
/home/p_mvgkm/p_mvgopt02/FreeFem/petsc/include/petscmath.h:424:71: note: expanded from macro 'MPIU___COMPLEX128_ATTR_TAG'
#define MPIU___COMPLEX128_ATTR_TAG PETSC_ATTRIBUTE_MPI_TYPE_TAG(__complex128)
^
1 error generated.
gmake[3]: *** [gmakefile:203: arch-FreeFem-complex/obj/src/sys/objects/cxx/object_pool.o] Error 1
CXX arch-FreeFem-complex/obj/src/sys/objects/device/interface/dcontext.o
In file included from /project/p_mvgopt02/FreeFem/petsc/src/sys/objects/device/interface/dcontext.cxx:1:
In file included from /project/p_mvgopt02/FreeFem/petsc/src/sys/objects/device/interface/petscdevice_interface_internal.hpp:3:
In file included from /home/p_mvgkm/p_mvgopt02/FreeFem/petsc/include/petsc/private/deviceimpl.h:3:
In file included from /home/p_mvgkm/p_mvgopt02/FreeFem/petsc/include/petscdevice.h:3:
In file included from /home/p_mvgkm/p_mvgopt02/FreeFem/petsc/include/petscdevicetypes.h:3:
In file included from /home/p_mvgkm/p_mvgopt02/FreeFem/petsc/include/petscsys.h:193:
/home/p_mvgkm/p_mvgopt02/FreeFem/petsc/include/petscmath.h:429:45: error: unknown type name '__complex128'
PETSC_EXTERN MPI_Datatype MPIU___COMPLEX128 MPIU___COMPLEX128_ATTR_TAG;
^
/home/p_mvgkm/p_mvgopt02/FreeFem/petsc/include/petscmath.h:424:71: note: expanded from macro 'MPIU___COMPLEX128_ATTR_TAG'
#define MPIU___COMPLEX128_ATTR_TAG PETSC_ATTRIBUTE_MPI_TYPE_TAG(__complex128)
^
1 error generated.
gmake[3]: *** [gmakefile:203: arch-FreeFem-complex/obj/src/sys/objects/device/interface/dcontext.o] Error 1
CXX arch-FreeFem-complex/obj/src/sys/objects/device/interface/mark_dcontext.o
In file included from /project/p_mvgopt02/FreeFem/petsc/src/sys/objects/device/interface/mark_dcontext.cxx:1:
In file included from /project/p_mvgopt02/FreeFem/petsc/src/sys/objects/device/interface/petscdevice_interface_internal.hpp:3:
In file included from /home/p_mvgkm/p_mvgopt02/FreeFem/petsc/include/petsc/private/deviceimpl.h:3:
In file included from /home/p_mvgkm/p_mvgopt02/FreeFem/petsc/include/petscdevice.h:3:
In file included from /home/p_mvgkm/p_mvgopt02/FreeFem/petsc/include/petscdevicetypes.h:3:
In file included from /home/p_mvgkm/p_mvgopt02/FreeFem/petsc/include/petscsys.h:193:
/home/p_mvgkm/p_mvgopt02/FreeFem/petsc/include/petscmath.h:429:45: error: unknown type name '__complex128'
PETSC_EXTERN MPI_Datatype MPIU___COMPLEX128 MPIU___COMPLEX128_ATTR_TAG;
^
/home/p_mvgkm/p_mvgopt02/FreeFem/petsc/include/petscmath.h:424:71: note: expanded from macro 'MPIU___COMPLEX128_ATTR_TAG'
#define MPIU___COMPLEX128_ATTR_TAG PETSC_ATTRIBUTE_MPI_TYPE_TAG(__complex128)
^
1 error generated.
gmake[3]: *** [gmakefile:203: arch-FreeFem-complex/obj/src/sys/objects/device/interface/mark_dcontext.o] Error 1
gmake[2]: *** [/home/p_mvgkm/p_mvgopt02/FreeFem/petsc/lib/petsc/conf/rules.doc:28: libs] Error 2
**************************ERROR*************************************
Error during compile, check arch-FreeFem-complex/lib/petsc/conf/make.log
Send it and arch-FreeFem-complex/lib/petsc/conf/configure.log to petsc-maint@mcs.anl.gov
********************************************************************
Finishing make run at Mon, 06 Nov 2023 18:22:26 +0100
Sign up for free to join this conversation on GitHub. Already have an account? Sign in to comment