public
Created

  • Download Gist
gistfile1.txt
1 2 3 4 5 6 7 8 9 10 11 12 13 14 15 16 17 18 19 20 21 22 23 24 25 26 27 28 29 30 31 32 33 34 35 36 37 38 39 40 41 42 43 44 45 46 47 48 49 50 51 52 53 54 55 56 57 58 59 60 61 62 63 64 65 66 67 68 69 70 71 72 73 74 75 76 77 78 79 80 81 82 83 84 85 86 87 88 89 90 91 92 93 94 95 96 97 98
mike@sm-mike-thinkpad:~/workspace/rubinius_testing/unicorn-4.4.0$ RUBYLIB=/home/mike/.rvm/gems/rbx-2.0.testing/ make -j4 test
* test/unit/test_configurator.rb
* test/unit/test_droplet.rb
* test/unit/test_http_parser_ng.rb
* test/unit/test_http_parser.rb
: An exception occurred running test/unit/test_droplet.rb
: no such file to load -- rack (LoadError)
:
: Backtrace:
: Rubinius::CodeLoader#load_error at kernel/common/codeloader.rb:389
: Rubinius::CodeLoader#resolve_require_path at kernel/common/codeloader.rb:376
: { } in Rubinius::CodeLoader#require at kernel/common/codeloader.rb:104
: Rubinius.synchronize at kernel/bootstrap/rubinius.rb:150
: Rubinius::CodeLoader#require at kernel/common/codeloader.rb:103
: Rubinius::CodeLoader.require at kernel/common/codeloader.rb:206
: Kernel(Object)#require at kernel/common/kernel.rb:631
: Object#__script__ at test/rbx-rbx-2.0.testing/lib
: /unicorn.rb:5
: Rubinius::CodeLoader.require at kernel/common/codeloader.rb:212
: Kernel(Object)#require at kernel/common/kernel.rb:631
: Object#__script__ at test/unit/test_droplet.rb:2
: Rubinius::CodeLoader#load_script at kernel/delta/codeloader.rb:68
: Rubinius::CodeLoader.load_script at kernel/delta/codeloader.rb:118
: Rubinius::Loader#script at kernel/loader.rb:614
: Rubinius::Loader#main at kernel/loader.rb:815
make: *** [test/unit/test_droplet.rb] Error 1
make: *** Waiting for unfinished jobs....
: An exception occurred running test/unit/test_configurator.rb
: no such file to load -- rack (LoadError)
:
: Backtrace:
: Rubinius::CodeLoader#load_error at kernel/common/codeloader.rb:389
: Rubinius::CodeLoader#resolve_require_path at kernel/common/codeloader.rb:376
: { } in Rubinius::CodeLoader#require at kernel/common/codeloader.rb:104
: Rubinius.synchronize at kernel/bootstrap/rubinius.rb:150
: Rubinius::CodeLoader#require at kernel/common/codeloader.rb:103
: Rubinius::CodeLoader.require at kernel/common/codeloader.rb:206
: Kernel(Object)#require at kernel/common/kernel.rb:631
: Object#__script__ at test/rbx-rbx-2.0.testing/lib/unicorn.rb:5
: Rubinius::CodeLoader.require at kernel/common/codeloader.rb:212
: Kernel(Object)#require at kernel/common/kernel.rb:631
: Object#__script__ at test/unit/test_configurator.rb:5
: Rubinius::CodeLoader#load_script at kernel/delta/codeloader.rb:68
: Rubinius::CodeLoader.load_script at kernel/delta/codeloader.rb:118
: Rubinius::Loader#script at kernel/loader.rb:614
: Rubinius::Loader#main at kernel/loader.rb:815
make: *** [test/unit/test_configurator.rb] Error 1
: An exception occurred running test/unit/test_http_parser_ng.rb
: no such file to load -- rack (LoadError)
: An exception occurred running test/unit/test_http_parser.rb
:
: no such file to load -- rack (LoadError)
: Backtrace:
:
: Rubinius::CodeLoader#load_error at kernel/common/codeloader.rb:389
: Backtrace:
: Rubinius::CodeLoader#resolve_require_path at kernel/common/codeloader.rb:376
: Rubinius::CodeLoader#load_error at kernel/common/codeloader.rb:389
: { } in Rubinius::CodeLoader#require at kernel/common/codeloader.rb:104
: Rubinius::CodeLoader#resolve_require_path at kernel/common/codeloader.rb:376
: Rubinius.synchronize at kernel/bootstrap/rubinius.rb:150
: { } in Rubinius::CodeLoader#require at kernel/common/codeloader.rb:104
: Rubinius::CodeLoader#require at kernel/common/codeloader.rb:103
: Rubinius.synchronize at kernel/bootstrap/rubinius.rb:150
: Rubinius::CodeLoader.require at kernel/common/codeloader.rb:206
: Rubinius::CodeLoader#require at kernel/common/codeloader.rb:103
: Kernel(Object)#require at kernel/common/kernel.rb:631
: Rubinius::CodeLoader.require at kernel/common/codeloader.rb:206
: Object#__script__ at test/rbx-rbx-2.0.testing/lib
: Kernel(Object)#require at kernel/common/kernel.rb:631
: /unicorn.rb:5
: Object#__script__ at test/rbx-rbx-2.0.testing/lib
: Rubinius::CodeLoader.require at kernel/common/codeloader.rb:212
: /unicorn.rb:5
: Kernel(Object)#require at kernel/common/kernel.rb:631
: Object#__script__ at test/rbx-rbx-2.0.testing/test
: Rubinius::CodeLoader.require at kernel/common/codeloader.rb:212
: /test_helper.rb:30
: Kernel(Object)#require at kernel/common/kernel.rb:631
: Rubinius::CodeLoader.require at kernel/common/codeloader.rb:212
: Object#__script__ at test/rbx-rbx-2.0.testing/test
: Kernel(Object)#require at kernel/common/kernel.rb:631
: /test_helper.rb:30
: Object#__script__ at test/unit/test_http_parser_ng.rb:3
: Rubinius::CodeLoader.require at kernel/common/codeloader.rb:212
: Rubinius::CodeLoader#load_script at kernel/delta/codeloader.rb:68
: Rubinius::CodeLoader.load_script at kernel/delta/codeloader.rb:118
: Rubinius::Loader#script at kernel/loader.rb:614
: Rubinius::Loader#main at kernel/loader.rb:815
: Kernel(Object)#require at kernel/common/kernel.rb:631
: Object#__script__ at test/unit/test_http_parser.rb:10
: Rubinius::CodeLoader#load_script at kernel/delta/codeloader.rb:68
: Rubinius::CodeLoader.load_script at kernel/delta/codeloader.rb:118
: Rubinius::Loader#script at kernel/loader.rb:614
: Rubinius::Loader#main at kernel/loader.rb:815
make: *** [test/unit/test_http_parser_ng.rb] Error 1
make: *** [test/unit/test_http_parser.rb] Error 1
mike@sm-mike-thinkpad:~/workspace/rubinius_testing/unicorn-4.4.0$

Please sign in to comment on this gist.

Something went wrong with that request. Please try again.