Skip to content

Instantly share code, notes, and snippets.

Embed
What would you like to do?
C:\Workbench\NPanday\npanday-its-1.3-incubating>mvn clean test -Prun-its -Dnpanday.version=1.3-incubating
[INFO] Scanning for projects...
[WARNING]
[WARNING] Some problems were encountered while building the effective model for npanday.its:npanday-its:jar:1.3-incubating
[WARNING] 'build.plugins.plugin.version' for org.apache.maven.plugins:maven-compiler-plugin is missing. @ line 85, column 15
[WARNING] 'build.plugins.plugin.version' for org.apache.maven.plugins:maven-surefire-plugin is missing. @ line 39, column 15
[WARNING] 'build.plugins.plugin.version' for org.apache.maven.plugins:maven-jar-plugin is missing. @ line 60, column 15
[WARNING]
[WARNING] It is highly recommended to fix these problems because they threaten the stability of your build.
[WARNING]
[WARNING] For this reason, future Maven versions might no longer support building such malformed projects.
[WARNING]
[INFO]
[INFO] ------------------------------------------------------------------------
[INFO] Building NPanday Integration Tests Parent 1.3-incubating
[INFO] ------------------------------------------------------------------------
[INFO]
[INFO] --- maven-clean-plugin:2.4.1:clean (default-clean) @ npanday-its ---
[INFO] Deleting C:\Workbench\NPanday\npanday-its-1.3-incubating\target
[INFO]
[INFO] --- maven-resources-plugin:2.4.3:resources (default-resources) @ npanday-its ---
[WARNING] Using platform encoding (Cp1252 actually) to copy filtered resources, i.e. build is platform dependent!
[INFO] skip non existing resourceDirectory C:\Workbench\NPanday\npanday-its-1.3-incubating\src\main\resources
[INFO]
[INFO] --- maven-compiler-plugin:2.3.2:compile (default-compile) @ npanday-its ---
[INFO] No sources to compile
[INFO]
[INFO] --- maven-resources-plugin:2.4.3:testResources (default-testResources) @ npanday-its ---
[WARNING] Using platform encoding (Cp1252 actually) to copy filtered resources, i.e. build is platform dependent!
[INFO] Copying 386 resources
[INFO]
[INFO] --- maven-compiler-plugin:2.3.2:testCompile (default-testCompile) @ npanday-its ---
[WARNING] File encoding has not been set, using platform encoding Cp1252, i.e. build is platform dependent!
[INFO] Compiling 42 source files to C:\Workbench\NPanday\npanday-its-1.3-incubating\target\test-classes
[INFO]
[INFO] --- maven-surefire-plugin:2.7.1:test (default-test) @ npanday-its ---
[INFO] Surefire report directory: C:\Workbench\NPanday\npanday-its-1.3-incubating\target\surefire-reports
-------------------------------------------------------
T E S T S
-------------------------------------------------------
Running npanday.its.IntegrationTestSuite
Using NPanday version 1.3-incubating
Available framework versions: [v2.0.50727, v4.0.30319]
Selected framework version: v4.0.30319
Bootstrap(testBootstrap).. Ok
329WCF2010Project(testWCF2010Project).. Ok
328WPF2010Project(testWPF2010Project)..@SLTests run: 39, Failures: 1, Errors: 8, Skipped: 0, Time elapsed: 365.218 sec <<< FAILURE!
Results :
Failed tests:
testSnapDeploymentRemoteRepoNotUnique(npanday.its.NPandayIT0028RemoteSnapshotRepoTest)
Tests in error:
testWPF2010Project(npanday.its.NPandayIT328WPF2010ProjectTest)
testConflictingExtensions(npanday.its.NPandayIT10276ConflictingExtensionsTest)
testMixedVersionResolution(npanday.its.NPandayIT12940MixedVersionsTest)
testMVCProject(npanday.its.NPandayIT11480MVCProjectTest)
testWpfProject(npanday.its.NPandayIT12549WpfProjectTest)
testMsBuildCopyReferences(npanday.its.NPandayIT11695MsBuildCopyReferencesTest)
testNonUniqueSnapshotResolution(npanday.its.NPandayITSnapshotResolutionTest)
testNet35Project(npanday.its.NPandayITNet35Test)
Tests run: 39, Failures: 1, Errors: 8, Skipped: 0
[INFO] ------------------------------------------------------------------------
[INFO] BUILD FAILURE
[INFO] ------------------------------------------------------------------------
[INFO] Total time: 6:16.391s
[INFO] Finished at: Wed Feb 09 15:44:28 CET 2011
[INFO] Final Memory: 9M/110M
[INFO] ------------------------------------------------------------------------
[ERROR] Failed to execute goal org.apache.maven.plugins:maven-surefire-plugin:2.7.1:test (default-test) on project npanday-its: There are test failures.
[ERROR]
[ERROR] Please refer to C:\Workbench\NPanday\npanday-its-1.3-incubating\target\surefire-reports for the individual test results.
[ERROR] -> [Help 1]
[ERROR]
[ERROR] To see the full stack trace of the errors, re-run Maven with the -e switch.
[ERROR] Re-run Maven using the -X switch to enable full debug logging.
[ERROR]
[ERROR] For more information about the errors and possible solutions, please read the following articles:
[ERROR] [Help 1] http://cwiki.apache.org/confluence/display/MAVEN/MojoFailureException
C:\Workbench\NPanday\npanday-its-1.3-incubating>npp C:\Workbench\NPanday\npanday-its-1.3-incubating\target\surefire-reports
'npp' is not recognized as an internal or external command,
operable program or batch file.
<?xml version="1.0" encoding="UTF-8" ?>
<testsuite failures="1" time="365.218" errors="8" skipped="0" tests="39" name="npanday.its.IntegrationTestSuite">
<properties>
<property name="java.runtime.name" value="Java(TM) SE Runtime Environment"/>
<property name="sun.boot.library.path" value="C:\Program Files\Java\jdk1.6.0_23\jre\bin"/>
<property name="java.vm.version" value="19.0-b09"/>
<property name="npanday.version" value="1.3-incubating"/>
<property name="java.vm.vendor" value="Sun Microsystems Inc."/>
<property name="java.vendor.url" value="http://java.sun.com/"/>
<property name="path.separator" value=";"/>
<property name="java.vm.name" value="Java HotSpot(TM) 64-Bit Server VM"/>
<property name="npanday.version.force" value=""/>
<property name="file.encoding.pkg" value="sun.io"/>
<property name="user.country" value="DE"/>
<property name="sun.java.launcher" value="SUN_STANDARD"/>
<property name="sun.os.patch.level" value=""/>
<property name="java.vm.specification.name" value="Java Virtual Machine Specification"/>
<property name="user.dir" value="C:\Workbench\NPanday\npanday-its-1.3-incubating"/>
<property name="java.runtime.version" value="1.6.0_23-b05"/>
<property name="java.awt.graphicsenv" value="sun.awt.Win32GraphicsEnvironment"/>
<property name="basedir" value="C:\Workbench\NPanday\npanday-its-1.3-incubating"/>
<property name="java.endorsed.dirs" value="C:\Program Files\Java\jdk1.6.0_23\jre\lib\endorsed"/>
<property name="os.arch" value="amd64"/>
<property name="surefire.real.class.path" value="C:\Workbench\NPanday\npanday-its-1.3-incubating\target\surefire\surefirebooter509751529013066798.jar"/>
<property name="java.io.tmpdir" value="C:\Users\LARSCO~1\AppData\Local\Temp\"/>
<property name="line.separator" value="
"/>
<property name="java.vm.specification.vendor" value="Sun Microsystems Inc."/>
<property name="user.variant" value=""/>
<property name="os.name" value="Windows 7"/>
<property name="sun.jnu.encoding" value="Cp1252"/>
<property name="java.library.path" value="C:\Program Files\Java\jdk1.6.0_23\jre\bin;.;C:\Windows\Sun\Java\bin;C:\Windows\system32;C:\Windows;C:\Windows;C:\Windows\system32;C:\Windows\System32\Wbem;C:\Windows\System32\WindowsPowerShell\v1.0\;C:\Program Files (x86)\Microsoft F#\v4.0\;C:\Program Files (x86)\Microsoft Visual Studio 10.0\VSTSDB\Deploy;C:\Program Files (x86)\Microsoft Visual Studio 10.0\Common7\IDE\;C:\Program Files (x86)\Microsoft Visual Studio 10.0\VC\BIN;C:\Program Files (x86)\Microsoft Visual Studio 10.0\Common7\Tools;C:\Program Files (x86)\Microsoft Visual Studio 10.0\VC\VCPackages;C:\Program Files (x86)\HTML Help Workshop;C:\Program Files (x86)\Microsoft SDKs\Windows\v7.0A\bin\NETFX 4.0 Tools;C:\Program Files (x86)\Microsoft SDKs\Windows\v7.0A\bin;C:\Program Files\Common Files\Microsoft Shared\Windows Live;C:\Program Files (x86)\Common Files\Microsoft Shared\Windows Live;C:\Windows\Microsoft.NET\Framework\v4.0.30319;C:\Windows\Microsoft.NET\Framework\v3.5;C:\WINDOWS\Microsoft.NET\Framework\v2.0.50727;c:\Program Files (x86)\Microsoft SQL Server\100\Tools\Binn\;c:\Program Files\Microsoft SQL Server\100\Tools\Binn\;c:\Program Files\Microsoft SQL Server\100\DTS\Binn\;C:\Program Files\local-bin;c:\Program Files (x86)\Microsoft SQL Server\100\Tools\Binn\VSShell\Common7\IDE\;c:\Program Files (x86)\Microsoft SQL Server\100\DTS\Binn\;C:\Program Files (x86)\Windows Live\Shared;C:\Program Files (x86)\WinMerge;C:\Program Files (x86)\VisualSVN\bin;C:\Program Files (x86)\TortoiseHg\;c:\Program Files (x86)\Microsoft ASP.NET\ASP.NET Web Pages\v1.0\;C:\Program Files\Java\jdk1.6.0_23\bin;C:\Program Files\TortoiseSVN\bin;C:\Program Files (x86)\OpenVPNTech\bin;C:\Program Files\TortoiseGit\bin;C:\Program Files (x86)\Git\cmd;C:\Program Files (x86)\Git\bin;C:\Program Files (x86)\NUnit 2.5.9\bin\net-2.0;C:\Program Files\Apache\apache-maven-3.0.2\bin;"/>
<property name="surefire.test.class.path" value="C:\Workbench\NPanday\npanday-its-1.3-incubating\target\test-classes;C:\Workbench\NPanday\npanday-its-1.3-incubating\target\classes;C:\Users\Lars Corneliussen\.m2\repository\org\apache\maven\shared\maven-verifier\1.2\maven-verifier-1.2.jar;C:\Users\Lars Corneliussen\.m2\repository\junit\junit\3.8.2\junit-3.8.2.jar;C:\Users\Lars Corneliussen\.m2\repository\org\apache\maven\maven-artifact\2.0\maven-artifact-2.0.jar;C:\Users\Lars Corneliussen\.m2\repository\org\codehaus\plexus\plexus-utils\1.0.4\plexus-utils-1.0.4.jar;"/>
<property name="java.specification.name" value="Java Platform API Specification"/>
<property name="java.class.version" value="50.0"/>
<property name="sun.management.compiler" value="HotSpot 64-Bit Server Compiler"/>
<property name="os.version" value="6.1"/>
<property name="user.home" value="C:\Users\Lars Corneliussen"/>
<property name="user.timezone" value=""/>
<property name="java.awt.printerjob" value="sun.awt.windows.WPrinterJob"/>
<property name="java.specification.version" value="1.6"/>
<property name="file.encoding" value="Cp1252"/>
<property name="user.name" value="Lars Corneliussen"/>
<property name="java.class.path" value="C:\Workbench\NPanday\npanday-its-1.3-incubating\target\test-classes;C:\Workbench\NPanday\npanday-its-1.3-incubating\target\classes;C:\Users\Lars Corneliussen\.m2\repository\org\apache\maven\shared\maven-verifier\1.2\maven-verifier-1.2.jar;C:\Users\Lars Corneliussen\.m2\repository\junit\junit\3.8.2\junit-3.8.2.jar;C:\Users\Lars Corneliussen\.m2\repository\org\apache\maven\maven-artifact\2.0\maven-artifact-2.0.jar;C:\Users\Lars Corneliussen\.m2\repository\org\codehaus\plexus\plexus-utils\1.0.4\plexus-utils-1.0.4.jar;"/>
<property name="java.vm.specification.version" value="1.0"/>
<property name="sun.arch.data.model" value="64"/>
<property name="java.home" value="C:\Program Files\Java\jdk1.6.0_23\jre"/>
<property name="java.specification.vendor" value="Sun Microsystems Inc."/>
<property name="user.language" value="de"/>
<property name="debug.maven" value=""/>
<property name="awt.toolkit" value="sun.awt.windows.WToolkit"/>
<property name="java.vm.info" value="mixed mode"/>
<property name="java.version" value="1.6.0_23"/>
<property name="java.ext.dirs" value="C:\Program Files\Java\jdk1.6.0_23\jre\lib\ext;C:\Windows\Sun\Java\lib\ext"/>
<property name="sun.boot.class.path" value="C:\Program Files\Java\jdk1.6.0_23\jre\lib\resources.jar;C:\Program Files\Java\jdk1.6.0_23\jre\lib\rt.jar;C:\Program Files\Java\jdk1.6.0_23\jre\lib\sunrsasign.jar;C:\Program Files\Java\jdk1.6.0_23\jre\lib\jsse.jar;C:\Program Files\Java\jdk1.6.0_23\jre\lib\jce.jar;C:\Program Files\Java\jdk1.6.0_23\jre\lib\charsets.jar;C:\Program Files\Java\jdk1.6.0_23\jre\lib\modules\jdk.boot.jar;C:\Program Files\Java\jdk1.6.0_23\jre\classes"/>
<property name="java.vendor" value="Sun Microsystems Inc."/>
<property name="localRepository" value="C:\Users\Lars Corneliussen\.m2\repository"/>
<property name="file.separator" value="\"/>
<property name="java.vendor.url.bug" value="http://java.sun.com/cgi-bin/bugreport.cgi"/>
<property name="sun.cpu.endian" value="little"/>
<property name="sun.io.unicode.encoding" value="UnicodeLittle"/>
<property name="sun.desktop" value="windows"/>
<property name="sun.cpu.isalist" value="amd64"/>
</properties>
<testcase time="4.969" classname="npanday.its.BootstrapTest" name="testBootstrap"/>
<testcase time="6.985" classname="npanday.its.NPandayIT329WCF2010ProjectTest" name="testWCF2010Project"/>
<testcase time="4.125" classname="npanday.its.NPandayIT328WPF2010ProjectTest" name="testWPF2010Project">
<error message="Exit code was non-zero: 1; command line and log =
&quot;C:\Program Files\Apache\apache-maven-3.0.2\bin\mvn&quot; -Dnpanday.version=1.3-incubating -e --batch-mode &quot;-Dmaven.repo.local=C:\Users\Lars Corneliussen\.m2\repository&quot; org.apache.maven.plugins:maven-clean-plugin:clean test
[INFO] Error stacktraces are turned on.
[INFO] Scanning for projects...
[INFO]
[INFO] ------------------------------------------------------------------------
[INFO] Building NPanday.ITs.WpfApplication8 : WpfApplication8 1-SNAPSHOT
[INFO] ------------------------------------------------------------------------
[WARNING] The POM for System.Xaml:System.Xaml:dll:b77a5c561934e089:4.0.0.0 is missing, no dependency information available
[WARNING] The POM for WindowsBase:WindowsBase:dll:31bf3856ad364e35:4.0.0.0 is missing, no dependency information available
[WARNING] The POM for PresentationCore:PresentationCore:dll:31bf3856ad364e35:4.0.0.0 is missing, no dependency information available
[WARNING] The POM for PresentationFramework:PresentationFramework:dll:31bf3856ad364e35:4.0.0.0 is missing, no dependency information available
[INFO] ------------------------------------------------------------------------
[INFO] BUILD FAILURE
[INFO] ------------------------------------------------------------------------
[INFO] Total time: 2.422s
[INFO] Finished at: Wed Feb 09 15:38:39 CET 2011
[INFO] Final Memory: 4M/55M
[INFO] ------------------------------------------------------------------------
[ERROR] Failed to execute goal on project WpfApplication8: Could not resolve dependencies for project NPanday.ITs.WpfApplication8:WpfApplication8:winexe:1-SNAPSHOT: The following artifacts could not be resolved: System.Xaml:System.Xaml:dll:b77a5c561934e089:4.0.0.0, WindowsBase:WindowsBase:dll:31bf3856ad364e35:4.0.0.0, PresentationCore:PresentationCore:dll:31bf3856ad364e35:4.0.0.0, PresentationFramework:PresentationFramework:dll:31bf3856ad364e35:4.0.0.0: Failure to find System.Xaml:System.Xaml:dll:b77a5c561934e089:4.0.0.0 in http://repo1.maven.org/maven2 was cached in the local repository, resolution will not be reattempted until the update interval of central has elapsed or updates are forced -&gt; [Help 1]
org.apache.maven.lifecycle.LifecycleExecutionException: Failed to execute goal on project WpfApplication8: Could not resolve dependencies for project NPanday.ITs.WpfApplication8:WpfApplication8:winexe:1-SNAPSHOT: The following artifacts could not be resolved: System.Xaml:System.Xaml:dll:b77a5c561934e089:4.0.0.0, WindowsBase:WindowsBase:dll:31bf3856ad364e35:4.0.0.0, PresentationCore:PresentationCore:dll:31bf3856ad364e35:4.0.0.0, PresentationFramework:PresentationFramework:dll:31bf3856ad364e35:4.0.0.0: Failure to find System.Xaml:System.Xaml:dll:b77a5c561934e089:4.0.0.0 in http://repo1.maven.org/maven2 was cached in the local repository, resolution will not be reattempted until the update interval of central has elapsed or updates are forced
at org.apache.maven.lifecycle.internal.LifecycleDependencyResolver.getDependencies(LifecycleDependencyResolver.java:190)
at org.apache.maven.lifecycle.internal.LifecycleDependencyResolver.resolveProjectDependencies(LifecycleDependencyResolver.java:104)
at org.apache.maven.lifecycle.internal.MojoExecutor.ensureDependenciesAreResolved(MojoExecutor.java:258)
at org.apache.maven.lifecycle.internal.MojoExecutor.execute(MojoExecutor.java:201)
at org.apache.maven.lifecycle.internal.MojoExecutor.execute(MojoExecutor.java:153)
at org.apache.maven.lifecycle.internal.MojoExecutor.execute(MojoExecutor.java:145)
at org.apache.maven.lifecycle.internal.LifecycleModuleBuilder.buildProject(LifecycleModuleBuilder.java:84)
at org.apache.maven.lifecycle.internal.LifecycleModuleBuilder.buildProject(LifecycleModuleBuilder.java:59)
at org.apache.maven.lifecycle.internal.LifecycleStarter.singleThreadedBuild(LifecycleStarter.java:183)
at org.apache.maven.lifecycle.internal.LifecycleStarter.execute(LifecycleStarter.java:161)
at org.apache.maven.DefaultMaven.doExecute(DefaultMaven.java:319)
at org.apache.maven.DefaultMaven.execute(DefaultMaven.java:156)
at org.apache.maven.cli.MavenCli.execute(MavenCli.java:534)
at org.apache.maven.cli.MavenCli.doMain(MavenCli.java:196)
at org.apache.maven.cli.MavenCli.main(MavenCli.java:141)
at sun.reflect.NativeMethodAccessorImpl.invoke0(Native Method)
at sun.reflect.NativeMethodAccessorImpl.invoke(NativeMethodAccessorImpl.java:39)
at sun.reflect.DelegatingMethodAccessorImpl.invoke(DelegatingMethodAccessorImpl.java:25)
at java.lang.reflect.Method.invoke(Method.java:597)
at org.codehaus.plexus.classworlds.launcher.Launcher.launchEnhanced(Launcher.java:290)
at org.codehaus.plexus.classworlds.launcher.Launcher.launch(Launcher.java:230)
at org.codehaus.plexus.classworlds.launcher.Launcher.mainWithExitCode(Launcher.java:409)
at org.codehaus.plexus.classworlds.launcher.Launcher.main(Launcher.java:352)
Caused by: org.apache.maven.project.DependencyResolutionException: Could not resolve dependencies for project NPanday.ITs.WpfApplication8:WpfApplication8:winexe:1-SNAPSHOT: The following artifacts could not be resolved: System.Xaml:System.Xaml:dll:b77a5c561934e089:4.0.0.0, WindowsBase:WindowsBase:dll:31bf3856ad364e35:4.0.0.0, PresentationCore:PresentationCore:dll:31bf3856ad364e35:4.0.0.0, PresentationFramework:PresentationFramework:dll:31bf3856ad364e35:4.0.0.0: Failure to find System.Xaml:System.Xaml:dll:b77a5c561934e089:4.0.0.0 in http://repo1.maven.org/maven2 was cached in the local repository, resolution will not be reattempted until the update interval of central has elapsed or updates are forced
at org.apache.maven.project.DefaultProjectDependenciesResolver.resolve(DefaultProjectDependenciesResolver.java:156)
at org.apache.maven.lifecycle.internal.LifecycleDependencyResolver.getDependencies(LifecycleDependencyResolver.java:165)
... 22 more
Caused by: org.sonatype.aether.resolution.ArtifactResolutionException: The following artifacts could not be resolved: System.Xaml:System.Xaml:dll:b77a5c561934e089:4.0.0.0, WindowsBase:WindowsBase:dll:31bf3856ad364e35:4.0.0.0, PresentationCore:PresentationCore:dll:31bf3856ad364e35:4.0.0.0, PresentationFramework:PresentationFramework:dll:31bf3856ad364e35:4.0.0.0: Failure to find System.Xaml:System.Xaml:dll:b77a5c561934e089:4.0.0.0 in http://repo1.maven.org/maven2 was cached in the local repository, resolution will not be reattempted until the update interval of central has elapsed or updates are forced
at org.sonatype.aether.impl.internal.DefaultArtifactResolver.resolveArtifacts(DefaultArtifactResolver.java:526)
at org.sonatype.aether.impl.internal.DefaultRepositorySystem.resolveArtifacts(DefaultRepositorySystem.java:304)
at org.sonatype.aether.impl.internal.DefaultRepositorySystem.resolveDependencies(DefaultRepositorySystem.java:334)
at org.apache.maven.project.DefaultProjectDependenciesResolver.resolve(DefaultProjectDependenciesResolver.java:150)
... 23 more
Caused by: org.sonatype.aether.transfer.ArtifactNotFoundException: Failure to find System.Xaml:System.Xaml:dll:b77a5c561934e089:4.0.0.0 in http://repo1.maven.org/maven2 was cached in the local repository, resolution will not be reattempted until the update interval of central has elapsed or updates are forced
at org.sonatype.aether.impl.internal.DefaultUpdateCheckManager.checkArtifact(DefaultUpdateCheckManager.java:186)
at org.sonatype.aether.impl.internal.DefaultArtifactResolver.resolveArtifacts(DefaultArtifactResolver.java:408)
... 26 more
[ERROR]
[ERROR] Re-run Maven using the -X switch to enable full debug logging.
[ERROR]
[ERROR] For more information about the errors and possible solutions, please read the following articles:
[ERROR] [Help 1] http://cwiki.apache.org/confluence/display/MAVEN/DependencyResolutionException
" type="org.apache.maven.it.VerificationException">org.apache.maven.it.VerificationException: Exit code was non-zero: 1; command line and log =
&quot;C:\Program Files\Apache\apache-maven-3.0.2\bin\mvn&quot; -Dnpanday.version=1.3-incubating -e --batch-mode &quot;-Dmaven.repo.local=C:\Users\Lars Corneliussen\.m2\repository&quot; org.apache.maven.plugins:maven-clean-plugin:clean test
[INFO] Error stacktraces are turned on.
[INFO] Scanning for projects...
[INFO]
[INFO] ------------------------------------------------------------------------
[INFO] Building NPanday.ITs.WpfApplication8 : WpfApplication8 1-SNAPSHOT
[INFO] ------------------------------------------------------------------------
[WARNING] The POM for System.Xaml:System.Xaml:dll:b77a5c561934e089:4.0.0.0 is missing, no dependency information available
[WARNING] The POM for WindowsBase:WindowsBase:dll:31bf3856ad364e35:4.0.0.0 is missing, no dependency information available
[WARNING] The POM for PresentationCore:PresentationCore:dll:31bf3856ad364e35:4.0.0.0 is missing, no dependency information available
[WARNING] The POM for PresentationFramework:PresentationFramework:dll:31bf3856ad364e35:4.0.0.0 is missing, no dependency information available
[INFO] ------------------------------------------------------------------------
[INFO] BUILD FAILURE
[INFO] ------------------------------------------------------------------------
[INFO] Total time: 2.422s
[INFO] Finished at: Wed Feb 09 15:38:39 CET 2011
[INFO] Final Memory: 4M/55M
[INFO] ------------------------------------------------------------------------
[ERROR] Failed to execute goal on project WpfApplication8: Could not resolve dependencies for project NPanday.ITs.WpfApplication8:WpfApplication8:winexe:1-SNAPSHOT: The following artifacts could not be resolved: System.Xaml:System.Xaml:dll:b77a5c561934e089:4.0.0.0, WindowsBase:WindowsBase:dll:31bf3856ad364e35:4.0.0.0, PresentationCore:PresentationCore:dll:31bf3856ad364e35:4.0.0.0, PresentationFramework:PresentationFramework:dll:31bf3856ad364e35:4.0.0.0: Failure to find System.Xaml:System.Xaml:dll:b77a5c561934e089:4.0.0.0 in http://repo1.maven.org/maven2 was cached in the local repository, resolution will not be reattempted until the update interval of central has elapsed or updates are forced -&gt; [Help 1]
org.apache.maven.lifecycle.LifecycleExecutionException: Failed to execute goal on project WpfApplication8: Could not resolve dependencies for project NPanday.ITs.WpfApplication8:WpfApplication8:winexe:1-SNAPSHOT: The following artifacts could not be resolved: System.Xaml:System.Xaml:dll:b77a5c561934e089:4.0.0.0, WindowsBase:WindowsBase:dll:31bf3856ad364e35:4.0.0.0, PresentationCore:PresentationCore:dll:31bf3856ad364e35:4.0.0.0, PresentationFramework:PresentationFramework:dll:31bf3856ad364e35:4.0.0.0: Failure to find System.Xaml:System.Xaml:dll:b77a5c561934e089:4.0.0.0 in http://repo1.maven.org/maven2 was cached in the local repository, resolution will not be reattempted until the update interval of central has elapsed or updates are forced
at org.apache.maven.lifecycle.internal.LifecycleDependencyResolver.getDependencies(LifecycleDependencyResolver.java:190)
at org.apache.maven.lifecycle.internal.LifecycleDependencyResolver.resolveProjectDependencies(LifecycleDependencyResolver.java:104)
at org.apache.maven.lifecycle.internal.MojoExecutor.ensureDependenciesAreResolved(MojoExecutor.java:258)
at org.apache.maven.lifecycle.internal.MojoExecutor.execute(MojoExecutor.java:201)
at org.apache.maven.lifecycle.internal.MojoExecutor.execute(MojoExecutor.java:153)
at org.apache.maven.lifecycle.internal.MojoExecutor.execute(MojoExecutor.java:145)
at org.apache.maven.lifecycle.internal.LifecycleModuleBuilder.buildProject(LifecycleModuleBuilder.java:84)
at org.apache.maven.lifecycle.internal.LifecycleModuleBuilder.buildProject(LifecycleModuleBuilder.java:59)
at org.apache.maven.lifecycle.internal.LifecycleStarter.singleThreadedBuild(LifecycleStarter.java:183)
at org.apache.maven.lifecycle.internal.LifecycleStarter.execute(LifecycleStarter.java:161)
at org.apache.maven.DefaultMaven.doExecute(DefaultMaven.java:319)
at org.apache.maven.DefaultMaven.execute(DefaultMaven.java:156)
at org.apache.maven.cli.MavenCli.execute(MavenCli.java:534)
at org.apache.maven.cli.MavenCli.doMain(MavenCli.java:196)
at org.apache.maven.cli.MavenCli.main(MavenCli.java:141)
at sun.reflect.NativeMethodAccessorImpl.invoke0(Native Method)
at sun.reflect.NativeMethodAccessorImpl.invoke(NativeMethodAccessorImpl.java:39)
at sun.reflect.DelegatingMethodAccessorImpl.invoke(DelegatingMethodAccessorImpl.java:25)
at java.lang.reflect.Method.invoke(Method.java:597)
at org.codehaus.plexus.classworlds.launcher.Launcher.launchEnhanced(Launcher.java:290)
at org.codehaus.plexus.classworlds.launcher.Launcher.launch(Launcher.java:230)
at org.codehaus.plexus.classworlds.launcher.Launcher.mainWithExitCode(Launcher.java:409)
at org.codehaus.plexus.classworlds.launcher.Launcher.main(Launcher.java:352)
Caused by: org.apache.maven.project.DependencyResolutionException: Could not resolve dependencies for project NPanday.ITs.WpfApplication8:WpfApplication8:winexe:1-SNAPSHOT: The following artifacts could not be resolved: System.Xaml:System.Xaml:dll:b77a5c561934e089:4.0.0.0, WindowsBase:WindowsBase:dll:31bf3856ad364e35:4.0.0.0, PresentationCore:PresentationCore:dll:31bf3856ad364e35:4.0.0.0, PresentationFramework:PresentationFramework:dll:31bf3856ad364e35:4.0.0.0: Failure to find System.Xaml:System.Xaml:dll:b77a5c561934e089:4.0.0.0 in http://repo1.maven.org/maven2 was cached in the local repository, resolution will not be reattempted until the update interval of central has elapsed or updates are forced
at org.apache.maven.project.DefaultProjectDependenciesResolver.resolve(DefaultProjectDependenciesResolver.java:156)
at org.apache.maven.lifecycle.internal.LifecycleDependencyResolver.getDependencies(LifecycleDependencyResolver.java:165)
... 22 more
Caused by: org.sonatype.aether.resolution.ArtifactResolutionException: The following artifacts could not be resolved: System.Xaml:System.Xaml:dll:b77a5c561934e089:4.0.0.0, WindowsBase:WindowsBase:dll:31bf3856ad364e35:4.0.0.0, PresentationCore:PresentationCore:dll:31bf3856ad364e35:4.0.0.0, PresentationFramework:PresentationFramework:dll:31bf3856ad364e35:4.0.0.0: Failure to find System.Xaml:System.Xaml:dll:b77a5c561934e089:4.0.0.0 in http://repo1.maven.org/maven2 was cached in the local repository, resolution will not be reattempted until the update interval of central has elapsed or updates are forced
at org.sonatype.aether.impl.internal.DefaultArtifactResolver.resolveArtifacts(DefaultArtifactResolver.java:526)
at org.sonatype.aether.impl.internal.DefaultRepositorySystem.resolveArtifacts(DefaultRepositorySystem.java:304)
at org.sonatype.aether.impl.internal.DefaultRepositorySystem.resolveDependencies(DefaultRepositorySystem.java:334)
at org.apache.maven.project.DefaultProjectDependenciesResolver.resolve(DefaultProjectDependenciesResolver.java:150)
... 23 more
Caused by: org.sonatype.aether.transfer.ArtifactNotFoundException: Failure to find System.Xaml:System.Xaml:dll:b77a5c561934e089:4.0.0.0 in http://repo1.maven.org/maven2 was cached in the local repository, resolution will not be reattempted until the update interval of central has elapsed or updates are forced
at org.sonatype.aether.impl.internal.DefaultUpdateCheckManager.checkArtifact(DefaultUpdateCheckManager.java:186)
at org.sonatype.aether.impl.internal.DefaultArtifactResolver.resolveArtifacts(DefaultArtifactResolver.java:408)
... 26 more
[ERROR]
[ERROR] Re-run Maven using the -X switch to enable full debug logging.
[ERROR]
[ERROR] For more information about the errors and possible solutions, please read the following articles:
[ERROR] [Help 1] http://cwiki.apache.org/confluence/display/MAVEN/DependencyResolutionException
at org.apache.maven.it.Verifier.executeGoals(Verifier.java:1297)
at org.apache.maven.it.Verifier.executeGoal(Verifier.java:1145)
at org.apache.maven.it.Verifier.executeGoal(Verifier.java:1139)
at npanday.its.NPandayIT328WPF2010ProjectTest.testWPF2010Project(NPandayIT328WPF2010ProjectTest.java:37)
at sun.reflect.NativeMethodAccessorImpl.invoke0(Native Method)
at sun.reflect.NativeMethodAccessorImpl.invoke(NativeMethodAccessorImpl.java:39)
at sun.reflect.DelegatingMethodAccessorImpl.invoke(DelegatingMethodAccessorImpl.java:25)
at java.lang.reflect.Method.invoke(Method.java:597)
at junit.framework.TestCase.runTest(TestCase.java:164)
at npanday.its.AbstractNPandayIntegrationTestCase.runTest(AbstractNPandayIntegrationTestCase.java:218)
at junit.framework.TestCase.runBare(TestCase.java:130)
at junit.framework.TestResult$1.protect(TestResult.java:106)
at junit.framework.TestResult.runProtected(TestResult.java:124)
at junit.framework.TestResult.run(TestResult.java:109)
at junit.framework.TestCase.run(TestCase.java:120)
at junit.framework.TestSuite.runTest(TestSuite.java:230)
at junit.framework.TestSuite.run(TestSuite.java:225)
at junit.framework.TestSuite.runTest(TestSuite.java:230)
at junit.framework.TestSuite.run(TestSuite.java:225)
at sun.reflect.NativeMethodAccessorImpl.invoke0(Native Method)
at sun.reflect.NativeMethodAccessorImpl.invoke(NativeMethodAccessorImpl.java:39)
at sun.reflect.DelegatingMethodAccessorImpl.invoke(DelegatingMethodAccessorImpl.java:25)
at java.lang.reflect.Method.invoke(Method.java:597)
at org.apache.maven.surefire.junit.JUnitTestSet.execute(JUnitTestSet.java:207)
at org.apache.maven.surefire.junit.JUnit3Provider.executeTestSet(JUnit3Provider.java:107)
at org.apache.maven.surefire.junit.JUnit3Provider.invoke(JUnit3Provider.java:79)
at sun.reflect.NativeMethodAccessorImpl.invoke0(Native Method)
at sun.reflect.NativeMethodAccessorImpl.invoke(NativeMethodAccessorImpl.java:39)
at sun.reflect.DelegatingMethodAccessorImpl.invoke(DelegatingMethodAccessorImpl.java:25)
at java.lang.reflect.Method.invoke(Method.java:597)
at org.apache.maven.surefire.booter.ProviderFactory$ClassLoaderProxy.invoke(ProviderFactory.java:103)
at $Proxy0.invoke(Unknown Source)
at org.apache.maven.surefire.booter.SurefireStarter.invokeProvider(SurefireStarter.java:145)
at org.apache.maven.surefire.booter.SurefireStarter.runSuitesInProcess(SurefireStarter.java:87)
at org.apache.maven.surefire.booter.ForkedBooter.main(ForkedBooter.java:69)
Caused by: org.apache.maven.project.DependencyResolutionException: Could not resolve dependencies for project NPanday.ITs.WpfApplication8:WpfApplication8:winexe:1-SNAPSHOT: The following artifacts could not be resolved: System.Xaml:System.Xaml:dll:b77a5c561934e089:4.0.0.0, WindowsBase:WindowsBase:dll:31bf3856ad364e35:4.0.0.0, PresentationCore:PresentationCore:dll:31bf3856ad364e35:4.0.0.0, PresentationFramework:PresentationFramework:dll:31bf3856ad364e35:4.0.0.0: Failure to find System.Xaml:System.Xaml:dll:b77a5c561934e089:4.0.0.0 in http://repo1.maven.org/maven2 was cached in the local repository, resolution will not be reattempted until the update interval of central has elapsed or updates are forced
at org.apache.maven.project.DefaultProjectDependenciesResolver.resolve(DefaultProjectDependenciesResolver.java:156)
at org.apache.maven.lifecycle.internal.LifecycleDependencyResolver.getDependencies(LifecycleDependencyResolver.java:165)
... 22 more
Caused by: org.sonatype.aether.resolution.ArtifactResolutionException: The following artifacts could not be resolved: System.Xaml:System.Xaml:dll:b77a5c561934e089:4.0.0.0, WindowsBase:WindowsBase:dll:31bf3856ad364e35:4.0.0.0, PresentationCore:PresentationCore:dll:31bf3856ad364e35:4.0.0.0, PresentationFramework:PresentationFramework:dll:31bf3856ad364e35:4.0.0.0: Failure to find System.Xaml:System.Xaml:dll:b77a5c561934e089:4.0.0.0 in http://repo1.maven.org/maven2 was cached in the local repository, resolution will not be reattempted until the update interval of central has elapsed or updates are forced
at org.sonatype.aether.impl.internal.DefaultArtifactResolver.resolveArtifacts(DefaultArtifactResolver.java:526)
at org.sonatype.aether.impl.internal.DefaultRepositorySystem.resolveArtifacts(DefaultRepositorySystem.java:304)
at org.sonatype.aether.impl.internal.DefaultRepositorySystem.resolveDependencies(DefaultRepositorySystem.java:334)
at org.apache.maven.project.DefaultProjectDependenciesResolver.resolve(DefaultProjectDependenciesResolver.java:150)
... 23 more
Caused by: org.sonatype.aether.transfer.ArtifactNotFoundException: Failure to find System.Xaml:System.Xaml:dll:b77a5c561934e089:4.0.0.0 in http://repo1.maven.org/maven2 was cached in the local repository, resolution will not be reattempted until the update interval of central has elapsed or updates are forced
at org.sonatype.aether.impl.internal.DefaultUpdateCheckManager.checkArtifact(DefaultUpdateCheckManager.java:186)
at org.sonatype.aether.impl.internal.DefaultArtifactResolver.resolveArtifacts(DefaultArtifactResolver.java:408)
... 26 more
[ERROR]
[ERROR] Re-run Maven using the -X switch to enable full debug logging.
[ERROR]
[ERROR] For more information about the errors and possible solutions, please read the following articles:
[ERROR] [Help 1] http://cwiki.apache.org/confluence/display/MAVEN/DependencyResolutionException
at org.apache.maven.it.Verifier.executeGoals(Verifier.java:1297)
at org.apache.maven.it.Verifier.executeGoal(Verifier.java:1145)
at org.apache.maven.it.Verifier.executeGoal(Verifier.java:1139)
at npanday.its.NPandayIT328WPF2010ProjectTest.testWPF2010Project(NPandayIT328WPF2010ProjectTest.java:37)
at sun.reflect.NativeMethodAccessorImpl.invoke0(Native Method)
at sun.reflect.NativeMethodAccessorImpl.invoke(NativeMethodAccessorImpl.java:39)
at sun.reflect.DelegatingMethodAccessorImpl.invoke(DelegatingMethodAccessorImpl.java:25)
at java.lang.reflect.Method.invoke(Method.java:597)
at junit.framework.TestCase.runTest(TestCase.java:164)
at npanday.its.AbstractNPandayIntegrationTestCase.runTest(AbstractNPandayIntegrationTestCase.java:218)
at junit.framework.TestCase.runBare(TestCase.java:130)
at junit.framework.TestResult$1.protect(TestResult.java:106)
at junit.framework.TestResult.runProtected(TestResult.java:124)
at junit.framework.TestResult.run(TestResult.java:109)
at junit.framework.TestCase.run(TestCase.java:120)
at junit.framework.TestSuite.runTest(TestSuite.java:230)
at junit.framework.TestSuite.run(TestSuite.java:225)
at junit.framework.TestSuite.runTest(TestSuite.java:230)
at junit.framework.TestSuite.run(TestSuite.java:225)
at sun.reflect.NativeMethodAccessorImpl.invoke0(Native Method)
at sun.reflect.NativeMethodAccessorImpl.invoke(NativeMethodAccessorImpl.java:39)
at sun.reflect.DelegatingMethodAccessorImpl.invoke(DelegatingMethodAccessorImpl.java:25)
at java.lang.reflect.Method.invoke(Method.java:597)
at org.apache.maven.surefire.junit.JUnitTestSet.execute(JUnitTestSet.java:207)
at org.apache.maven.surefire.junit.JUnit3Provider.executeTestSet(JUnit3Provider.java:107)
at org.apache.maven.surefire.junit.JUnit3Provider.invoke(JUnit3Provider.java:79)
at sun.reflect.NativeMethodAccessorImpl.invoke0(Native Method)
at sun.reflect.NativeMethodAccessorImpl.invoke(NativeMethodAccessorImpl.java:39)
at sun.reflect.DelegatingMethodAccessorImpl.invoke(DelegatingMethodAccessorImpl.java:25)
at java.lang.reflect.Method.invoke(Method.java:597)
at org.apache.maven.surefire.booter.ProviderFactory$ClassLoaderProxy.invoke(ProviderFactory.java:103)
at $Proxy0.invoke(Unknown Source)
at org.apache.maven.surefire.booter.SurefireStarter.invokeProvider(SurefireStarter.java:145)
at org.apache.maven.surefire.booter.SurefireStarter.runSuitesInProcess(SurefireStarter.java:87)
at org.apache.maven.surefire.booter.ForkedBooter.main(ForkedBooter.java:69)
</error>
<system-out>328WPF2010Project(testWPF2010Project)..</system-out>
</testcase>
<testcase time="8.469" classname="npanday.its.NPandayIT330MVC2010ProjectTest" name="testMVC2010Project"/>
<testcase time="7.656" classname="npanday.its.NPandayITNet40Test" name="testNet40Project"/>
<testcase time="12.094" classname="npanday.its.NPandayIT13635SnapshotUpdatesTest" name="testUniqueSnapshotUpdates"/>
<testcase time="8.922" classname="npanday.its.NPandayIT13542OptionInferTest" name="testWithOptionInfer"/>
<testcase time="4.781" classname="npanday.its.NPandayIT10276ConflictingExtensionsTest" name="testConflictingExtensions">
<error message="Exit code was non-zero: 1; command line and log =
&quot;C:\Program Files\Apache\apache-maven-3.0.2\bin\mvn&quot; -Dnpanday.version=1.3-incubating -e --batch-mode &quot;-Dmaven.repo.local=C:\Users\Lars Corneliussen\.m2\repository&quot; org.apache.maven.plugins:maven-clean-plugin:clean install
[INFO] Error stacktraces are turned on.
[INFO] Scanning for projects...
Downloading: http://repo1.maven.org/maven2/org/servebox/flex/flex-plugin/2.3.0/flex-plugin-2.3.0.pom
[WARNING] The POM for org.servebox.flex:flex-plugin:jar:2.3.0 is missing, no dependency information available
Downloading: http://repo1.maven.org/maven2/org/servebox/flex/flex-plugin/2.3.0/flex-plugin-2.3.0.jar
[ERROR] The build could not read 1 project -&gt; [Help 1]
org.apache.maven.project.ProjectBuildingException: Some problems were encountered while processing the POMs:
[ERROR] Unresolveable build extension: Plugin org.servebox.flex:flex-plugin:2.3.0 or one of its dependencies could not be resolved: Could not find artifact org.servebox.flex:flex-plugin:jar:2.3.0 in central (http://repo1.maven.org/maven2) @
[ERROR] Unknown packaging: swc @ line 29, column 14
at org.apache.maven.project.DefaultProjectBuilder.build(DefaultProjectBuilder.java:325)
at org.apache.maven.DefaultMaven.collectProjects(DefaultMaven.java:632)
at org.apache.maven.DefaultMaven.getProjectsForMavenReactor(DefaultMaven.java:581)
at org.apache.maven.DefaultMaven.doExecute(DefaultMaven.java:233)
at org.apache.maven.DefaultMaven.execute(DefaultMaven.java:156)
at org.apache.maven.cli.MavenCli.execute(MavenCli.java:534)
at org.apache.maven.cli.MavenCli.doMain(MavenCli.java:196)
at org.apache.maven.cli.MavenCli.main(MavenCli.java:141)
at sun.reflect.NativeMethodAccessorImpl.invoke0(Native Method)
at sun.reflect.NativeMethodAccessorImpl.invoke(NativeMethodAccessorImpl.java:39)
at sun.reflect.DelegatingMethodAccessorImpl.invoke(DelegatingMethodAccessorImpl.java:25)
at java.lang.reflect.Method.invoke(Method.java:597)
at org.codehaus.plexus.classworlds.launcher.Launcher.launchEnhanced(Launcher.java:290)
at org.codehaus.plexus.classworlds.launcher.Launcher.launch(Launcher.java:230)
at org.codehaus.plexus.classworlds.launcher.Launcher.mainWithExitCode(Launcher.java:409)
at org.codehaus.plexus.classworlds.launcher.Launcher.main(Launcher.java:352)
[ERROR]
[ERROR] The project NPandayIT10276:flex-project:1.0-SNAPSHOT (C:\Workbench\NPanday\npanday-its-1.3-incubating\target\test-classes\NPandayIT10276\flex-project\pom.xml) has 2 errors
[ERROR] Unresolveable build extension: Plugin org.servebox.flex:flex-plugin:2.3.0 or one of its dependencies could not be resolved: Could not find artifact org.servebox.flex:flex-plugin:jar:2.3.0 in central (http://repo1.maven.org/maven2) -&gt; [Help 2]
org.apache.maven.plugin.PluginResolutionException: Plugin org.servebox.flex:flex-plugin:2.3.0 or one of its dependencies could not be resolved: Could not find artifact org.servebox.flex:flex-plugin:jar:2.3.0 in central (http://repo1.maven.org/maven2)
at org.apache.maven.plugin.internal.DefaultPluginDependenciesResolver.resolve(DefaultPluginDependenciesResolver.java:199)
at org.apache.maven.project.DefaultProjectBuildingHelper.resolveExtensionArtifacts(DefaultProjectBuildingHelper.java:377)
at org.apache.maven.project.DefaultProjectBuildingHelper.createProjectRealm(DefaultProjectBuildingHelper.java:237)
at org.apache.maven.project.DefaultModelBuildingListener.buildExtensionsAssembled(DefaultModelBuildingListener.java:106)
at org.apache.maven.model.building.ModelBuildingEventCatapult$1.fire(ModelBuildingEventCatapult.java:43)
at org.apache.maven.model.building.DefaultModelBuilder.fireEvent(DefaultModelBuilder.java:1041)
at org.apache.maven.model.building.DefaultModelBuilder.build(DefaultModelBuilder.java:391)
at org.apache.maven.model.building.DefaultModelBuilder.build(DefaultModelBuilder.java:374)
at org.apache.maven.project.DefaultProjectBuilder.build(DefaultProjectBuilder.java:482)
at org.apache.maven.project.DefaultProjectBuilder.build(DefaultProjectBuilder.java:488)
at org.apache.maven.project.DefaultProjectBuilder.build(DefaultProjectBuilder.java:314)
at org.apache.maven.DefaultMaven.collectProjects(DefaultMaven.java:632)
at org.apache.maven.DefaultMaven.getProjectsForMavenReactor(DefaultMaven.java:581)
at org.apache.maven.DefaultMaven.doExecute(DefaultMaven.java:233)
at org.apache.maven.DefaultMaven.execute(DefaultMaven.java:156)
at org.apache.maven.cli.MavenCli.execute(MavenCli.java:534)
at org.apache.maven.cli.MavenCli.doMain(MavenCli.java:196)
at org.apache.maven.cli.MavenCli.main(MavenCli.java:141)
at sun.reflect.NativeMethodAccessorImpl.invoke0(Native Method)
at sun.reflect.NativeMethodAccessorImpl.invoke(NativeMethodAccessorImpl.java:39)
at sun.reflect.DelegatingMethodAccessorImpl.invoke(DelegatingMethodAccessorImpl.java:25)
at java.lang.reflect.Method.invoke(Method.java:597)
at org.codehaus.plexus.classworlds.launcher.Launcher.launchEnhanced(Launcher.java:290)
at org.codehaus.plexus.classworlds.launcher.Launcher.launch(Launcher.java:230)
at org.codehaus.plexus.classworlds.launcher.Launcher.mainWithExitCode(Launcher.java:409)
at org.codehaus.plexus.classworlds.launcher.Launcher.main(Launcher.java:352)
Caused by: org.sonatype.aether.resolution.ArtifactResolutionException: Could not find artifact org.servebox.flex:flex-plugin:jar:2.3.0 in central (http://repo1.maven.org/maven2)
at org.sonatype.aether.impl.internal.DefaultArtifactResolver.resolveArtifacts(DefaultArtifactResolver.java:526)
at org.sonatype.aether.impl.internal.DefaultRepositorySystem.resolveArtifacts(DefaultRepositorySystem.java:304)
at org.sonatype.aether.impl.internal.DefaultRepositorySystem.resolveDependencies(DefaultRepositorySystem.java:334)
at org.apache.maven.plugin.internal.DefaultPluginDependenciesResolver.resolve(DefaultPluginDependenciesResolver.java:191)
... 25 more
Caused by: org.sonatype.aether.transfer.ArtifactNotFoundException: Could not find artifact org.servebox.flex:flex-plugin:jar:2.3.0 in central (http://repo1.maven.org/maven2)
at org.sonatype.aether.connector.wagon.WagonRepositoryConnector$4.wrap(WagonRepositoryConnector.java:945)
at org.sonatype.aether.connector.wagon.WagonRepositoryConnector$4.wrap(WagonRepositoryConnector.java:940)
at org.sonatype.aether.connector.wagon.WagonRepositoryConnector$GetTask.flush(WagonRepositoryConnector.java:696)
at org.sonatype.aether.connector.wagon.WagonRepositoryConnector$GetTask.flush(WagonRepositoryConnector.java:690)
at org.sonatype.aether.connector.wagon.WagonRepositoryConnector.get(WagonRepositoryConnector.java:435)
at org.sonatype.aether.impl.internal.DefaultArtifactResolver.resolveArtifacts(DefaultArtifactResolver.java:438)
... 28 more
[ERROR] Unknown packaging: swc @ line 29, column 14
[ERROR]
[ERROR] Re-run Maven using the -X switch to enable full debug logging.
[ERROR]
[ERROR] For more information about the errors and possible solutions, please read the following articles:
[ERROR] [Help 1] http://cwiki.apache.org/confluence/display/MAVEN/ProjectBuildingException
[ERROR] [Help 2] http://cwiki.apache.org/confluence/display/MAVEN/PluginResolutionException
" type="org.apache.maven.it.VerificationException">org.apache.maven.it.VerificationException: Exit code was non-zero: 1; command line and log =
&quot;C:\Program Files\Apache\apache-maven-3.0.2\bin\mvn&quot; -Dnpanday.version=1.3-incubating -e --batch-mode &quot;-Dmaven.repo.local=C:\Users\Lars Corneliussen\.m2\repository&quot; org.apache.maven.plugins:maven-clean-plugin:clean install
[INFO] Error stacktraces are turned on.
[INFO] Scanning for projects...
Downloading: http://repo1.maven.org/maven2/org/servebox/flex/flex-plugin/2.3.0/flex-plugin-2.3.0.pom
[WARNING] The POM for org.servebox.flex:flex-plugin:jar:2.3.0 is missing, no dependency information available
Downloading: http://repo1.maven.org/maven2/org/servebox/flex/flex-plugin/2.3.0/flex-plugin-2.3.0.jar
[ERROR] The build could not read 1 project -&gt; [Help 1]
org.apache.maven.project.ProjectBuildingException: Some problems were encountered while processing the POMs:
[ERROR] Unresolveable build extension: Plugin org.servebox.flex:flex-plugin:2.3.0 or one of its dependencies could not be resolved: Could not find artifact org.servebox.flex:flex-plugin:jar:2.3.0 in central (http://repo1.maven.org/maven2) @
[ERROR] Unknown packaging: swc @ line 29, column 14
at org.apache.maven.project.DefaultProjectBuilder.build(DefaultProjectBuilder.java:325)
at org.apache.maven.DefaultMaven.collectProjects(DefaultMaven.java:632)
at org.apache.maven.DefaultMaven.getProjectsForMavenReactor(DefaultMaven.java:581)
at org.apache.maven.DefaultMaven.doExecute(DefaultMaven.java:233)
at org.apache.maven.DefaultMaven.execute(DefaultMaven.java:156)
at org.apache.maven.cli.MavenCli.execute(MavenCli.java:534)
at org.apache.maven.cli.MavenCli.doMain(MavenCli.java:196)
at org.apache.maven.cli.MavenCli.main(MavenCli.java:141)
at sun.reflect.NativeMethodAccessorImpl.invoke0(Native Method)
at sun.reflect.NativeMethodAccessorImpl.invoke(NativeMethodAccessorImpl.java:39)
at sun.reflect.DelegatingMethodAccessorImpl.invoke(DelegatingMethodAccessorImpl.java:25)
at java.lang.reflect.Method.invoke(Method.java:597)
at org.codehaus.plexus.classworlds.launcher.Launcher.launchEnhanced(Launcher.java:290)
at org.codehaus.plexus.classworlds.launcher.Launcher.launch(Launcher.java:230)
at org.codehaus.plexus.classworlds.launcher.Launcher.mainWithExitCode(Launcher.java:409)
at org.codehaus.plexus.classworlds.launcher.Launcher.main(Launcher.java:352)
[ERROR]
[ERROR] The project NPandayIT10276:flex-project:1.0-SNAPSHOT (C:\Workbench\NPanday\npanday-its-1.3-incubating\target\test-classes\NPandayIT10276\flex-project\pom.xml) has 2 errors
[ERROR] Unresolveable build extension: Plugin org.servebox.flex:flex-plugin:2.3.0 or one of its dependencies could not be resolved: Could not find artifact org.servebox.flex:flex-plugin:jar:2.3.0 in central (http://repo1.maven.org/maven2) -&gt; [Help 2]
org.apache.maven.plugin.PluginResolutionException: Plugin org.servebox.flex:flex-plugin:2.3.0 or one of its dependencies could not be resolved: Could not find artifact org.servebox.flex:flex-plugin:jar:2.3.0 in central (http://repo1.maven.org/maven2)
at org.apache.maven.plugin.internal.DefaultPluginDependenciesResolver.resolve(DefaultPluginDependenciesResolver.java:199)
at org.apache.maven.project.DefaultProjectBuildingHelper.resolveExtensionArtifacts(DefaultProjectBuildingHelper.java:377)
at org.apache.maven.project.DefaultProjectBuildingHelper.createProjectRealm(DefaultProjectBuildingHelper.java:237)
at org.apache.maven.project.DefaultModelBuildingListener.buildExtensionsAssembled(DefaultModelBuildingListener.java:106)
at org.apache.maven.model.building.ModelBuildingEventCatapult$1.fire(ModelBuildingEventCatapult.java:43)
at org.apache.maven.model.building.DefaultModelBuilder.fireEvent(DefaultModelBuilder.java:1041)
at org.apache.maven.model.building.DefaultModelBuilder.build(DefaultModelBuilder.java:391)
at org.apache.maven.model.building.DefaultModelBuilder.build(DefaultModelBuilder.java:374)
at org.apache.maven.project.DefaultProjectBuilder.build(DefaultProjectBuilder.java:482)
at org.apache.maven.project.DefaultProjectBuilder.build(DefaultProjectBuilder.java:488)
at org.apache.maven.project.DefaultProjectBuilder.build(DefaultProjectBuilder.java:314)
at org.apache.maven.DefaultMaven.collectProjects(DefaultMaven.java:632)
at org.apache.maven.DefaultMaven.getProjectsForMavenReactor(DefaultMaven.java:581)
at org.apache.maven.DefaultMaven.doExecute(DefaultMaven.java:233)
at org.apache.maven.DefaultMaven.execute(DefaultMaven.java:156)
at org.apache.maven.cli.MavenCli.execute(MavenCli.java:534)
at org.apache.maven.cli.MavenCli.doMain(MavenCli.java:196)
at org.apache.maven.cli.MavenCli.main(MavenCli.java:141)
at sun.reflect.NativeMethodAccessorImpl.invoke0(Native Method)
at sun.reflect.NativeMethodAccessorImpl.invoke(NativeMethodAccessorImpl.java:39)
at sun.reflect.DelegatingMethodAccessorImpl.invoke(DelegatingMethodAccessorImpl.java:25)
at java.lang.reflect.Method.invoke(Method.java:597)
at org.codehaus.plexus.classworlds.launcher.Launcher.launchEnhanced(Launcher.java:290)
at org.codehaus.plexus.classworlds.launcher.Launcher.launch(Launcher.java:230)
at org.codehaus.plexus.classworlds.launcher.Launcher.mainWithExitCode(Launcher.java:409)
at org.codehaus.plexus.classworlds.launcher.Launcher.main(Launcher.java:352)
Caused by: org.sonatype.aether.resolution.ArtifactResolutionException: Could not find artifact org.servebox.flex:flex-plugin:jar:2.3.0 in central (http://repo1.maven.org/maven2)
at org.sonatype.aether.impl.internal.DefaultArtifactResolver.resolveArtifacts(DefaultArtifactResolver.java:526)
at org.sonatype.aether.impl.internal.DefaultRepositorySystem.resolveArtifacts(DefaultRepositorySystem.java:304)
at org.sonatype.aether.impl.internal.DefaultRepositorySystem.resolveDependencies(DefaultRepositorySystem.java:334)
at org.apache.maven.plugin.internal.DefaultPluginDependenciesResolver.resolve(DefaultPluginDependenciesResolver.java:191)
... 25 more
Caused by: org.sonatype.aether.transfer.ArtifactNotFoundException: Could not find artifact org.servebox.flex:flex-plugin:jar:2.3.0 in central (http://repo1.maven.org/maven2)
at org.sonatype.aether.connector.wagon.WagonRepositoryConnector$4.wrap(WagonRepositoryConnector.java:945)
at org.sonatype.aether.connector.wagon.WagonRepositoryConnector$4.wrap(WagonRepositoryConnector.java:940)
at org.sonatype.aether.connector.wagon.WagonRepositoryConnector$GetTask.flush(WagonRepositoryConnector.java:696)
at org.sonatype.aether.connector.wagon.WagonRepositoryConnector$GetTask.flush(WagonRepositoryConnector.java:690)
at org.sonatype.aether.connector.wagon.WagonRepositoryConnector.get(WagonRepositoryConnector.java:435)
at org.sonatype.aether.impl.internal.DefaultArtifactResolver.resolveArtifacts(DefaultArtifactResolver.java:438)
... 28 more
[ERROR] Unknown packaging: swc @ line 29, column 14
[ERROR]
[ERROR] Re-run Maven using the -X switch to enable full debug logging.
[ERROR]
[ERROR] For more information about the errors and possible solutions, please read the following articles:
[ERROR] [Help 1] http://cwiki.apache.org/confluence/display/MAVEN/ProjectBuildingException
[ERROR] [Help 2] http://cwiki.apache.org/confluence/display/MAVEN/PluginResolutionException
at org.apache.maven.it.Verifier.executeGoals(Verifier.java:1297)
at org.apache.maven.it.Verifier.executeGoal(Verifier.java:1145)
at org.apache.maven.it.Verifier.executeGoal(Verifier.java:1139)
at npanday.its.NPandayIT10276ConflictingExtensionsTest.testConflictingExtensions(NPandayIT10276ConflictingExtensionsTest.java:43)
at sun.reflect.NativeMethodAccessorImpl.invoke0(Native Method)
at sun.reflect.NativeMethodAccessorImpl.invoke(NativeMethodAccessorImpl.java:39)
at sun.reflect.DelegatingMethodAccessorImpl.invoke(DelegatingMethodAccessorImpl.java:25)
at java.lang.reflect.Method.invoke(Method.java:597)
at junit.framework.TestCase.runTest(TestCase.java:164)
at npanday.its.AbstractNPandayIntegrationTestCase.runTest(AbstractNPandayIntegrationTestCase.java:218)
at junit.framework.TestCase.runBare(TestCase.java:130)
at junit.framework.TestResult$1.protect(TestResult.java:106)
at junit.framework.TestResult.runProtected(TestResult.java:124)
at junit.framework.TestResult.run(TestResult.java:109)
at junit.framework.TestCase.run(TestCase.java:120)
at junit.framework.TestSuite.runTest(TestSuite.java:230)
at junit.framework.TestSuite.run(TestSuite.java:225)
at junit.framework.TestSuite.runTest(TestSuite.java:230)
at junit.framework.TestSuite.run(TestSuite.java:225)
at sun.reflect.NativeMethodAccessorImpl.invoke0(Native Method)
at sun.reflect.NativeMethodAccessorImpl.invoke(NativeMethodAccessorImpl.java:39)
at sun.reflect.DelegatingMethodAccessorImpl.invoke(DelegatingMethodAccessorImpl.java:25)
at java.lang.reflect.Method.invoke(Method.java:597)
at org.apache.maven.surefire.junit.JUnitTestSet.execute(JUnitTestSet.java:207)
at org.apache.maven.surefire.junit.JUnit3Provider.executeTestSet(JUnit3Provider.java:107)
at org.apache.maven.surefire.junit.JUnit3Provider.invoke(JUnit3Provider.java:79)
at sun.reflect.NativeMethodAccessorImpl.invoke0(Native Method)
at sun.reflect.NativeMethodAccessorImpl.invoke(NativeMethodAccessorImpl.java:39)
at sun.reflect.DelegatingMethodAccessorImpl.invoke(DelegatingMethodAccessorImpl.java:25)
at java.lang.reflect.Method.invoke(Method.java:597)
at org.apache.maven.surefire.booter.ProviderFactory$ClassLoaderProxy.invoke(ProviderFactory.java:103)
at $Proxy0.invoke(Unknown Source)
at org.apache.maven.surefire.booter.SurefireStarter.invokeProvider(SurefireStarter.java:145)
at org.apache.maven.surefire.booter.SurefireStarter.runSuitesInProcess(SurefireStarter.java:87)
at org.apache.maven.surefire.booter.ForkedBooter.main(ForkedBooter.java:69)
Caused by: org.sonatype.aether.resolution.ArtifactResolutionException: Could not find artifact org.servebox.flex:flex-plugin:jar:2.3.0 in central (http://repo1.maven.org/maven2)
at org.sonatype.aether.impl.internal.DefaultArtifactResolver.resolveArtifacts(DefaultArtifactResolver.java:526)
at org.sonatype.aether.impl.internal.DefaultRepositorySystem.resolveArtifacts(DefaultRepositorySystem.java:304)
at org.sonatype.aether.impl.internal.DefaultRepositorySystem.resolveDependencies(DefaultRepositorySystem.java:334)
at org.apache.maven.plugin.internal.DefaultPluginDependenciesResolver.resolve(DefaultPluginDependenciesResolver.java:191)
... 25 more
Caused by: org.sonatype.aether.transfer.ArtifactNotFoundException: Could not find artifact org.servebox.flex:flex-plugin:jar:2.3.0 in central (http://repo1.maven.org/maven2)
at org.sonatype.aether.connector.wagon.WagonRepositoryConnector$4.wrap(WagonRepositoryConnector.java:945)
at org.sonatype.aether.connector.wagon.WagonRepositoryConnector$4.wrap(WagonRepositoryConnector.java:940)
at org.sonatype.aether.connector.wagon.WagonRepositoryConnector$GetTask.flush(WagonRepositoryConnector.java:696)
at org.sonatype.aether.connector.wagon.WagonRepositoryConnector$GetTask.flush(WagonRepositoryConnector.java:690)
at org.sonatype.aether.connector.wagon.WagonRepositoryConnector.get(WagonRepositoryConnector.java:435)
at org.sonatype.aether.impl.internal.DefaultArtifactResolver.resolveArtifacts(DefaultArtifactResolver.java:438)
... 28 more
[ERROR] Unknown packaging: swc @ line 29, column 14
[ERROR]
[ERROR] Re-run Maven using the -X switch to enable full debug logging.
[ERROR]
[ERROR] For more information about the errors and possible solutions, please read the following articles:
[ERROR] [Help 1] http://cwiki.apache.org/confluence/display/MAVEN/ProjectBuildingException
[ERROR] [Help 2] http://cwiki.apache.org/confluence/display/MAVEN/PluginResolutionException
at org.apache.maven.it.Verifier.executeGoals(Verifier.java:1297)
at org.apache.maven.it.Verifier.executeGoal(Verifier.java:1145)
at org.apache.maven.it.Verifier.executeGoal(Verifier.java:1139)
at npanday.its.NPandayIT10276ConflictingExtensionsTest.testConflictingExtensions(NPandayIT10276ConflictingExtensionsTest.java:43)
at sun.reflect.NativeMethodAccessorImpl.invoke0(Native Method)
at sun.reflect.NativeMethodAccessorImpl.invoke(NativeMethodAccessorImpl.java:39)
at sun.reflect.DelegatingMethodAccessorImpl.invoke(DelegatingMethodAccessorImpl.java:25)
at java.lang.reflect.Method.invoke(Method.java:597)
at junit.framework.TestCase.runTest(TestCase.java:164)
at npanday.its.AbstractNPandayIntegrationTestCase.runTest(AbstractNPandayIntegrationTestCase.java:218)
at junit.framework.TestCase.runBare(TestCase.java:130)
at junit.framework.TestResult$1.protect(TestResult.java:106)
at junit.framework.TestResult.runProtected(TestResult.java:124)
at junit.framework.TestResult.run(TestResult.java:109)
at junit.framework.TestCase.run(TestCase.java:120)
at junit.framework.TestSuite.runTest(TestSuite.java:230)
at junit.framework.TestSuite.run(TestSuite.java:225)
at junit.framework.TestSuite.runTest(TestSuite.java:230)
at junit.framework.TestSuite.run(TestSuite.java:225)
at sun.reflect.NativeMethodAccessorImpl.invoke0(Native Method)
at sun.reflect.NativeMethodAccessorImpl.invoke(NativeMethodAccessorImpl.java:39)
at sun.reflect.DelegatingMethodAccessorImpl.invoke(DelegatingMethodAccessorImpl.java:25)
at java.lang.reflect.Method.invoke(Method.java:597)
at org.apache.maven.surefire.junit.JUnitTestSet.execute(JUnitTestSet.java:207)
at org.apache.maven.surefire.junit.JUnit3Provider.executeTestSet(JUnit3Provider.java:107)
at org.apache.maven.surefire.junit.JUnit3Provider.invoke(JUnit3Provider.java:79)
at sun.reflect.NativeMethodAccessorImpl.invoke0(Native Method)
at sun.reflect.NativeMethodAccessorImpl.invoke(NativeMethodAccessorImpl.java:39)
at sun.reflect.DelegatingMethodAccessorImpl.invoke(DelegatingMethodAccessorImpl.java:25)
at java.lang.reflect.Method.invoke(Method.java:597)
at org.apache.maven.surefire.booter.ProviderFactory$ClassLoaderProxy.invoke(ProviderFactory.java:103)
at $Proxy0.invoke(Unknown Source)
at org.apache.maven.surefire.booter.SurefireStarter.invokeProvider(SurefireStarter.java:145)
at org.apache.maven.surefire.booter.SurefireStarter.runSuitesInProcess(SurefireStarter.java:87)
at org.apache.maven.surefire.booter.ForkedBooter.main(ForkedBooter.java:69)
</error>
</testcase>
<testcase time="12.047" classname="npanday.its.NPandayIT13018TransitiveDependenciesTest" name="testLadderBuild"/>
<testcase time="11.251" classname="npanday.its.NPandayIT13018TransitiveDependenciesTest" name="testTransitiveDependenciesNotOnCompile"/>
<testcase time="10.313" classname="npanday.its.NPandayIT12940MixedVersionsTest" name="testMixedVersionResolution">
<error message="Exit code was non-zero: 1; command line and log =
&quot;C:\Program Files\Apache\apache-maven-3.0.2\bin\mvn&quot; -Dnpanday.version=1.3-incubating -e --batch-mode &quot;-Dmaven.repo.local=C:\Users\Lars Corneliussen\.m2\repository&quot; org.apache.maven.plugins:maven-clean-plugin:clean install
[INFO] Error stacktraces are turned on.
[INFO] Scanning for projects...
[INFO]
[INFO] ------------------------------------------------------------------------
[INFO] Building test-mixed-versions 1.0-SNAPSHOT
[INFO] ------------------------------------------------------------------------
[INFO]
[INFO] --- maven-clean-plugin:2.4.1:clean (default-cli) @ test-mixed-versions ---
[INFO]
[INFO] --- maven-compile-plugin:1.3-incubating:initialize (default-initialize) @ test-mixed-versions ---
SLF4J: Class path contains multiple SLF4J bindings.
SLF4J: Found binding in [jar:file:/C:/Users/Lars%20Corneliussen/.m2/repository/org/sonatype/gossip/gossip/1.0/gossip-1.0.jar!/org/slf4j/impl/StaticLoggerBinder.class]
SLF4J: Found binding in [jar:file:/C:/Users/Lars%20Corneliussen/.m2/repository/org/slf4j/slf4j-jdk14/1.5.11/slf4j-jdk14-1.5.11.jar!/org/slf4j/impl/StaticLoggerBinder.class]
SLF4J: See http://www.slf4j.org/codes.html#multiple_bindings for an explanation.
09.02.2011 15:39:48 npanday.registry.ConnectionsRepository lazyLoad
INFO: NPANDAY-080-001: Adding data access object: Class Name = npanday.dao.impl.ProjectDaoImpl
09.02.2011 15:39:48 npanday.registry.ConnectionsRepository lazyLoad
INFO: NPANDAY-080-004: Connection Start Up: Time = 140
09.02.2011 15:39:48 npanday.PathUtil getDotNetArtifact
WARNUNG:
NPANDAY-1005-0001: Error copying dependency test:test-snapshot:library:1.0-SNAPSHOT:compile File C:\Users\Lars Corneliussen\.m2\repository\test\test-snapshot\1.0-SNAPSHOT\test-snapshot-1.0-SNAPSHOT.dll does not exist
Downloading: file:C:\Workbench\NPanday\npanday-its-1.3-incubating\target\test-classes\NPandayIT12940/test-repo/test/test-snapshot/1.0-SNAPSHOT/maven-metadata.xml
[WARNING] Checksum validation failed, expected 6498da12891e028ef8171aedfc22ca2967109fcc but is 672cdfa42de13c344fb01552ccb2484b2bd3bfab for file:C:\Workbench\NPanday\npanday-its-1.3-incubating\target\test-classes\NPandayIT12940/test-repo/test/test-snapshot/1.0-SNAPSHOT/maven-metadata.xml
[WARNING] Checksum validation failed, expected 6498da12891e028ef8171aedfc22ca2967109fcc but is 672cdfa42de13c344fb01552ccb2484b2bd3bfab for file:C:\Workbench\NPanday\npanday-its-1.3-incubating\target\test-classes\NPandayIT12940/test-repo/test/test-snapshot/1.0-SNAPSHOT/maven-metadata.xml
Downloaded: file:C:\Workbench\NPanday\npanday-its-1.3-incubating\target\test-classes\NPandayIT12940/test-repo/test/test-snapshot/1.0-SNAPSHOT/maven-metadata.xml (2 KB at 23.9 KB/sec)
Downloading: file:C:\Workbench\NPanday\npanday-its-1.3-incubating\target\test-classes\NPandayIT12940/test-repo/test/test-snapshot/1.0-SNAPSHOT/test-snapshot-1.0-20100511.043228-1.dll
Downloaded: file:C:\Workbench\NPanday\npanday-its-1.3-incubating\target\test-classes\NPandayIT12940/test-repo/test/test-snapshot/1.0-SNAPSHOT/test-snapshot-1.0-20100511.043228-1.dll (4 KB at 233.3 KB/sec)
09.02.2011 15:39:48 npanday.dao.impl.ProjectDaoImpl storeProjectAndResolveDependencies
INFO: NPANDAY-180-011: Project Dependency: Artifact ID = test-snapshot, Group ID = test, Version = 1.0-SNAPSHOT, Artifact Type = library
09.02.2011 15:39:48 npanday.dao.impl.ProjectDaoImpl storeProjectAndResolveDependencies
INFO: NPANDAY-180-012: Resolving artifact for unresolved dependency: test:test-snapshot:library:1.0-SNAPSHOT
Downloading: file:C:\Workbench\NPanday\npanday-its-1.3-incubating\target\test-classes\NPandayIT12940/test-repo/test/test-snapshot/1.0-SNAPSHOT/test-snapshot-1.0-20100511.043228-1.pom
[WARNING] Checksum validation failed, expected 034eb027df0aaff9fda5e6ef1625f4d0716711d0 but is d81b4f7ffa73a587ebc160881b535c71a9a19e2d for file:C:\Workbench\NPanday\npanday-its-1.3-incubating\target\test-classes\NPandayIT12940/test-repo/test/test-snapshot/1.0-SNAPSHOT/test-snapshot-1.0-20100511.043228-1.pom
[WARNING] Checksum validation failed, expected 034eb027df0aaff9fda5e6ef1625f4d0716711d0 but is d81b4f7ffa73a587ebc160881b535c71a9a19e2d for file:C:\Workbench\NPanday\npanday-its-1.3-incubating\target\test-classes\NPandayIT12940/test-repo/test/test-snapshot/1.0-SNAPSHOT/test-snapshot-1.0-20100511.043228-1.pom
Downloaded: file:C:\Workbench\NPanday\npanday-its-1.3-incubating\target\test-classes\NPandayIT12940/test-repo/test/test-snapshot/1.0-SNAPSHOT/test-snapshot-1.0-20100511.043228-1.pom (2 KB at 120.6 KB/sec)
09.02.2011 15:39:48 npanday.dao.impl.ProjectDaoImpl storeProjectAndResolveDependencies
INFO: NPANDAY-180-024: resolving pom artifact: test:test-snapshot:pom:1.0-SNAPSHOT
09.02.2011 15:39:48 npanday.PathUtil getDotNetArtifact
WARNUNG:
NPANDAY-1005-0001: Error copying dependency test:test-snapshot:library:1.0-SNAPSHOT:compile File C:\Users\Lars Corneliussen\.m2\repository\test\test-snapshot\1.0-20100511.043228-1\test-snapshot-1.0-20100511.043228-1.dll does not exist
09.02.2011 15:39:48 npanday.dao.impl.ProjectDaoImpl storeProjectAndResolveDependencies
INFO: NPANDAY-180-018: Not found in local repository, now retrieving artifact from wagon:test:test-snapshot:library:1.0-SNAPSHOT, Failed Path Check = C:\Workbench\NPanday\npanday-its-1.3-incubating\target\test-classes\NPandayIT12940\target\test-snapshot.dll
09.02.2011 15:39:48 npanday.dao.impl.ProjectDaoImpl storeProjectAndResolveDependencies
INFO: NPANDAY-180-011: Project Dependency: Artifact ID = NUnit.Framework, Group ID = NUnit, Version = 2.2.8.0, Artifact Type = library
09.02.2011 15:39:48 npanday.PathUtil getDotNetArtifact
WARNUNG:
NPANDAY-1005-0001: Error copying dependency test:TestLibrary:library:1.0.0.0:compile File C:\Users\Lars Corneliussen\.m2\repository\test\TestLibrary\1.0.0.0\TestLibrary-1.0.0.0.dll does not exist
Downloading: file:C:\Workbench\NPanday\npanday-its-1.3-incubating\target\test-classes\NPandayIT12940/test-repo/test/TestLibrary/1.0.0.0/TestLibrary-1.0.0.0.dll
09.02.2011 15:39:48 npanday.dao.impl.ProjectDaoImpl storeProjectAndResolveDependencies
INFO: NPANDAY-180-011: Project Dependency: Artifact ID = TestLibrary, Group ID = test, Version = 1.0.0.0, Artifact Type = library
09.02.2011 15:39:48 npanday.dao.impl.ProjectDaoImpl storeProjectAndResolveDependencies
INFO: NPANDAY-180-011: Project Dependency: Artifact ID = NUnit.Framework, Group ID = NUnit, Version = 2.2.8.0, Artifact Type = library
Downloaded: file:C:\Workbench\NPanday\npanday-its-1.3-incubating\target\test-classes\NPandayIT12940/test-repo/test/TestLibrary/1.0.0.0/TestLibrary-1.0.0.0.dll (4 KB)
[INFO] Mojo Execution Time = 515
[INFO]
[INFO] --- maven-resolver-plugin:1.3-incubating:resolve (default-resolve) @ test-mixed-versions ---
[INFO] Mojo Execution Time = 0
[INFO]
[INFO] --- NPanday.Plugin.Settings.JavaBinding:1.3-incubating:generate-settings (default-generate-settings) @ test-mixed-versions ---
[INFO]
[INFO] --- maven-compile-plugin:1.3-incubating:generate-assembly-info (default-generate-assembly-info) @ test-mixed-versions ---
[INFO] NPANDAY-902-000: Generating Assembly Info: Language = C_SHARP
[INFO] Mojo Execution Time = 16
[INFO]
[INFO] --- maven-compile-plugin:1.3-incubating:process-sources (default-process-sources) @ test-mixed-versions ---
[INFO] NPANDAY-904-002: Copying source files: From = C:\Workbench\NPanday\npanday-its-1.3-incubating\target\test-classes\NPandayIT12940\src\main\csharp, To = C:\Workbench\NPanday\npanday-its-1.3-incubating\target\test-classes\NPandayIT12940\target/build-sources, File Count = 1
[INFO]
[INFO] --- maven-compile-plugin:1.3-incubating:process-test-sources (default-process-test-sources) @ test-mixed-versions ---
[INFO] NPANDAY-905-002: Copying test source files: From = C:\Workbench\NPanday\npanday-its-1.3-incubating\target\test-classes\NPandayIT12940\src\test\csharp, To = C:\Workbench\NPanday\npanday-its-1.3-incubating\target\test-classes\NPandayIT12940\target/build-test-sources
[INFO] Mojo Execution Time = 0
[INFO]
[INFO] --- maven-resgen-plugin:1.3-incubating:copy-resources (default-copy-resources) @ test-mixed-versions ---
[INFO]
[INFO] --- maven-resgen-plugin:1.3-incubating:generate (default-generate) @ test-mixed-versions ---
[INFO]
[INFO] --- maven-resgen-plugin:1.3-incubating:generate-existing-resx-to-resource (default-generate-existing-resx-to-resource) @ test-mixed-versions ---
[INFO]
[INFO] --- maven-compile-plugin:1.3-incubating:compile (default-compile) @ test-mixed-versions ---
[INFO] NPANDAY-066-013: Found Vendor = Vendor = MICROSOFT, Vendor Version = 2.0.50727, Framework Version = 2.0.50727, Executable Paths = [C:\Windows\Microsoft.NET\Framework\v2.0.50727]
[INFO] NPANDAY-068-003: Compiling Artifact: Vendor = MICROSOFT, Language = MICROSOFT, Assembly Name = C:\Workbench\NPanday\npanday-its-1.3-incubating\target\test-classes\NPandayIT12940\target\test-mixed-versions.dll
target\build-sources\Sample\MyApp.cs(27,18): warning CS1591: Missing XML comment for publicly visible type or member &apos;Sample.MyApp&apos;
target\build-sources\Sample\MyApp.cs(29,16): warning CS1591: Missing XML comment for publicly visible type or member &apos;Sample.MyApp.MyApp()&apos;
[INFO] NPANDAY-900-004: Compile Time = 344 ms
[INFO] Mojo Execution Time = 453
[INFO]
[INFO] --- maven-compile-plugin:1.3-incubating:testCompile (default-testCompile) @ test-mixed-versions ---
[INFO] NPANDAY-066-013: Found Vendor = Vendor = MICROSOFT, Vendor Version = 2.0.50727, Framework Version = 2.0.50727, Executable Paths = [C:\Windows\Microsoft.NET\Framework\v2.0.50727]
[INFO] NPANDAY-068-003: Compiling Artifact: Vendor = MICROSOFT, Language = MICROSOFT, Assembly Name = C:\Workbench\NPanday\npanday-its-1.3-incubating\target\test-classes\NPandayIT12940\target\test-mixed-versions-test.dll
[INFO] NPANDAY-060-000: Ignoring unknown command: Command = /rootnamespace:NPanday.ITs.test-mixed-versions
[INFO] NPANDAY-900-004: Compile Time = 313 ms
[INFO] Mojo Execution Time = 328
[INFO]
[INFO] --- maven-test-plugin:1.3-incubating:test (default-test) @ test-mixed-versions ---
09.02.2011 15:39:51 npanday.registry.ConnectionsRepository lazyLoad
INFO: NPANDAY-080-001: Adding data access object: Class Name = npanday.dao.impl.ProjectDaoImpl
09.02.2011 15:39:51 npanday.registry.ConnectionsRepository lazyLoad
INFO: NPANDAY-080-004: Connection Start Up: Time = 93
09.02.2011 15:39:51 npanday.dao.impl.ProjectDaoImpl storeProjectAndResolveDependencies
INFO: NPANDAY-180-011: Project Dependency: Artifact ID = test-snapshot, Group ID = test, Version = 1.0-SNAPSHOT, Artifact Type = library
09.02.2011 15:39:51 npanday.dao.impl.ProjectDaoImpl storeProjectAndResolveDependencies
INFO: NPANDAY-180-012: Resolving artifact for unresolved dependency: test:test-snapshot:library:1.0-SNAPSHOT
09.02.2011 15:39:51 npanday.dao.impl.ProjectDaoImpl storeProjectAndResolveDependencies
INFO: NPANDAY-180-024: resolving pom artifact: test:test-snapshot:pom:1.0-SNAPSHOT
09.02.2011 15:39:51 npanday.PathUtil getDotNetArtifact
WARNUNG:
NPANDAY-1005-0001: Error copying dependency test:test-snapshot:library:1.0-SNAPSHOT:compile File C:\Users\Lars Corneliussen\.m2\repository\test\test-snapshot\1.0-20100511.043228-1\test-snapshot-1.0-20100511.043228-1.dll does not exist
09.02.2011 15:39:51 npanday.dao.impl.ProjectDaoImpl storeProjectAndResolveDependencies
INFO: NPANDAY-180-018: Not found in local repository, now retrieving artifact from wagon:test:test-snapshot:library:1.0-SNAPSHOT, Failed Path Check = C:\Workbench\NPanday\npanday-its-1.3-incubating\target\test-classes\NPandayIT12940\target\test-snapshot.dll
09.02.2011 15:39:51 npanday.dao.impl.ProjectDaoImpl storeProjectAndResolveDependencies
INFO: NPANDAY-180-011: Project Dependency: Artifact ID = NUnit.Framework, Group ID = NUnit, Version = 2.2.8.0, Artifact Type = library
09.02.2011 15:39:51 info.aduna.lang.service.ServiceRegistry &lt;init&gt;
INFO: Registered service class org.openrdf.query.parser.serql.SeRQLParserFactory
09.02.2011 15:39:51 info.aduna.lang.service.ServiceRegistry &lt;init&gt;
INFO: Registered service class org.openrdf.query.parser.sparql.SPARQLParserFactory
09.02.2011 15:39:51 npanday.dao.impl.ProjectDaoImpl storeProjectAndResolveDependencies
INFO: NPANDAY-180-011: Project Dependency: Artifact ID = TestLibrary, Group ID = test, Version = 1.0.0.0, Artifact Type = library
09.02.2011 15:39:51 npanday.dao.impl.ProjectDaoImpl storeProjectAndResolveDependencies
INFO: NPANDAY-180-011: Project Dependency: Artifact ID = NUnit.Framework, Group ID = NUnit, Version = 2.2.8.0, Artifact Type = library
[INFO]
NUnit version 2.5.9.10348
Copyright (C) 2002-2009 Charlie Poole.
Copyright (C) 2002-2004 James W. Newkirk, Michael C. Two, Alexei A. Vorontsov.
Copyright (C) 2000-2002 Philip Craig.
All Rights Reserved.
Runtime Environment -
OS Version: Microsoft Windows NT 6.1.7600.0
CLR Version: 2.0.50727.4952 ( Net 2.0 )
ProcessModel: Default DomainUsage: Single
Execution Runtime: Default
Tests run: 1, Errors: 0, Failures: 0, Inconclusive: 0, Time: 0,062502 seconds
Not run: 0, Invalid: 0, Ignored: 0, Skipped: 0
[INFO]
[INFO] --- maven-repository-plugin:1.3-incubating:convert-artifact (default-convert-artifact) @ test-mixed-versions ---
09.02.2011 15:39:53 npanday.registry.ConnectionsRepository lazyLoad
INFO: NPANDAY-080-001: Adding data access object: Class Name = npanday.dao.impl.ProjectDaoImpl
09.02.2011 15:39:53 npanday.registry.ConnectionsRepository lazyLoad
INFO: NPANDAY-080-004: Connection Start Up: Time = 31
09.02.2011 15:39:53 info.aduna.lang.service.ServiceRegistry &lt;init&gt;
INFO: Registered service class org.openrdf.query.parser.serql.SeRQLParserFactory
09.02.2011 15:39:53 info.aduna.lang.service.ServiceRegistry &lt;init&gt;
INFO: Registered service class org.openrdf.query.parser.sparql.SPARQLParserFactory
09.02.2011 15:39:54 npanday.repository.impl.RepositoryConverterImpl convertRepositoryFormatFor
INFO: NPANDAY-190-002: Converting Project: Artifact ID = test-mixed-versions, Dependency Count =3
[INFO]
[INFO] --- maven-install-plugin:1.3-incubating:install (default-install) @ test-mixed-versions ---
09.02.2011 15:39:54 npanday.registry.ConnectionsRepository lazyLoad
INFO: NPANDAY-080-001: Adding data access object: Class Name = npanday.dao.impl.ProjectDaoImpl
09.02.2011 15:39:54 npanday.registry.ConnectionsRepository lazyLoad
INFO: NPANDAY-080-004: Connection Start Up: Time = 78
09.02.2011 15:39:54 npanday.dao.impl.ProjectDaoImpl storeProjectAndResolveDependencies
INFO: NPANDAY-180-011: Project Dependency: Artifact ID = test-snapshot, Group ID = test, Version = 1.0-SNAPSHOT, Artifact Type = library
09.02.2011 15:39:54 npanday.dao.impl.ProjectDaoImpl storeProjectAndResolveDependencies
INFO: NPANDAY-180-012: Resolving artifact for unresolved dependency: test:test-snapshot:library:1.0-SNAPSHOT
09.02.2011 15:39:54 npanday.dao.impl.ProjectDaoImpl storeProjectAndResolveDependencies
INFO: NPANDAY-180-024: resolving pom artifact: test:test-snapshot:pom:1.0-SNAPSHOT
09.02.2011 15:39:54 npanday.dao.impl.ProjectDaoImpl storeProjectAndResolveDependencies
INFO: NPANDAY-180-018: Not found in local repository, now retrieving artifact from wagon:test:test-snapshot:library:1.0-SNAPSHOT, Failed Path Check = C:\Workbench\NPanday\npanday-its-1.3-incubating\target\test-classes\NPandayIT12940\target\test-snapshot.dll
09.02.2011 15:39:54 npanday.dao.impl.ProjectDaoImpl storeProjectAndResolveDependencies
SCHWERWIEGEND: NPANDAY-180-0201: Error resolving artifact. Reason:
org.apache.maven.artifact.resolver.ArtifactNotFoundException: Could not find artifact test:test-snapshot:dll:1.0-SNAPSHOT
Try downloading the file manually from the project website.
Then, install it using the command:
mvn install:install-file -DgroupId=test -DartifactId=test-snapshot -Dversion=1.0-SNAPSHOT -Dpackaging=library -Dfile=/path/to/file
Alternatively, if you host your own repository you can deploy the file there:
mvn deploy:deploy-file -DgroupId=test -DartifactId=test-snapshot -Dversion=1.0-SNAPSHOT -Dpackaging=library -Dfile=/path/to/file -Durl=[url] -DrepositoryId=[id]
test:test-snapshot:library:1.0-SNAPSHOT
from the specified remote repositories:
(none)
at org.apache.maven.artifact.resolver.DefaultArtifactResolver.resolve(DefaultArtifactResolver.java:235)
at org.apache.maven.artifact.resolver.DefaultArtifactResolver.resolve(DefaultArtifactResolver.java:173)
at org.apache.maven.artifact.resolver.DefaultArtifactResolver.resolve(DefaultArtifactResolver.java:541)
at npanday.dao.impl.ProjectDaoImpl.storeProjectAndResolveDependencies(ProjectDaoImpl.java:791)
at npanday.dao.impl.ProjectDaoImpl.storeProjectAndResolveDependencies(ProjectDaoImpl.java:414)
at npanday.dao.impl.ProjectDaoImpl.storeModelAndResolveDependencies(ProjectDaoImpl.java:889)
at npanday.artifact.impl.ArtifactInstallerImpl.installArtifactWithPom(ArtifactInstallerImpl.java:401)
at npanday.plugin.install.InstallerMojo.execute(InstallerMojo.java:177)
at org.apache.maven.plugin.DefaultBuildPluginManager.executeMojo(DefaultBuildPluginManager.java:107)
at org.apache.maven.lifecycle.internal.MojoExecutor.execute(MojoExecutor.java:209)
at org.apache.maven.lifecycle.internal.MojoExecutor.execute(MojoExecutor.java:153)
at org.apache.maven.lifecycle.internal.MojoExecutor.execute(MojoExecutor.java:145)
at org.apache.maven.lifecycle.internal.LifecycleModuleBuilder.buildProject(LifecycleModuleBuilder.java:84)
at org.apache.maven.lifecycle.internal.LifecycleModuleBuilder.buildProject(LifecycleModuleBuilder.java:59)
at org.apache.maven.lifecycle.internal.LifecycleStarter.singleThreadedBuild(LifecycleStarter.java:183)
at org.apache.maven.lifecycle.internal.LifecycleStarter.execute(LifecycleStarter.java:161)
at org.apache.maven.DefaultMaven.doExecute(DefaultMaven.java:319)
at org.apache.maven.DefaultMaven.execute(DefaultMaven.java:156)
at org.apache.maven.cli.MavenCli.execute(MavenCli.java:534)
at org.apache.maven.cli.MavenCli.doMain(MavenCli.java:196)
at org.apache.maven.cli.MavenCli.main(MavenCli.java:141)
at sun.reflect.NativeMethodAccessorImpl.invoke0(Native Method)
at sun.reflect.NativeMethodAccessorImpl.invoke(NativeMethodAccessorImpl.java:39)
at sun.reflect.DelegatingMethodAccessorImpl.invoke(DelegatingMethodAccessorImpl.java:25)
at java.lang.reflect.Method.invoke(Method.java:597)
at org.codehaus.plexus.classworlds.launcher.Launcher.launchEnhanced(Launcher.java:290)
at org.codehaus.plexus.classworlds.launcher.Launcher.launch(Launcher.java:230)
at org.codehaus.plexus.classworlds.launcher.Launcher.mainWithExitCode(Launcher.java:409)
at org.codehaus.plexus.classworlds.launcher.Launcher.main(Launcher.java:352)
Caused by: org.sonatype.aether.resolution.ArtifactResolutionException: Could not find artifact test:test-snapshot:dll:1.0-SNAPSHOT
at org.sonatype.aether.impl.internal.DefaultArtifactResolver.resolveArtifacts(DefaultArtifactResolver.java:526)
at org.sonatype.aether.impl.internal.DefaultArtifactResolver.resolveArtifact(DefaultArtifactResolver.java:214)
at org.sonatype.aether.impl.internal.DefaultRepositorySystem.resolveArtifact(DefaultRepositorySystem.java:296)
at org.apache.maven.artifact.resolver.DefaultArtifactResolver.resolve(DefaultArtifactResolver.java:229)
... 28 more
Caused by: org.sonatype.aether.transfer.ArtifactNotFoundException: Could not find artifact test:test-snapshot:dll:1.0-SNAPSHOT
at org.sonatype.aether.impl.internal.DefaultArtifactResolver.resolveArtifacts(DefaultArtifactResolver.java:517)
... 31 more
java.io.IOException: NPANDAY-180-020: Problem in resolving artifact: Artifact = test:test-snapshot:library:1.0-SNAPSHOT, Message = Could not find artifact test:test-snapshot:dll:1.0-SNAPSHOT
Try downloading the file manually from the project website.
Then, install it using the command:
mvn install:install-file -DgroupId=test -DartifactId=test-snapshot -Dversion=1.0-SNAPSHOT -Dpackaging=library -Dfile=/path/to/file
Alternatively, if you host your own repository you can deploy the file there:
mvn deploy:deploy-file -DgroupId=test -DartifactId=test-snapshot -Dversion=1.0-SNAPSHOT -Dpackaging=library -Dfile=/path/to/file -Durl=[url] -DrepositoryId=[id]
test:test-snapshot:library:1.0-SNAPSHOT
from the specified remote repositories:
(none)
at npanday.dao.impl.ProjectDaoImpl.storeProjectAndResolveDependencies(ProjectDaoImpl.java:806)
at npanday.dao.impl.ProjectDaoImpl.storeProjectAndResolveDependencies(ProjectDaoImpl.java:414)
at npanday.dao.impl.ProjectDaoImpl.storeModelAndResolveDependencies(ProjectDaoImpl.java:889)
at npanday.artifact.impl.ArtifactInstallerImpl.installArtifactWithPom(ArtifactInstallerImpl.java:401)
at npanday.plugin.install.InstallerMojo.execute(InstallerMojo.java:177)
at org.apache.maven.plugin.DefaultBuildPluginManager.executeMojo(DefaultBuildPluginManager.java:107)
at org.apache.maven.lifecycle.internal.MojoExecutor.execute(MojoExecutor.java:209)
at org.apache.maven.lifecycle.internal.MojoExecutor.execute(MojoExecutor.java:153)
at org.apache.maven.lifecycle.internal.MojoExecutor.execute(MojoExecutor.java:145)
at org.apache.maven.lifecycle.internal.LifecycleModuleBuilder.buildProject(LifecycleModuleBuilder.java:84)
at org.apache.maven.lifecycle.internal.LifecycleModuleBuilder.buildProject(LifecycleModuleBuilder.java:59)
at org.apache.maven.lifecycle.internal.LifecycleStarter.singleThreadedBuild(LifecycleStarter.java:183)
at org.apache.maven.lifecycle.internal.LifecycleStarter.execute(LifecycleStarter.java:161)
at org.apache.maven.DefaultMaven.doExecute(DefaultMaven.java:319)
at org.apache.maven.DefaultMaven.execute(DefaultMaven.java:156)
at org.apache.maven.cli.MavenCli.execute(MavenCli.java:534)
at org.apache.maven.cli.MavenCli.doMain(MavenCli.java:196)
at org.apache.maven.cli.MavenCli.main(MavenCli.java:141)
at sun.reflect.NativeMethodAccessorImpl.invoke0(Native Method)
at sun.reflect.NativeMethodAccessorImpl.invoke(NativeMethodAccessorImpl.java:39)
at sun.reflect.DelegatingMethodAccessorImpl.invoke(DelegatingMethodAccessorImpl.java:25)
at java.lang.reflect.Method.invoke(Method.java:597)
at org.codehaus.plexus.classworlds.launcher.Launcher.launchEnhanced(Launcher.java:290)
at org.codehaus.plexus.classworlds.launcher.Launcher.launch(Launcher.java:230)
at org.codehaus.plexus.classworlds.launcher.Launcher.mainWithExitCode(Launcher.java:409)
at org.codehaus.plexus.classworlds.launcher.Launcher.main(Launcher.java:352)
[INFO] ------------------------------------------------------------------------
[INFO] BUILD FAILURE
[INFO] ------------------------------------------------------------------------
[INFO] Total time: 8.704s
[INFO] Finished at: Wed Feb 09 15:39:54 CET 2011
[INFO] Final Memory: 10M/104M
[INFO] ------------------------------------------------------------------------
[ERROR] Failed to execute goal npanday.plugin:maven-install-plugin:1.3-incubating:install (default-install) on project test-mixed-versions: NPANDAY-1001-000: Failed to install artifacts: NPANDAY-001-014: Unable to store model: Message = NPANDAY-180-020: Problem in resolving artifact: Artifact = test:test-snapshot:library:1.0-SNAPSHOT, Message = Could not find artifact test:test-snapshot:dll:1.0-SNAPSHOT
[ERROR]
[ERROR] Try downloading the file manually from the project website.
[ERROR]
[ERROR] Then, install it using the command:
[ERROR] mvn install:install-file -DgroupId=test -DartifactId=test-snapshot -Dversion=1.0-SNAPSHOT -Dpackaging=library -Dfile=/path/to/file
[ERROR]
[ERROR] Alternatively, if you host your own repository you can deploy the file there:
[ERROR] mvn deploy:deploy-file -DgroupId=test -DartifactId=test-snapshot -Dversion=1.0-SNAPSHOT -Dpackaging=library -Dfile=/path/to/file -Durl=[url] -DrepositoryId=[id]
[ERROR]
[ERROR]
[ERROR] test:test-snapshot:library:1.0-SNAPSHOT
[ERROR]
[ERROR] from the specified remote repositories:
[ERROR] (none)
[ERROR] -&gt; [Help 1]
org.apache.maven.lifecycle.LifecycleExecutionException: Failed to execute goal npanday.plugin:maven-install-plugin:1.3-incubating:install (default-install) on project test-mixed-versions: NPANDAY-1001-000: Failed to install artifacts
at org.apache.maven.lifecycle.internal.MojoExecutor.execute(MojoExecutor.java:217)
at org.apache.maven.lifecycle.internal.MojoExecutor.execute(MojoExecutor.java:153)
at org.apache.maven.lifecycle.internal.MojoExecutor.execute(MojoExecutor.java:145)
at org.apache.maven.lifecycle.internal.LifecycleModuleBuilder.buildProject(LifecycleModuleBuilder.java:84)
at org.apache.maven.lifecycle.internal.LifecycleModuleBuilder.buildProject(LifecycleModuleBuilder.java:59)
at org.apache.maven.lifecycle.internal.LifecycleStarter.singleThreadedBuild(LifecycleStarter.java:183)
at org.apache.maven.lifecycle.internal.LifecycleStarter.execute(LifecycleStarter.java:161)
at org.apache.maven.DefaultMaven.doExecute(DefaultMaven.java:319)
at org.apache.maven.DefaultMaven.execute(DefaultMaven.java:156)
at org.apache.maven.cli.MavenCli.execute(MavenCli.java:534)
at org.apache.maven.cli.MavenCli.doMain(MavenCli.java:196)
at org.apache.maven.cli.MavenCli.main(MavenCli.java:141)
at sun.reflect.NativeMethodAccessorImpl.invoke0(Native Method)
at sun.reflect.NativeMethodAccessorImpl.invoke(NativeMethodAccessorImpl.java:39)
at sun.reflect.DelegatingMethodAccessorImpl.invoke(DelegatingMethodAccessorImpl.java:25)
at java.lang.reflect.Method.invoke(Method.java:597)
at org.codehaus.plexus.classworlds.launcher.Launcher.launchEnhanced(Launcher.java:290)
at org.codehaus.plexus.classworlds.launcher.Launcher.launch(Launcher.java:230)
at org.codehaus.plexus.classworlds.launcher.Launcher.mainWithExitCode(Launcher.java:409)
at org.codehaus.plexus.classworlds.launcher.Launcher.main(Launcher.java:352)
Caused by: org.apache.maven.plugin.MojoExecutionException: NPANDAY-1001-000: Failed to install artifacts
at npanday.plugin.install.InstallerMojo.execute(InstallerMojo.java:181)
at org.apache.maven.plugin.DefaultBuildPluginManager.executeMojo(DefaultBuildPluginManager.java:107)
at org.apache.maven.lifecycle.internal.MojoExecutor.execute(MojoExecutor.java:209)
... 19 more
Caused by: org.apache.maven.artifact.installer.ArtifactInstallationException: NPANDAY-001-014: Unable to store model: Message = NPANDAY-180-020: Problem in resolving artifact: Artifact = test:test-snapshot:library:1.0-SNAPSHOT, Message = Could not find artifact test:test-snapshot:dll:1.0-SNAPSHOT
Try downloading the file manually from the project website.
Then, install it using the command:
mvn install:install-file -DgroupId=test -DartifactId=test-snapshot -Dversion=1.0-SNAPSHOT -Dpackaging=library -Dfile=/path/to/file
Alternatively, if you host your own repository you can deploy the file there:
mvn deploy:deploy-file -DgroupId=test -DartifactId=test-snapshot -Dversion=1.0-SNAPSHOT -Dpackaging=library -Dfile=/path/to/file -Durl=[url] -DrepositoryId=[id]
test:test-snapshot:library:1.0-SNAPSHOT
from the specified remote repositories:
(none)
at npanday.artifact.impl.ArtifactInstallerImpl.installArtifactWithPom(ArtifactInstallerImpl.java:407)
at npanday.plugin.install.InstallerMojo.execute(InstallerMojo.java:177)
... 21 more
[ERROR]
[ERROR] Re-run Maven using the -X switch to enable full debug logging.
[ERROR]
[ERROR] For more information about the errors and possible solutions, please read the following articles:
[ERROR] [Help 1] http://cwiki.apache.org/confluence/display/MAVEN/MojoExecutionException
" type="org.apache.maven.it.VerificationException">org.apache.maven.it.VerificationException: Exit code was non-zero: 1; command line and log =
&quot;C:\Program Files\Apache\apache-maven-3.0.2\bin\mvn&quot; -Dnpanday.version=1.3-incubating -e --batch-mode &quot;-Dmaven.repo.local=C:\Users\Lars Corneliussen\.m2\repository&quot; org.apache.maven.plugins:maven-clean-plugin:clean install
[INFO] Error stacktraces are turned on.
[INFO] Scanning for projects...
[INFO]
[INFO] ------------------------------------------------------------------------
[INFO] Building test-mixed-versions 1.0-SNAPSHOT
[INFO] ------------------------------------------------------------------------
[INFO]
[INFO] --- maven-clean-plugin:2.4.1:clean (default-cli) @ test-mixed-versions ---
[INFO]
[INFO] --- maven-compile-plugin:1.3-incubating:initialize (default-initialize) @ test-mixed-versions ---
SLF4J: Class path contains multiple SLF4J bindings.
SLF4J: Found binding in [jar:file:/C:/Users/Lars%20Corneliussen/.m2/repository/org/sonatype/gossip/gossip/1.0/gossip-1.0.jar!/org/slf4j/impl/StaticLoggerBinder.class]
SLF4J: Found binding in [jar:file:/C:/Users/Lars%20Corneliussen/.m2/repository/org/slf4j/slf4j-jdk14/1.5.11/slf4j-jdk14-1.5.11.jar!/org/slf4j/impl/StaticLoggerBinder.class]
SLF4J: See http://www.slf4j.org/codes.html#multiple_bindings for an explanation.
09.02.2011 15:39:48 npanday.registry.ConnectionsRepository lazyLoad
INFO: NPANDAY-080-001: Adding data access object: Class Name = npanday.dao.impl.ProjectDaoImpl
09.02.2011 15:39:48 npanday.registry.ConnectionsRepository lazyLoad
INFO: NPANDAY-080-004: Connection Start Up: Time = 140
09.02.2011 15:39:48 npanday.PathUtil getDotNetArtifact
WARNUNG:
NPANDAY-1005-0001: Error copying dependency test:test-snapshot:library:1.0-SNAPSHOT:compile File C:\Users\Lars Corneliussen\.m2\repository\test\test-snapshot\1.0-SNAPSHOT\test-snapshot-1.0-SNAPSHOT.dll does not exist
Downloading: file:C:\Workbench\NPanday\npanday-its-1.3-incubating\target\test-classes\NPandayIT12940/test-repo/test/test-snapshot/1.0-SNAPSHOT/maven-metadata.xml
[WARNING] Checksum validation failed, expected 6498da12891e028ef8171aedfc22ca2967109fcc but is 672cdfa42de13c344fb01552ccb2484b2bd3bfab for file:C:\Workbench\NPanday\npanday-its-1.3-incubating\target\test-classes\NPandayIT12940/test-repo/test/test-snapshot/1.0-SNAPSHOT/maven-metadata.xml
[WARNING] Checksum validation failed, expected 6498da12891e028ef8171aedfc22ca2967109fcc but is 672cdfa42de13c344fb01552ccb2484b2bd3bfab for file:C:\Workbench\NPanday\npanday-its-1.3-incubating\target\test-classes\NPandayIT12940/test-repo/test/test-snapshot/1.0-SNAPSHOT/maven-metadata.xml
Downloaded: file:C:\Workbench\NPanday\npanday-its-1.3-incubating\target\test-classes\NPandayIT12940/test-repo/test/test-snapshot/1.0-SNAPSHOT/maven-metadata.xml (2 KB at 23.9 KB/sec)
Downloading: file:C:\Workbench\NPanday\npanday-its-1.3-incubating\target\test-classes\NPandayIT12940/test-repo/test/test-snapshot/1.0-SNAPSHOT/test-snapshot-1.0-20100511.043228-1.dll
Downloaded: file:C:\Workbench\NPanday\npanday-its-1.3-incubating\target\test-classes\NPandayIT12940/test-repo/test/test-snapshot/1.0-SNAPSHOT/test-snapshot-1.0-20100511.043228-1.dll (4 KB at 233.3 KB/sec)
09.02.2011 15:39:48 npanday.dao.impl.ProjectDaoImpl storeProjectAndResolveDependencies
INFO: NPANDAY-180-011: Project Dependency: Artifact ID = test-snapshot, Group ID = test, Version = 1.0-SNAPSHOT, Artifact Type = library
09.02.2011 15:39:48 npanday.dao.impl.ProjectDaoImpl storeProjectAndResolveDependencies
INFO: NPANDAY-180-012: Resolving artifact for unresolved dependency: test:test-snapshot:library:1.0-SNAPSHOT
Downloading: file:C:\Workbench\NPanday\npanday-its-1.3-incubating\target\test-classes\NPandayIT12940/test-repo/test/test-snapshot/1.0-SNAPSHOT/test-snapshot-1.0-20100511.043228-1.pom
[WARNING] Checksum validation failed, expected 034eb027df0aaff9fda5e6ef1625f4d0716711d0 but is d81b4f7ffa73a587ebc160881b535c71a9a19e2d for file:C:\Workbench\NPanday\npanday-its-1.3-incubating\target\test-classes\NPandayIT12940/test-repo/test/test-snapshot/1.0-SNAPSHOT/test-snapshot-1.0-20100511.043228-1.pom
[WARNING] Checksum validation failed, expected 034eb027df0aaff9fda5e6ef1625f4d0716711d0 but is d81b4f7ffa73a587ebc160881b535c71a9a19e2d for file:C:\Workbench\NPanday\npanday-its-1.3-incubating\target\test-classes\NPandayIT12940/test-repo/test/test-snapshot/1.0-SNAPSHOT/test-snapshot-1.0-20100511.043228-1.pom
Downloaded: file:C:\Workbench\NPanday\npanday-its-1.3-incubating\target\test-classes\NPandayIT12940/test-repo/test/test-snapshot/1.0-SNAPSHOT/test-snapshot-1.0-20100511.043228-1.pom (2 KB at 120.6 KB/sec)
09.02.2011 15:39:48 npanday.dao.impl.ProjectDaoImpl storeProjectAndResolveDependencies
INFO: NPANDAY-180-024: resolving pom artifact: test:test-snapshot:pom:1.0-SNAPSHOT
09.02.2011 15:39:48 npanday.PathUtil getDotNetArtifact
WARNUNG:
NPANDAY-1005-0001: Error copying dependency test:test-snapshot:library:1.0-SNAPSHOT:compile File C:\Users\Lars Corneliussen\.m2\repository\test\test-snapshot\1.0-20100511.043228-1\test-snapshot-1.0-20100511.043228-1.dll does not exist
09.02.2011 15:39:48 npanday.dao.impl.ProjectDaoImpl storeProjectAndResolveDependencies
INFO: NPANDAY-180-018: Not found in local repository, now retrieving artifact from wagon:test:test-snapshot:library:1.0-SNAPSHOT, Failed Path Check = C:\Workbench\NPanday\npanday-its-1.3-incubating\target\test-classes\NPandayIT12940\target\test-snapshot.dll
09.02.2011 15:39:48 npanday.dao.impl.ProjectDaoImpl storeProjectAndResolveDependencies
INFO: NPANDAY-180-011: Project Dependency: Artifact ID = NUnit.Framework, Group ID = NUnit, Version = 2.2.8.0, Artifact Type = library
09.02.2011 15:39:48 npanday.PathUtil getDotNetArtifact
WARNUNG:
NPANDAY-1005-0001: Error copying dependency test:TestLibrary:library:1.0.0.0:compile File C:\Users\Lars Corneliussen\.m2\repository\test\TestLibrary\1.0.0.0\TestLibrary-1.0.0.0.dll does not exist
Downloading: file:C:\Workbench\NPanday\npanday-its-1.3-incubating\target\test-classes\NPandayIT12940/test-repo/test/TestLibrary/1.0.0.0/TestLibrary-1.0.0.0.dll
09.02.2011 15:39:48 npanday.dao.impl.ProjectDaoImpl storeProjectAndResolveDependencies
INFO: NPANDAY-180-011: Project Dependency: Artifact ID = TestLibrary, Group ID = test, Version = 1.0.0.0, Artifact Type = library
09.02.2011 15:39:48 npanday.dao.impl.ProjectDaoImpl storeProjectAndResolveDependencies
INFO: NPANDAY-180-011: Project Dependency: Artifact ID = NUnit.Framework, Group ID = NUnit, Version = 2.2.8.0, Artifact Type = library
Downloaded: file:C:\Workbench\NPanday\npanday-its-1.3-incubating\target\test-classes\NPandayIT12940/test-repo/test/TestLibrary/1.0.0.0/TestLibrary-1.0.0.0.dll (4 KB)
[INFO] Mojo Execution Time = 515
[INFO]
[INFO] --- maven-resolver-plugin:1.3-incubating:resolve (default-resolve) @ test-mixed-versions ---
[INFO] Mojo Execution Time = 0
[INFO]
[INFO] --- NPanday.Plugin.Settings.JavaBinding:1.3-incubating:generate-settings (default-generate-settings) @ test-mixed-versions ---
[INFO]
[INFO] --- maven-compile-plugin:1.3-incubating:generate-assembly-info (default-generate-assembly-info) @ test-mixed-versions ---
[INFO] NPANDAY-902-000: Generating Assembly Info: Language = C_SHARP
[INFO] Mojo Execution Time = 16
[INFO]
[INFO] --- maven-compile-plugin:1.3-incubating:process-sources (default-process-sources) @ test-mixed-versions ---
[INFO] NPANDAY-904-002: Copying source files: From = C:\Workbench\NPanday\npanday-its-1.3-incubating\target\test-classes\NPandayIT12940\src\main\csharp, To = C:\Workbench\NPanday\npanday-its-1.3-incubating\target\test-classes\NPandayIT12940\target/build-sources, File Count = 1
[INFO]
[INFO] --- maven-compile-plugin:1.3-incubating:process-test-sources (default-process-test-sources) @ test-mixed-versions ---
[INFO] NPANDAY-905-002: Copying test source files: From = C:\Workbench\NPanday\npanday-its-1.3-incubating\target\test-classes\NPandayIT12940\src\test\csharp, To = C:\Workbench\NPanday\npanday-its-1.3-incubating\target\test-classes\NPandayIT12940\target/build-test-sources
[INFO] Mojo Execution Time = 0
[INFO]
[INFO] --- maven-resgen-plugin:1.3-incubating:copy-resources (default-copy-resources) @ test-mixed-versions ---
[INFO]
[INFO] --- maven-resgen-plugin:1.3-incubating:generate (default-generate) @ test-mixed-versions ---
[INFO]
[INFO] --- maven-resgen-plugin:1.3-incubating:generate-existing-resx-to-resource (default-generate-existing-resx-to-resource) @ test-mixed-versions ---
[INFO]
[INFO] --- maven-compile-plugin:1.3-incubating:compile (default-compile) @ test-mixed-versions ---
[INFO] NPANDAY-066-013: Found Vendor = Vendor = MICROSOFT, Vendor Version = 2.0.50727, Framework Version = 2.0.50727, Executable Paths = [C:\Windows\Microsoft.NET\Framework\v2.0.50727]
[INFO] NPANDAY-068-003: Compiling Artifact: Vendor = MICROSOFT, Language = MICROSOFT, Assembly Name = C:\Workbench\NPanday\npanday-its-1.3-incubating\target\test-classes\NPandayIT12940\target\test-mixed-versions.dll
target\build-sources\Sample\MyApp.cs(27,18): warning CS1591: Missing XML comment for publicly visible type or member &apos;Sample.MyApp&apos;
target\build-sources\Sample\MyApp.cs(29,16): warning CS1591: Missing XML comment for publicly visible type or member &apos;Sample.MyApp.MyApp()&apos;
[INFO] NPANDAY-900-004: Compile Time = 344 ms
[INFO] Mojo Execution Time = 453
[INFO]
[INFO] --- maven-compile-plugin:1.3-incubating:testCompile (default-testCompile) @ test-mixed-versions ---
[INFO] NPANDAY-066-013: Found Vendor = Vendor = MICROSOFT, Vendor Version = 2.0.50727, Framework Version = 2.0.50727, Executable Paths = [C:\Windows\Microsoft.NET\Framework\v2.0.50727]
[INFO] NPANDAY-068-003: Compiling Artifact: Vendor = MICROSOFT, Language = MICROSOFT, Assembly Name = C:\Workbench\NPanday\npanday-its-1.3-incubating\target\test-classes\NPandayIT12940\target\test-mixed-versions-test.dll
[INFO] NPANDAY-060-000: Ignoring unknown command: Command = /rootnamespace:NPanday.ITs.test-mixed-versions
[INFO] NPANDAY-900-004: Compile Time = 313 ms
[INFO] Mojo Execution Time = 328
[INFO]
[INFO] --- maven-test-plugin:1.3-incubating:test (default-test) @ test-mixed-versions ---
09.02.2011 15:39:51 npanday.registry.ConnectionsRepository lazyLoad
INFO: NPANDAY-080-001: Adding data access object: Class Name = npanday.dao.impl.ProjectDaoImpl
09.02.2011 15:39:51 npanday.registry.ConnectionsRepository lazyLoad
INFO: NPANDAY-080-004: Connection Start Up: Time = 93
09.02.2011 15:39:51 npanday.dao.impl.ProjectDaoImpl storeProjectAndResolveDependencies
INFO: NPANDAY-180-011: Project Dependency: Artifact ID = test-snapshot, Group ID = test, Version = 1.0-SNAPSHOT, Artifact Type = library
09.02.2011 15:39:51 npanday.dao.impl.ProjectDaoImpl storeProjectAndResolveDependencies
INFO: NPANDAY-180-012: Resolving artifact for unresolved dependency: test:test-snapshot:library:1.0-SNAPSHOT
09.02.2011 15:39:51 npanday.dao.impl.ProjectDaoImpl storeProjectAndResolveDependencies
INFO: NPANDAY-180-024: resolving pom artifact: test:test-snapshot:pom:1.0-SNAPSHOT
09.02.2011 15:39:51 npanday.PathUtil getDotNetArtifact
WARNUNG:
NPANDAY-1005-0001: Error copying dependency test:test-snapshot:library:1.0-SNAPSHOT:compile File C:\Users\Lars Corneliussen\.m2\repository\test\test-snapshot\1.0-20100511.043228-1\test-snapshot-1.0-20100511.043228-1.dll does not exist
09.02.2011 15:39:51 npanday.dao.impl.ProjectDaoImpl storeProjectAndResolveDependencies
INFO: NPANDAY-180-018: Not found in local repository, now retrieving artifact from wagon:test:test-snapshot:library:1.0-SNAPSHOT, Failed Path Check = C:\Workbench\NPanday\npanday-its-1.3-incubating\target\test-classes\NPandayIT12940\target\test-snapshot.dll
09.02.2011 15:39:51 npanday.dao.impl.ProjectDaoImpl storeProjectAndResolveDependencies
INFO: NPANDAY-180-011: Project Dependency: Artifact ID = NUnit.Framework, Group ID = NUnit, Version = 2.2.8.0, Artifact Type = library
09.02.2011 15:39:51 info.aduna.lang.service.ServiceRegistry &lt;init&gt;
INFO: Registered service class org.openrdf.query.parser.serql.SeRQLParserFactory
09.02.2011 15:39:51 info.aduna.lang.service.ServiceRegistry &lt;init&gt;
INFO: Registered service class org.openrdf.query.parser.sparql.SPARQLParserFactory
09.02.2011 15:39:51 npanday.dao.impl.ProjectDaoImpl storeProjectAndResolveDependencies
INFO: NPANDAY-180-011: Project Dependency: Artifact ID = TestLibrary, Group ID = test, Version = 1.0.0.0, Artifact Type = library
09.02.2011 15:39:51 npanday.dao.impl.ProjectDaoImpl storeProjectAndResolveDependencies
INFO: NPANDAY-180-011: Project Dependency: Artifact ID = NUnit.Framework, Group ID = NUnit, Version = 2.2.8.0, Artifact Type = library
[INFO]
NUnit version 2.5.9.10348
Copyright (C) 2002-2009 Charlie Poole.
Copyright (C) 2002-2004 James W. Newkirk, Michael C. Two, Alexei A. Vorontsov.
Copyright (C) 2000-2002 Philip Craig.
All Rights Reserved.
Runtime Environment -
OS Version: Microsoft Windows NT 6.1.7600.0
CLR Version: 2.0.50727.4952 ( Net 2.0 )
ProcessModel: Default DomainUsage: Single
Execution Runtime: Default
Tests run: 1, Errors: 0, Failures: 0, Inconclusive: 0, Time: 0,062502 seconds
Not run: 0, Invalid: 0, Ignored: 0, Skipped: 0
[INFO]
[INFO] --- maven-repository-plugin:1.3-incubating:convert-artifact (default-convert-artifact) @ test-mixed-versions ---
09.02.2011 15:39:53 npanday.registry.ConnectionsRepository lazyLoad
INFO: NPANDAY-080-001: Adding data access object: Class Name = npanday.dao.impl.ProjectDaoImpl
09.02.2011 15:39:53 npanday.registry.ConnectionsRepository lazyLoad
INFO: NPANDAY-080-004: Connection Start Up: Time = 31
09.02.2011 15:39:53 info.aduna.lang.service.ServiceRegistry &lt;init&gt;
INFO: Registered service class org.openrdf.query.parser.serql.SeRQLParserFactory
09.02.2011 15:39:53 info.aduna.lang.service.ServiceRegistry &lt;init&gt;
INFO: Registered service class org.openrdf.query.parser.sparql.SPARQLParserFactory
09.02.2011 15:39:54 npanday.repository.impl.RepositoryConverterImpl convertRepositoryFormatFor
INFO: NPANDAY-190-002: Converting Project: Artifact ID = test-mixed-versions, Dependency Count =3
[INFO]
[INFO] --- maven-install-plugin:1.3-incubating:install (default-install) @ test-mixed-versions ---
09.02.2011 15:39:54 npanday.registry.ConnectionsRepository lazyLoad
INFO: NPANDAY-080-001: Adding data access object: Class Name = npanday.dao.impl.ProjectDaoImpl
09.02.2011 15:39:54 npanday.registry.ConnectionsRepository lazyLoad
INFO: NPANDAY-080-004: Connection Start Up: Time = 78
09.02.2011 15:39:54 npanday.dao.impl.ProjectDaoImpl storeProjectAndResolveDependencies
INFO: NPANDAY-180-011: Project Dependency: Artifact ID = test-snapshot, Group ID = test, Version = 1.0-SNAPSHOT, Artifact Type = library
09.02.2011 15:39:54 npanday.dao.impl.ProjectDaoImpl storeProjectAndResolveDependencies
INFO: NPANDAY-180-012: Resolving artifact for unresolved dependency: test:test-snapshot:library:1.0-SNAPSHOT
09.02.2011 15:39:54 npanday.dao.impl.ProjectDaoImpl storeProjectAndResolveDependencies
INFO: NPANDAY-180-024: resolving pom artifact: test:test-snapshot:pom:1.0-SNAPSHOT
09.02.2011 15:39:54 npanday.dao.impl.ProjectDaoImpl storeProjectAndResolveDependencies
INFO: NPANDAY-180-018: Not found in local repository, now retrieving artifact from wagon:test:test-snapshot:library:1.0-SNAPSHOT, Failed Path Check = C:\Workbench\NPanday\npanday-its-1.3-incubating\target\test-classes\NPandayIT12940\target\test-snapshot.dll
09.02.2011 15:39:54 npanday.dao.impl.ProjectDaoImpl storeProjectAndResolveDependencies
SCHWERWIEGEND: NPANDAY-180-0201: Error resolving artifact. Reason:
org.apache.maven.artifact.resolver.ArtifactNotFoundException: Could not find artifact test:test-snapshot:dll:1.0-SNAPSHOT
Try downloading the file manually from the project website.
Then, install it using the command:
mvn install:install-file -DgroupId=test -DartifactId=test-snapshot -Dversion=1.0-SNAPSHOT -Dpackaging=library -Dfile=/path/to/file
Alternatively, if you host your own repository you can deploy the file there:
mvn deploy:deploy-file -DgroupId=test -DartifactId=test-snapshot -Dversion=1.0-SNAPSHOT -Dpackaging=library -Dfile=/path/to/file -Durl=[url] -DrepositoryId=[id]
test:test-snapshot:library:1.0-SNAPSHOT
from the specified remote repositories:
(none)
at org.apache.maven.artifact.resolver.DefaultArtifactResolver.resolve(DefaultArtifactResolver.java:235)
at org.apache.maven.artifact.resolver.DefaultArtifactResolver.resolve(DefaultArtifactResolver.java:173)
at org.apache.maven.artifact.resolver.DefaultArtifactResolver.resolve(DefaultArtifactResolver.java:541)
at npanday.dao.impl.ProjectDaoImpl.storeProjectAndResolveDependencies(ProjectDaoImpl.java:791)
at npanday.dao.impl.ProjectDaoImpl.storeProjectAndResolveDependencies(ProjectDaoImpl.java:414)
at npanday.dao.impl.ProjectDaoImpl.storeModelAndResolveDependencies(ProjectDaoImpl.java:889)
at npanday.artifact.impl.ArtifactInstallerImpl.installArtifactWithPom(ArtifactInstallerImpl.java:401)
at npanday.plugin.install.InstallerMojo.execute(InstallerMojo.java:177)
at org.apache.maven.plugin.DefaultBuildPluginManager.executeMojo(DefaultBuildPluginManager.java:107)
at org.apache.maven.lifecycle.internal.MojoExecutor.execute(MojoExecutor.java:209)
at org.apache.maven.lifecycle.internal.MojoExecutor.execute(MojoExecutor.java:153)
at org.apache.maven.lifecycle.internal.MojoExecutor.execute(MojoExecutor.java:145)
at org.apache.maven.lifecycle.internal.LifecycleModuleBuilder.buildProject(LifecycleModuleBuilder.java:84)
at org.apache.maven.lifecycle.internal.LifecycleModuleBuilder.buildProject(LifecycleModuleBuilder.java:59)
at org.apache.maven.lifecycle.internal.LifecycleStarter.singleThreadedBuild(LifecycleStarter.java:183)
at org.apache.maven.lifecycle.internal.LifecycleStarter.execute(LifecycleStarter.java:161)
at org.apache.maven.DefaultMaven.doExecute(DefaultMaven.java:319)
at org.apache.maven.DefaultMaven.execute(DefaultMaven.java:156)
at org.apache.maven.cli.MavenCli.execute(MavenCli.java:534)
at org.apache.maven.cli.MavenCli.doMain(MavenCli.java:196)
at org.apache.maven.cli.MavenCli.main(MavenCli.java:141)
at sun.reflect.NativeMethodAccessorImpl.invoke0(Native Method)
at sun.reflect.NativeMethodAccessorImpl.invoke(NativeMethodAccessorImpl.java:39)
at sun.reflect.DelegatingMethodAccessorImpl.invoke(DelegatingMethodAccessorImpl.java:25)
at java.lang.reflect.Method.invoke(Method.java:597)
at org.codehaus.plexus.classworlds.launcher.Launcher.launchEnhanced(Launcher.java:290)
at org.codehaus.plexus.classworlds.launcher.Launcher.launch(Launcher.java:230)
at org.codehaus.plexus.classworlds.launcher.Launcher.mainWithExitCode(Launcher.java:409)
at org.codehaus.plexus.classworlds.launcher.Launcher.main(Launcher.java:352)
Caused by: org.sonatype.aether.resolution.ArtifactResolutionException: Could not find artifact test:test-snapshot:dll:1.0-SNAPSHOT
at org.sonatype.aether.impl.internal.DefaultArtifactResolver.resolveArtifacts(DefaultArtifactResolver.java:526)
at org.sonatype.aether.impl.internal.DefaultArtifactResolver.resolveArtifact(DefaultArtifactResolver.java:214)
at org.sonatype.aether.impl.internal.DefaultRepositorySystem.resolveArtifact(DefaultRepositorySystem.java:296)
at org.apache.maven.artifact.resolver.DefaultArtifactResolver.resolve(DefaultArtifactResolver.java:229)
... 28 more
Caused by: org.sonatype.aether.transfer.ArtifactNotFoundException: Could not find artifact test:test-snapshot:dll:1.0-SNAPSHOT
at org.sonatype.aether.impl.internal.DefaultArtifactResolver.resolveArtifacts(DefaultArtifactResolver.java:517)
... 31 more
java.io.IOException: NPANDAY-180-020: Problem in resolving artifact: Artifact = test:test-snapshot:library:1.0-SNAPSHOT, Message = Could not find artifact test:test-snapshot:dll:1.0-SNAPSHOT
Try downloading the file manually from the project website.
Then, install it using the command:
mvn install:install-file -DgroupId=test -DartifactId=test-snapshot -Dversion=1.0-SNAPSHOT -Dpackaging=library -Dfile=/path/to/file
Alternatively, if you host your own repository you can deploy the file there:
mvn deploy:deploy-file -DgroupId=test -DartifactId=test-snapshot -Dversion=1.0-SNAPSHOT -Dpackaging=library -Dfile=/path/to/file -Durl=[url] -DrepositoryId=[id]
test:test-snapshot:library:1.0-SNAPSHOT
from the specified remote repositories:
(none)
at npanday.dao.impl.ProjectDaoImpl.storeProjectAndResolveDependencies(ProjectDaoImpl.java:806)
at npanday.dao.impl.ProjectDaoImpl.storeProjectAndResolveDependencies(ProjectDaoImpl.java:414)
at npanday.dao.impl.ProjectDaoImpl.storeModelAndResolveDependencies(ProjectDaoImpl.java:889)
at npanday.artifact.impl.ArtifactInstallerImpl.installArtifactWithPom(ArtifactInstallerImpl.java:401)
at npanday.plugin.install.InstallerMojo.execute(InstallerMojo.java:177)
at org.apache.maven.plugin.DefaultBuildPluginManager.executeMojo(DefaultBuildPluginManager.java:107)
at org.apache.maven.lifecycle.internal.MojoExecutor.execute(MojoExecutor.java:209)
at org.apache.maven.lifecycle.internal.MojoExecutor.execute(MojoExecutor.java:153)
at org.apache.maven.lifecycle.internal.MojoExecutor.execute(MojoExecutor.java:145)
at org.apache.maven.lifecycle.internal.LifecycleModuleBuilder.buildProject(LifecycleModuleBuilder.java:84)
at org.apache.maven.lifecycle.internal.LifecycleModuleBuilder.buildProject(LifecycleModuleBuilder.java:59)
at org.apache.maven.lifecycle.internal.LifecycleStarter.singleThreadedBuild(LifecycleStarter.java:183)
at org.apache.maven.lifecycle.internal.LifecycleStarter.execute(LifecycleStarter.java:161)
at org.apache.maven.DefaultMaven.doExecute(DefaultMaven.java:319)
at org.apache.maven.DefaultMaven.execute(DefaultMaven.java:156)
at org.apache.maven.cli.MavenCli.execute(MavenCli.java:534)
at org.apache.maven.cli.MavenCli.doMain(MavenCli.java:196)
at org.apache.maven.cli.MavenCli.main(MavenCli.java:141)
at sun.reflect.NativeMethodAccessorImpl.invoke0(Native Method)
at sun.reflect.NativeMethodAccessorImpl.invoke(NativeMethodAccessorImpl.java:39)
at sun.reflect.DelegatingMethodAccessorImpl.invoke(DelegatingMethodAccessorImpl.java:25)
at java.lang.reflect.Method.invoke(Method.java:597)
at org.codehaus.plexus.classworlds.launcher.Launcher.launchEnhanced(Launcher.java:290)
at org.codehaus.plexus.classworlds.launcher.Launcher.launch(Launcher.java:230)
at org.codehaus.plexus.classworlds.launcher.Launcher.mainWithExitCode(Launcher.java:409)
at org.codehaus.plexus.classworlds.launcher.Launcher.main(Launcher.java:352)
[INFO] ------------------------------------------------------------------------
[INFO] BUILD FAILURE
[INFO] ------------------------------------------------------------------------
[INFO] Total time: 8.704s
[INFO] Finished at: Wed Feb 09 15:39:54 CET 2011
[INFO] Final Memory: 10M/104M
[INFO] ------------------------------------------------------------------------
[ERROR] Failed to execute goal npanday.plugin:maven-install-plugin:1.3-incubating:install (default-install) on project test-mixed-versions: NPANDAY-1001-000: Failed to install artifacts: NPANDAY-001-014: Unable to store model: Message = NPANDAY-180-020: Problem in resolving artifact: Artifact = test:test-snapshot:library:1.0-SNAPSHOT, Message = Could not find artifact test:test-snapshot:dll:1.0-SNAPSHOT
[ERROR]
[ERROR] Try downloading the file manually from the project website.
[ERROR]
[ERROR] Then, install it using the command:
[ERROR] mvn install:install-file -DgroupId=test -DartifactId=test-snapshot -Dversion=1.0-SNAPSHOT -Dpackaging=library -Dfile=/path/to/file
[ERROR]
[ERROR] Alternatively, if you host your own repository you can deploy the file there:
[ERROR] mvn deploy:deploy-file -DgroupId=test -DartifactId=test-snapshot -Dversion=1.0-SNAPSHOT -Dpackaging=library -Dfile=/path/to/file -Durl=[url] -DrepositoryId=[id]
[ERROR]
[ERROR]
[ERROR] test:test-snapshot:library:1.0-SNAPSHOT
[ERROR]
[ERROR] from the specified remote repositories:
[ERROR] (none)
[ERROR] -&gt; [Help 1]
org.apache.maven.lifecycle.LifecycleExecutionException: Failed to execute goal npanday.plugin:maven-install-plugin:1.3-incubating:install (default-install) on project test-mixed-versions: NPANDAY-1001-000: Failed to install artifacts
at org.apache.maven.lifecycle.internal.MojoExecutor.execute(MojoExecutor.java:217)
at org.apache.maven.lifecycle.internal.MojoExecutor.execute(MojoExecutor.java:153)
at org.apache.maven.lifecycle.internal.MojoExecutor.execute(MojoExecutor.java:145)
at org.apache.maven.lifecycle.internal.LifecycleModuleBuilder.buildProject(LifecycleModuleBuilder.java:84)
at org.apache.maven.lifecycle.internal.LifecycleModuleBuilder.buildProject(LifecycleModuleBuilder.java:59)
at org.apache.maven.lifecycle.internal.LifecycleStarter.singleThreadedBuild(LifecycleStarter.java:183)
at org.apache.maven.lifecycle.internal.LifecycleStarter.execute(LifecycleStarter.java:161)
at org.apache.maven.DefaultMaven.doExecute(DefaultMaven.java:319)
at org.apache.maven.DefaultMaven.execute(DefaultMaven.java:156)
at org.apache.maven.cli.MavenCli.execute(MavenCli.java:534)
at org.apache.maven.cli.MavenCli.doMain(MavenCli.java:196)
at org.apache.maven.cli.MavenCli.main(MavenCli.java:141)
at sun.reflect.NativeMethodAccessorImpl.invoke0(Native Method)
at sun.reflect.NativeMethodAccessorImpl.invoke(NativeMethodAccessorImpl.java:39)
at sun.reflect.DelegatingMethodAccessorImpl.invoke(DelegatingMethodAccessorImpl.java:25)
at java.lang.reflect.Method.invoke(Method.java:597)
at org.codehaus.plexus.classworlds.launcher.Launcher.launchEnhanced(Launcher.java:290)
at org.codehaus.plexus.classworlds.launcher.Launcher.launch(Launcher.java:230)
at org.codehaus.plexus.classworlds.launcher.Launcher.mainWithExitCode(Launcher.java:409)
at org.codehaus.plexus.classworlds.launcher.Launcher.main(Launcher.java:352)
Caused by: org.apache.maven.plugin.MojoExecutionException: NPANDAY-1001-000: Failed to install artifacts
at npanday.plugin.install.InstallerMojo.execute(InstallerMojo.java:181)
at org.apache.maven.plugin.DefaultBuildPluginManager.executeMojo(DefaultBuildPluginManager.java:107)
at org.apache.maven.lifecycle.internal.MojoExecutor.execute(MojoExecutor.java:209)
... 19 more
Caused by: org.apache.maven.artifact.installer.ArtifactInstallationException: NPANDAY-001-014: Unable to store model: Message = NPANDAY-180-020: Problem in resolving artifact: Artifact = test:test-snapshot:library:1.0-SNAPSHOT, Message = Could not find artifact test:test-snapshot:dll:1.0-SNAPSHOT
Try downloading the file manually from the project website.
Then, install it using the command:
mvn install:install-file -DgroupId=test -DartifactId=test-snapshot -Dversion=1.0-SNAPSHOT -Dpackaging=library -Dfile=/path/to/file
Alternatively, if you host your own repository you can deploy the file there:
mvn deploy:deploy-file -DgroupId=test -DartifactId=test-snapshot -Dversion=1.0-SNAPSHOT -Dpackaging=library -Dfile=/path/to/file -Durl=[url] -DrepositoryId=[id]
test:test-snapshot:library:1.0-SNAPSHOT
from the specified remote repositories:
(none)
at npanday.artifact.impl.ArtifactInstallerImpl.installArtifactWithPom(ArtifactInstallerImpl.java:407)
at npanday.plugin.install.InstallerMojo.execute(InstallerMojo.java:177)
... 21 more
[ERROR]
[ERROR] Re-run Maven using the -X switch to enable full debug logging.
[ERROR]
[ERROR] For more information about the errors and possible solutions, please read the following articles:
[ERROR] [Help 1] http://cwiki.apache.org/confluence/display/MAVEN/MojoExecutionException
at org.apache.maven.it.Verifier.executeGoals(Verifier.java:1297)
at org.apache.maven.it.Verifier.executeGoal(Verifier.java:1145)
at org.apache.maven.it.Verifier.executeGoal(Verifier.java:1139)
at npanday.its.NPandayIT12940MixedVersionsTest.testMixedVersionResolution(NPandayIT12940MixedVersionsTest.java:44)
at sun.reflect.NativeMethodAccessorImpl.invoke0(Native Method)
at sun.reflect.NativeMethodAccessorImpl.invoke(NativeMethodAccessorImpl.java:39)
at sun.reflect.DelegatingMethodAccessorImpl.invoke(DelegatingMethodAccessorImpl.java:25)
at java.lang.reflect.Method.invoke(Method.java:597)
at junit.framework.TestCase.runTest(TestCase.java:164)
at npanday.its.AbstractNPandayIntegrationTestCase.runTest(AbstractNPandayIntegrationTestCase.java:218)
at junit.framework.TestCase.runBare(TestCase.java:130)
at junit.framework.TestResult$1.protect(TestResult.java:106)
at junit.framework.TestResult.runProtected(TestResult.java:124)
at junit.framework.TestResult.run(TestResult.java:109)
at junit.framework.TestCase.run(TestCase.java:120)
at junit.framework.TestSuite.runTest(TestSuite.java:230)
at junit.framework.TestSuite.run(TestSuite.java:225)
at junit.framework.TestSuite.runTest(TestSuite.java:230)
at junit.framework.TestSuite.run(TestSuite.java:225)
at sun.reflect.NativeMethodAccessorImpl.invoke0(Native Method)
at sun.reflect.NativeMethodAccessorImpl.invoke(NativeMethodAccessorImpl.java:39)
at sun.reflect.DelegatingMethodAccessorImpl.invoke(DelegatingMethodAccessorImpl.java:25)
at java.lang.reflect.Method.invoke(Method.java:597)
at org.apache.maven.surefire.junit.JUnitTestSet.execute(JUnitTestSet.java:207)
at org.apache.maven.surefire.junit.JUnit3Provider.executeTestSet(JUnit3Provider.java:107)
at org.apache.maven.surefire.junit.JUnit3Provider.invoke(JUnit3Provider.java:79)
at sun.reflect.NativeMethodAccessorImpl.invoke0(Native Method)
at sun.reflect.NativeMethodAccessorImpl.invoke(NativeMethodAccessorImpl.java:39)
at sun.reflect.DelegatingMethodAccessorImpl.invoke(DelegatingMethodAccessorImpl.java:25)
at java.lang.reflect.Method.invoke(Method.java:597)
at org.apache.maven.surefire.booter.ProviderFactory$ClassLoaderProxy.invoke(ProviderFactory.java:103)
at $Proxy0.invoke(Unknown Source)
at org.apache.maven.surefire.booter.SurefireStarter.invokeProvider(SurefireStarter.java:145)
at org.apache.maven.surefire.booter.SurefireStarter.runSuitesInProcess(SurefireStarter.java:87)
at org.apache.maven.surefire.booter.ForkedBooter.main(ForkedBooter.java:69)
Caused by: org.sonatype.aether.resolution.ArtifactResolutionException: Could not find artifact test:test-snapshot:dll:1.0-SNAPSHOT
at org.sonatype.aether.impl.internal.DefaultArtifactResolver.resolveArtifacts(DefaultArtifactResolver.java:526)
at org.sonatype.aether.impl.internal.DefaultArtifactResolver.resolveArtifact(DefaultArtifactResolver.java:214)
at org.sonatype.aether.impl.internal.DefaultRepositorySystem.resolveArtifact(DefaultRepositorySystem.java:296)
at org.apache.maven.artifact.resolver.DefaultArtifactResolver.resolve(DefaultArtifactResolver.java:229)
... 28 more
Caused by: org.sonatype.aether.transfer.ArtifactNotFoundException: Could not find artifact test:test-snapshot:dll:1.0-SNAPSHOT
at org.sonatype.aether.impl.internal.DefaultArtifactResolver.resolveArtifacts(DefaultArtifactResolver.java:517)
... 31 more
java.io.IOException: NPANDAY-180-020: Problem in resolving artifact: Artifact = test:test-snapshot:library:1.0-SNAPSHOT, Message = Could not find artifact test:test-snapshot:dll:1.0-SNAPSHOT
Try downloading the file manually from the project website.
Then, install it using the command:
mvn install:install-file -DgroupId=test -DartifactId=test-snapshot -Dversion=1.0-SNAPSHOT -Dpackaging=library -Dfile=/path/to/file
Alternatively, if you host your own repository you can deploy the file there:
mvn deploy:deploy-file -DgroupId=test -DartifactId=test-snapshot -Dversion=1.0-SNAPSHOT -Dpackaging=library -Dfile=/path/to/file -Durl=[url] -DrepositoryId=[id]
test:test-snapshot:library:1.0-SNAPSHOT
from the specified remote repositories:
(none)
at npanday.dao.impl.ProjectDaoImpl.storeProjectAndResolveDependencies(ProjectDaoImpl.java:806)
at npanday.dao.impl.ProjectDaoImpl.storeProjectAndResolveDependencies(ProjectDaoImpl.java:414)
at npanday.dao.impl.ProjectDaoImpl.storeModelAndResolveDependencies(ProjectDaoImpl.java:889)
at npanday.artifact.impl.ArtifactInstallerImpl.installArtifactWithPom(ArtifactInstallerImpl.java:401)
at npanday.plugin.install.InstallerMojo.execute(InstallerMojo.java:177)
at org.apache.maven.plugin.DefaultBuildPluginManager.executeMojo(DefaultBuildPluginManager.java:107)
at org.apache.maven.lifecycle.internal.MojoExecutor.execute(MojoExecutor.java:209)
at org.apache.maven.lifecycle.internal.MojoExecutor.execute(MojoExecutor.java:153)
at org.apache.maven.lifecycle.internal.MojoExecutor.execute(MojoExecutor.java:145)
at org.apache.maven.lifecycle.internal.LifecycleModuleBuilder.buildProject(LifecycleModuleBuilder.java:84)
at org.apache.maven.lifecycle.internal.LifecycleModuleBuilder.buildProject(LifecycleModuleBuilder.java:59)
at org.apache.maven.lifecycle.internal.LifecycleStarter.singleThreadedBuild(LifecycleStarter.java:183)
at org.apache.maven.lifecycle.internal.LifecycleStarter.execute(LifecycleStarter.java:161)
at org.apache.maven.DefaultMaven.doExecute(DefaultMaven.java:319)
at org.apache.maven.DefaultMaven.execute(DefaultMaven.java:156)
at org.apache.maven.cli.MavenCli.execute(MavenCli.java:534)
at org.apache.maven.cli.MavenCli.doMain(MavenCli.java:196)
at org.apache.maven.cli.MavenCli.main(MavenCli.java:141)
at sun.reflect.NativeMethodAccessorImpl.invoke0(Native Method)
at sun.reflect.NativeMethodAccessorImpl.invoke(NativeMethodAccessorImpl.java:39)
at sun.reflect.DelegatingMethodAccessorImpl.invoke(DelegatingMethodAccessorImpl.java:25)
at java.lang.reflect.Method.invoke(Method.java:597)
at org.codehaus.plexus.classworlds.launcher.Launcher.launchEnhanced(Launcher.java:290)
at org.codehaus.plexus.classworlds.launcher.Launcher.launch(Launcher.java:230)
at org.codehaus.plexus.classworlds.launcher.Launcher.mainWithExitCode(Launcher.java:409)
at org.codehaus.plexus.classworlds.launcher.Launcher.main(Launcher.java:352)
[INFO] ------------------------------------------------------------------------
[INFO] BUILD FAILURE
[INFO] ------------------------------------------------------------------------
[INFO] Total time: 8.704s
[INFO] Finished at: Wed Feb 09 15:39:54 CET 2011
[INFO] Final Memory: 10M/104M
[INFO] ------------------------------------------------------------------------
[ERROR] Failed to execute goal npanday.plugin:maven-install-plugin:1.3-incubating:install (default-install) on project test-mixed-versions: NPANDAY-1001-000: Failed to install artifacts: NPANDAY-001-014: Unable to store model: Message = NPANDAY-180-020: Problem in resolving artifact: Artifact = test:test-snapshot:library:1.0-SNAPSHOT, Message = Could not find artifact test:test-snapshot:dll:1.0-SNAPSHOT
[ERROR]
[ERROR] Try downloading the file manually from the project website.
[ERROR]
[ERROR] Then, install it using the command:
[ERROR] mvn install:install-file -DgroupId=test -DartifactId=test-snapshot -Dversion=1.0-SNAPSHOT -Dpackaging=library -Dfile=/path/to/file
[ERROR]
[ERROR] Alternatively, if you host your own repository you can deploy the file there:
[ERROR] mvn deploy:deploy-file -DgroupId=test -DartifactId=test-snapshot -Dversion=1.0-SNAPSHOT -Dpackaging=library -Dfile=/path/to/file -Durl=[url] -DrepositoryId=[id]
[ERROR]
[ERROR]
[ERROR] test:test-snapshot:library:1.0-SNAPSHOT
[ERROR]
[ERROR] from the specified remote repositories:
[ERROR] (none)
[ERROR] -&gt; [Help 1]
org.apache.maven.lifecycle.LifecycleExecutionException: Failed to execute goal npanday.plugin:maven-install-plugin:1.3-incubating:install (default-install) on project test-mixed-versions: NPANDAY-1001-000: Failed to install artifacts
at org.apache.maven.lifecycle.internal.MojoExecutor.execute(MojoExecutor.java:217)
at org.apache.maven.lifecycle.internal.MojoExecutor.execute(MojoExecutor.java:153)
at org.apache.maven.lifecycle.internal.MojoExecutor.execute(MojoExecutor.java:145)
at org.apache.maven.lifecycle.internal.LifecycleModuleBuilder.buildProject(LifecycleModuleBuilder.java:84)
at org.apache.maven.lifecycle.internal.LifecycleModuleBuilder.buildProject(LifecycleModuleBuilder.java:59)
at org.apache.maven.lifecycle.internal.LifecycleStarter.singleThreadedBuild(LifecycleStarter.java:183)
at org.apache.maven.lifecycle.internal.LifecycleStarter.execute(LifecycleStarter.java:161)
at org.apache.maven.DefaultMaven.doExecute(DefaultMaven.java:319)
at org.apache.maven.DefaultMaven.execute(DefaultMaven.java:156)
at org.apache.maven.cli.MavenCli.execute(MavenCli.java:534)
at org.apache.maven.cli.MavenCli.doMain(MavenCli.java:196)
at org.apache.maven.cli.MavenCli.main(MavenCli.java:141)
at sun.reflect.NativeMethodAccessorImpl.invoke0(Native Method)
at sun.reflect.NativeMethodAccessorImpl.invoke(NativeMethodAccessorImpl.java:39)
at sun.reflect.DelegatingMethodAccessorImpl.invoke(DelegatingMethodAccessorImpl.java:25)
at java.lang.reflect.Method.invoke(Method.java:597)
at org.codehaus.plexus.classworlds.launcher.Launcher.launchEnhanced(Launcher.java:290)
at org.codehaus.plexus.classworlds.launcher.Launcher.launch(Launcher.java:230)
at org.codehaus.plexus.classworlds.launcher.Launcher.mainWithExitCode(Launcher.java:409)
at org.codehaus.plexus.classworlds.launcher.Launcher.main(Launcher.java:352)
Caused by: org.apache.maven.plugin.MojoExecutionException: NPANDAY-1001-000: Failed to install artifacts
at npanday.plugin.install.InstallerMojo.execute(InstallerMojo.java:181)
at org.apache.maven.plugin.DefaultBuildPluginManager.executeMojo(DefaultBuildPluginManager.java:107)
at org.apache.maven.lifecycle.internal.MojoExecutor.execute(MojoExecutor.java:209)
... 19 more
Caused by: org.apache.maven.artifact.installer.ArtifactInstallationException: NPANDAY-001-014: Unable to store model: Message = NPANDAY-180-020: Problem in resolving artifact: Artifact = test:test-snapshot:library:1.0-SNAPSHOT, Message = Could not find artifact test:test-snapshot:dll:1.0-SNAPSHOT
Try downloading the file manually from the project website.
Then, install it using the command:
mvn install:install-file -DgroupId=test -DartifactId=test-snapshot -Dversion=1.0-SNAPSHOT -Dpackaging=library -Dfile=/path/to/file
Alternatively, if you host your own repository you can deploy the file there:
mvn deploy:deploy-file -DgroupId=test -DartifactId=test-snapshot -Dversion=1.0-SNAPSHOT -Dpackaging=library -Dfile=/path/to/file -Durl=[url] -DrepositoryId=[id]
test:test-snapshot:library:1.0-SNAPSHOT
from the specified remote repositories:
(none)
at npanday.artifact.impl.ArtifactInstallerImpl.installArtifactWithPom(ArtifactInstallerImpl.java:407)
at npanday.plugin.install.InstallerMojo.execute(InstallerMojo.java:177)
... 21 more
[ERROR]
[ERROR] Re-run Maven using the -X switch to enable full debug logging.
[ERROR]
[ERROR] For more information about the errors and possible solutions, please read the following articles:
[ERROR] [Help 1] http://cwiki.apache.org/confluence/display/MAVEN/MojoExecutionException
at org.apache.maven.it.Verifier.executeGoals(Verifier.java:1297)
at org.apache.maven.it.Verifier.executeGoal(Verifier.java:1145)
at org.apache.maven.it.Verifier.executeGoal(Verifier.java:1139)
at npanday.its.NPandayIT12940MixedVersionsTest.testMixedVersionResolution(NPandayIT12940MixedVersionsTest.java:44)
at sun.reflect.NativeMethodAccessorImpl.invoke0(Native Method)
at sun.reflect.NativeMethodAccessorImpl.invoke(NativeMethodAccessorImpl.java:39)
at sun.reflect.DelegatingMethodAccessorImpl.invoke(DelegatingMethodAccessorImpl.java:25)
at java.lang.reflect.Method.invoke(Method.java:597)
at junit.framework.TestCase.runTest(TestCase.java:164)
at npanday.its.AbstractNPandayIntegrationTestCase.runTest(AbstractNPandayIntegrationTestCase.java:218)
at junit.framework.TestCase.runBare(TestCase.java:130)
at junit.framework.TestResult$1.protect(TestResult.java:106)
at junit.framework.TestResult.runProtected(TestResult.java:124)
at junit.framework.TestResult.run(TestResult.java:109)
at junit.framework.TestCase.run(TestCase.java:120)
at junit.framework.TestSuite.runTest(TestSuite.java:230)
at junit.framework.TestSuite.run(TestSuite.java:225)
at junit.framework.TestSuite.runTest(TestSuite.java:230)
at junit.framework.TestSuite.run(TestSuite.java:225)
at sun.reflect.NativeMethodAccessorImpl.invoke0(Native Method)
at sun.reflect.NativeMethodAccessorImpl.invoke(NativeMethodAccessorImpl.java:39)
at sun.reflect.DelegatingMethodAccessorImpl.invoke(DelegatingMethodAccessorImpl.java:25)
at java.lang.reflect.Method.invoke(Method.java:597)
at org.apache.maven.surefire.junit.JUnitTestSet.execute(JUnitTestSet.java:207)
at org.apache.maven.surefire.junit.JUnit3Provider.executeTestSet(JUnit3Provider.java:107)
at org.apache.maven.surefire.junit.JUnit3Provider.invoke(JUnit3Provider.java:79)
at sun.reflect.NativeMethodAccessorImpl.invoke0(Native Method)
at sun.reflect.NativeMethodAccessorImpl.invoke(NativeMethodAccessorImpl.java:39)
at sun.reflect.DelegatingMethodAccessorImpl.invoke(DelegatingMethodAccessorImpl.java:25)
at java.lang.reflect.Method.invoke(Method.java:597)
at org.apache.maven.surefire.booter.ProviderFactory$ClassLoaderProxy.invoke(ProviderFactory.java:103)
at $Proxy0.invoke(Unknown Source)
at org.apache.maven.surefire.booter.SurefireStarter.invokeProvider(SurefireStarter.java:145)
at org.apache.maven.surefire.booter.SurefireStarter.runSuitesInProcess(SurefireStarter.java:87)
at org.apache.maven.surefire.booter.ForkedBooter.main(ForkedBooter.java:69)
</error>
</testcase>
<testcase time="5.781" classname="npanday.its.NPandayIT11480MVCProjectTest" name="testMVCProject">
<error message="Exit code was non-zero: 1; command line and log =
&quot;C:\Program Files\Apache\apache-maven-3.0.2\bin\mvn&quot; -Dnpanday.version=1.3-incubating -e --batch-mode &quot;-Dmaven.repo.local=C:\Users\Lars Corneliussen\.m2\repository&quot; org.apache.maven.plugins:maven-clean-plugin:clean install
[INFO] Error stacktraces are turned on.
[INFO] Scanning for projects...
[INFO] ------------------------------------------------------------------------
[INFO] Reactor Build Order:
[INFO]
[INFO] NPanday.IT : NPanday11480-parent
[INFO] NPanday.IT : NPanday11480
[INFO]
[INFO] ------------------------------------------------------------------------
[INFO] Building NPanday.IT : NPanday11480-parent 1.0-SNAPSHOT
[INFO] ------------------------------------------------------------------------
[INFO]
[INFO] --- maven-clean-plugin:2.4.1:clean (default-cli) @ NPanday11480-parent ---
[INFO]
[INFO] --- maven-install-plugin:2.3.1:install (default-install) @ NPanday11480-parent ---
[INFO] Installing C:\Workbench\NPanday\npanday-its-1.3-incubating\target\test-classes\NPanday11480\pom.xml to C:\Users\Lars Corneliussen\.m2\repository\NPanday\IT\NPanday11480-parent\1.0-SNAPSHOT\NPanday11480-parent-1.0-SNAPSHOT.pom
[INFO]
[INFO] ------------------------------------------------------------------------
[INFO] Building NPanday.IT : NPanday11480 1.0-SNAPSHOT
[INFO] ------------------------------------------------------------------------
[INFO]
[INFO] --- maven-clean-plugin:2.4.1:clean (default-cli) @ NPanday11480 ---
[INFO]
[INFO] --- maven-compile-plugin:1.3-incubating:initialize (default-initialize) @ NPanday11480 ---
SLF4J: Class path contains multiple SLF4J bindings.
SLF4J: Found binding in [jar:file:/C:/Users/Lars%20Corneliussen/.m2/repository/org/sonatype/gossip/gossip/1.0/gossip-1.0.jar!/org/slf4j/impl/StaticLoggerBinder.class]
SLF4J: Found binding in [jar:file:/C:/Users/Lars%20Corneliussen/.m2/repository/org/slf4j/slf4j-jdk14/1.5.11/slf4j-jdk14-1.5.11.jar!/org/slf4j/impl/StaticLoggerBinder.class]
SLF4J: See http://www.slf4j.org/codes.html#multiple_bindings for an explanation.
09.02.2011 15:39:58 npanday.registry.ConnectionsRepository lazyLoad
INFO: NPANDAY-080-001: Adding data access object: Class Name = npanday.dao.impl.ProjectDaoImpl
09.02.2011 15:39:58 npanday.registry.ConnectionsRepository lazyLoad
INFO: NPANDAY-080-004: Connection Start Up: Time = 172
09.02.2011 15:39:58 npanday.dao.impl.ProjectDaoImpl storeProjectAndResolveDependencies
INFO: NPANDAY-180-011: Project Dependency: Artifact ID = System.Web.Mvc, Group ID = System.Web.Mvc, Version = 2.0.0.0, Artifact Type = gac_msil
09.02.2011 15:39:58 npanday.dao.impl.ProjectDaoImpl storeProjectAndResolveDependencies
INFO: NPANDAY-180-011: Project Dependency: Artifact ID = System.ComponentModel.DataAnnotations, Group ID = System.ComponentModel.DataAnnotations, Version = 3.5.0.0, Artifact Type = gac_msil
09.02.2011 15:39:58 npanday.dao.impl.ProjectDaoImpl storeProjectAndResolveDependencies
INFO: NPANDAY-180-011: Project Dependency: Artifact ID = System.Web.Abstractions, Group ID = System.Web.Abstractions, Version = 3.5.0.0, Artifact Type = gac_msil
09.02.2011 15:39:58 npanday.dao.impl.ProjectDaoImpl storeProjectAndResolveDependencies
INFO: NPANDAY-180-011: Project Dependency: Artifact ID = System.Web.Routing, Group ID = System.Web.Routing, Version = 3.5.0.0, Artifact Type = gac_msil
[INFO] Mojo Execution Time = 203
[INFO]
[INFO] --- maven-resolver-plugin:1.3-incubating:resolve (default-resolve) @ NPanday11480 ---
[INFO] Mojo Execution Time = 0
[INFO]
[INFO] --- NPanday.Plugin.Settings.JavaBinding:1.3-incubating:generate-settings (default-generate-settings) @ NPanday11480 ---
[INFO]
[INFO] --- maven-compile-plugin:1.3-incubating:generate-assembly-info (default-generate-assembly-info) @ NPanday11480 ---
[INFO] NPANDAY-902-001: Found AssemblyInfo file(s), so will not generate one
[INFO]
[INFO] --- maven-compile-plugin:1.3-incubating:process-sources (default-process-sources) @ NPanday11480 ---
[INFO] NPANDAY-904-002: Copying source files: From = C:\Workbench\NPanday\npanday-its-1.3-incubating\target\test-classes\NPanday11480\NPanday11480, To = C:\Workbench\NPanday\npanday-its-1.3-incubating\target\test-classes\NPanday11480\NPanday11480\target/build-sources, File Count = 5
[INFO]
[INFO] --- maven-compile-plugin:1.3-incubating:process-test-sources (default-process-test-sources) @ NPanday11480 ---
[INFO] NPANDAY-905-001: No test source files to copy
[INFO]
[INFO] --- maven-resgen-plugin:1.3-incubating:copy-resources (default-copy-resources) @ NPanday11480 ---
[INFO]
[INFO] --- maven-resgen-plugin:1.3-incubating:generate (default-generate) @ NPanday11480 ---
[INFO]
[INFO] --- maven-resgen-plugin:1.3-incubating:generate-existing-resx-to-resource (default-generate-existing-resx-to-resource) @ NPanday11480 ---
[INFO]
[INFO] --- maven-compile-plugin:1.3-incubating:compile (default-compile) @ NPanday11480 ---
[INFO] NPANDAY-066-013: Found Vendor = Vendor = MICROSOFT, Vendor Version = 3.5, Framework Version = 3.5, Executable Paths =
[INFO] NPANDAY-068-003: Compiling Artifact: Vendor = MICROSOFT, Language = MICROSOFT, Assembly Name = C:\Workbench\NPanday\npanday-its-1.3-incubating\target\test-classes\NPanday11480\NPanday11480\target\NPanday11480.dll
error CS0006: Metadata file &apos;C:\Windows\Microsoft.NET\Framework\v3.5\Microsoft.CompactFramework.Build.Tasks.dll&apos; could not be found
[INFO] ------------------------------------------------------------------------
[INFO] Reactor Summary:
[INFO]
[INFO] NPanday.IT : NPanday11480-parent .................. SUCCESS [0.250s]
[INFO] NPanday.IT : NPanday11480 ......................... FAILURE [2.234s]
[INFO] ------------------------------------------------------------------------
[INFO] BUILD FAILURE
[INFO] ------------------------------------------------------------------------
[INFO] Total time: 4.234s
[INFO] Finished at: Wed Feb 09 15:40:00 CET 2011
[INFO] Final Memory: 9M/129M
[INFO] ------------------------------------------------------------------------
[ERROR] Failed to execute goal npanday.plugin:maven-compile-plugin:1.3-incubating:compile (default-compile) on project NPanday11480: NPANDAY-900-006: Unable to Compile: Language = C_SHARP, Vendor = null, ArtifactType = library, Source Directory = C:\Workbench\NPanday\npanday-its-1.3-incubating\target\test-classes\NPanday11480\NPanday11480: NPANDAY-040-001: Could not execute: Command = cmd.exe /X /C &quot;csc @C:\Workbench\NPanday\npanday-its-1.3-incubating\target\test-classes\NPanday11480\NPanday11480\target\915400\responsefile.rsp&quot;, Result = 1 -&gt; [Help 1]
org.apache.maven.lifecycle.LifecycleExecutionException: Failed to execute goal npanday.plugin:maven-compile-plugin:1.3-incubating:compile (default-compile) on project NPanday11480: NPANDAY-900-006: Unable to Compile: Language = C_SHARP, Vendor = null, ArtifactType = library, Source Directory = C:\Workbench\NPanday\npanday-its-1.3-incubating\target\test-classes\NPanday11480\NPanday11480
at org.apache.maven.lifecycle.internal.MojoExecutor.execute(MojoExecutor.java:217)
at org.apache.maven.lifecycle.internal.MojoExecutor.execute(MojoExecutor.java:153)
at org.apache.maven.lifecycle.internal.MojoExecutor.execute(MojoExecutor.java:145)
at org.apache.maven.lifecycle.internal.LifecycleModuleBuilder.buildProject(LifecycleModuleBuilder.java:84)
at org.apache.maven.lifecycle.internal.LifecycleModuleBuilder.buildProject(LifecycleModuleBuilder.java:59)
at org.apache.maven.lifecycle.internal.LifecycleStarter.singleThreadedBuild(LifecycleStarter.java:183)
at org.apache.maven.lifecycle.internal.LifecycleStarter.execute(LifecycleStarter.java:161)
at org.apache.maven.DefaultMaven.doExecute(DefaultMaven.java:319)
at org.apache.maven.DefaultMaven.execute(DefaultMaven.java:156)
at org.apache.maven.cli.MavenCli.execute(MavenCli.java:534)
at org.apache.maven.cli.MavenCli.doMain(MavenCli.java:196)
at org.apache.maven.cli.MavenCli.main(MavenCli.java:141)
at sun.reflect.NativeMethodAccessorImpl.invoke0(Native Method)
at sun.reflect.NativeMethodAccessorImpl.invoke(NativeMethodAccessorImpl.java:39)
at sun.reflect.DelegatingMethodAccessorImpl.invoke(DelegatingMethodAccessorImpl.java:25)
at java.lang.reflect.Method.invoke(Method.java:597)
at org.codehaus.plexus.classworlds.launcher.Launcher.launchEnhanced(Launcher.java:290)
at org.codehaus.plexus.classworlds.launcher.Launcher.launch(Launcher.java:230)
at org.codehaus.plexus.classworlds.launcher.Launcher.mainWithExitCode(Launcher.java:409)
at org.codehaus.plexus.classworlds.launcher.Launcher.main(Launcher.java:352)
Caused by: org.apache.maven.plugin.MojoExecutionException: NPANDAY-900-006: Unable to Compile: Language = C_SHARP, Vendor = null, ArtifactType = library, Source Directory = C:\Workbench\NPanday\npanday-its-1.3-incubating\target\test-classes\NPanday11480\NPanday11480
at npanday.plugin.compile.AbstractCompilerMojo.execute(AbstractCompilerMojo.java:1132)
at npanday.plugin.compile.AbstractCompilerMojo.execute(AbstractCompilerMojo.java:714)
at org.apache.maven.plugin.DefaultBuildPluginManager.executeMojo(DefaultBuildPluginManager.java:107)
at org.apache.maven.lifecycle.internal.MojoExecutor.execute(MojoExecutor.java:209)
... 19 more
Caused by: npanday.executable.ExecutionException: NPANDAY-040-001: Could not execute: Command = cmd.exe /X /C &quot;csc @C:\Workbench\NPanday\npanday-its-1.3-incubating\target\test-classes\NPanday11480\NPanday11480\target\915400\responsefile.rsp&quot;, Result = 1
at npanday.executable.CommandExecutor$Factory$1.executeCommand(CommandExecutor.java:366)
at npanday.executable.compiler.impl.BaseCompiler.execute(BaseCompiler.java:129)
at npanday.plugin.compile.AbstractCompilerMojo.execute(AbstractCompilerMojo.java:1113)
... 22 more
[ERROR]
[ERROR] Re-run Maven using the -X switch to enable full debug logging.
[ERROR]
[ERROR] For more information about the errors and possible solutions, please read the following articles:
[ERROR] [Help 1] http://cwiki.apache.org/confluence/display/MAVEN/MojoExecutionException
[ERROR]
[ERROR] After correcting the problems, you can resume the build with the command
[ERROR] mvn &lt;goals&gt; -rf :NPanday11480
" type="org.apache.maven.it.VerificationException">org.apache.maven.it.VerificationException: Exit code was non-zero: 1; command line and log =
&quot;C:\Program Files\Apache\apache-maven-3.0.2\bin\mvn&quot; -Dnpanday.version=1.3-incubating -e --batch-mode &quot;-Dmaven.repo.local=C:\Users\Lars Corneliussen\.m2\repository&quot; org.apache.maven.plugins:maven-clean-plugin:clean install
[INFO] Error stacktraces are turned on.
[INFO] Scanning for projects...
[INFO] ------------------------------------------------------------------------
[INFO] Reactor Build Order:
[INFO]
[INFO] NPanday.IT : NPanday11480-parent
[INFO] NPanday.IT : NPanday11480
[INFO]
[INFO] ------------------------------------------------------------------------
[INFO] Building NPanday.IT : NPanday11480-parent 1.0-SNAPSHOT
[INFO] ------------------------------------------------------------------------
[INFO]
[INFO] --- maven-clean-plugin:2.4.1:clean (default-cli) @ NPanday11480-parent ---
[INFO]
[INFO] --- maven-install-plugin:2.3.1:install (default-install) @ NPanday11480-parent ---
[INFO] Installing C:\Workbench\NPanday\npanday-its-1.3-incubating\target\test-classes\NPanday11480\pom.xml to C:\Users\Lars Corneliussen\.m2\repository\NPanday\IT\NPanday11480-parent\1.0-SNAPSHOT\NPanday11480-parent-1.0-SNAPSHOT.pom
[INFO]
[INFO] ------------------------------------------------------------------------
[INFO] Building NPanday.IT : NPanday11480 1.0-SNAPSHOT
[INFO] ------------------------------------------------------------------------
[INFO]
[INFO] --- maven-clean-plugin:2.4.1:clean (default-cli) @ NPanday11480 ---
[INFO]
[INFO] --- maven-compile-plugin:1.3-incubating:initialize (default-initialize) @ NPanday11480 ---
SLF4J: Class path contains multiple SLF4J bindings.
SLF4J: Found binding in [jar:file:/C:/Users/Lars%20Corneliussen/.m2/repository/org/sonatype/gossip/gossip/1.0/gossip-1.0.jar!/org/slf4j/impl/StaticLoggerBinder.class]
SLF4J: Found binding in [jar:file:/C:/Users/Lars%20Corneliussen/.m2/repository/org/slf4j/slf4j-jdk14/1.5.11/slf4j-jdk14-1.5.11.jar!/org/slf4j/impl/StaticLoggerBinder.class]
SLF4J: See http://www.slf4j.org/codes.html#multiple_bindings for an explanation.
09.02.2011 15:39:58 npanday.registry.ConnectionsRepository lazyLoad
INFO: NPANDAY-080-001: Adding data access object: Class Name = npanday.dao.impl.ProjectDaoImpl
09.02.2011 15:39:58 npanday.registry.ConnectionsRepository lazyLoad
INFO: NPANDAY-080-004: Connection Start Up: Time = 172
09.02.2011 15:39:58 npanday.dao.impl.ProjectDaoImpl storeProjectAndResolveDependencies
INFO: NPANDAY-180-011: Project Dependency: Artifact ID = System.Web.Mvc, Group ID = System.Web.Mvc, Version = 2.0.0.0, Artifact Type = gac_msil
09.02.2011 15:39:58 npanday.dao.impl.ProjectDaoImpl storeProjectAndResolveDependencies
INFO: NPANDAY-180-011: Project Dependency: Artifact ID = System.ComponentModel.DataAnnotations, Group ID = System.ComponentModel.DataAnnotations, Version = 3.5.0.0, Artifact Type = gac_msil
09.02.2011 15:39:58 npanday.dao.impl.ProjectDaoImpl storeProjectAndResolveDependencies
INFO: NPANDAY-180-011: Project Dependency: Artifact ID = System.Web.Abstractions, Group ID = System.Web.Abstractions, Version = 3.5.0.0, Artifact Type = gac_msil
09.02.2011 15:39:58 npanday.dao.impl.ProjectDaoImpl storeProjectAndResolveDependencies
INFO: NPANDAY-180-011: Project Dependency: Artifact ID = System.Web.Routing, Group ID = System.Web.Routing, Version = 3.5.0.0, Artifact Type = gac_msil
[INFO] Mojo Execution Time = 203
[INFO]
[INFO] --- maven-resolver-plugin:1.3-incubating:resolve (default-resolve) @ NPanday11480 ---
[INFO] Mojo Execution Time = 0
[INFO]
[INFO] --- NPanday.Plugin.Settings.JavaBinding:1.3-incubating:generate-settings (default-generate-settings) @ NPanday11480 ---
[INFO]
[INFO] --- maven-compile-plugin:1.3-incubating:generate-assembly-info (default-generate-assembly-info) @ NPanday11480 ---
[INFO] NPANDAY-902-001: Found AssemblyInfo file(s), so will not generate one
[INFO]
[INFO] --- maven-compile-plugin:1.3-incubating:process-sources (default-process-sources) @ NPanday11480 ---
[INFO] NPANDAY-904-002: Copying source files: From = C:\Workbench\NPanday\npanday-its-1.3-incubating\target\test-classes\NPanday11480\NPanday11480, To = C:\Workbench\NPanday\npanday-its-1.3-incubating\target\test-classes\NPanday11480\NPanday11480\target/build-sources, File Count = 5
[INFO]
[INFO] --- maven-compile-plugin:1.3-incubating:process-test-sources (default-process-test-sources) @ NPanday11480 ---
[INFO] NPANDAY-905-001: No test source files to copy
[INFO]
[INFO] --- maven-resgen-plugin:1.3-incubating:copy-resources (default-copy-resources) @ NPanday11480 ---
[INFO]
[INFO] --- maven-resgen-plugin:1.3-incubating:generate (default-generate) @ NPanday11480 ---
[INFO]
[INFO] --- maven-resgen-plugin:1.3-incubating:generate-existing-resx-to-resource (default-generate-existing-resx-to-resource) @ NPanday11480 ---
[INFO]
[INFO] --- maven-compile-plugin:1.3-incubating:compile (default-compile) @ NPanday11480 ---
[INFO] NPANDAY-066-013: Found Vendor = Vendor = MICROSOFT, Vendor Version = 3.5, Framework Version = 3.5, Executable Paths =
[INFO] NPANDAY-068-003: Compiling Artifact: Vendor = MICROSOFT, Language = MICROSOFT, Assembly Name = C:\Workbench\NPanday\npanday-its-1.3-incubating\target\test-classes\NPanday11480\NPanday11480\target\NPanday11480.dll
error CS0006: Metadata file &apos;C:\Windows\Microsoft.NET\Framework\v3.5\Microsoft.CompactFramework.Build.Tasks.dll&apos; could not be found
[INFO] ------------------------------------------------------------------------
[INFO] Reactor Summary:
[INFO]
[INFO] NPanday.IT : NPanday11480-parent .................. SUCCESS [0.250s]
[INFO] NPanday.IT : NPanday11480 ......................... FAILURE [2.234s]
[INFO] ------------------------------------------------------------------------
[INFO] BUILD FAILURE
[INFO] ------------------------------------------------------------------------
[INFO] Total time: 4.234s
[INFO] Finished at: Wed Feb 09 15:40:00 CET 2011
[INFO] Final Memory: 9M/129M
[INFO] ------------------------------------------------------------------------
[ERROR] Failed to execute goal npanday.plugin:maven-compile-plugin:1.3-incubating:compile (default-compile) on project NPanday11480: NPANDAY-900-006: Unable to Compile: Language = C_SHARP, Vendor = null, ArtifactType = library, Source Directory = C:\Workbench\NPanday\npanday-its-1.3-incubating\target\test-classes\NPanday11480\NPanday11480: NPANDAY-040-001: Could not execute: Command = cmd.exe /X /C &quot;csc @C:\Workbench\NPanday\npanday-its-1.3-incubating\target\test-classes\NPanday11480\NPanday11480\target\915400\responsefile.rsp&quot;, Result = 1 -&gt; [Help 1]
org.apache.maven.lifecycle.LifecycleExecutionException: Failed to execute goal npanday.plugin:maven-compile-plugin:1.3-incubating:compile (default-compile) on project NPanday11480: NPANDAY-900-006: Unable to Compile: Language = C_SHARP, Vendor = null, ArtifactType = library, Source Directory = C:\Workbench\NPanday\npanday-its-1.3-incubating\target\test-classes\NPanday11480\NPanday11480
at org.apache.maven.lifecycle.internal.MojoExecutor.execute(MojoExecutor.java:217)
at org.apache.maven.lifecycle.internal.MojoExecutor.execute(MojoExecutor.java:153)
at org.apache.maven.lifecycle.internal.MojoExecutor.execute(MojoExecutor.java:145)
at org.apache.maven.lifecycle.internal.LifecycleModuleBuilder.buildProject(LifecycleModuleBuilder.java:84)
at org.apache.maven.lifecycle.internal.LifecycleModuleBuilder.buildProject(LifecycleModuleBuilder.java:59)
at org.apache.maven.lifecycle.internal.LifecycleStarter.singleThreadedBuild(LifecycleStarter.java:183)
at org.apache.maven.lifecycle.internal.LifecycleStarter.execute(LifecycleStarter.java:161)
at org.apache.maven.DefaultMaven.doExecute(DefaultMaven.java:319)
at org.apache.maven.DefaultMaven.execute(DefaultMaven.java:156)
at org.apache.maven.cli.MavenCli.execute(MavenCli.java:534)
at org.apache.maven.cli.MavenCli.doMain(MavenCli.java:196)
at org.apache.maven.cli.MavenCli.main(MavenCli.java:141)
at sun.reflect.NativeMethodAccessorImpl.invoke0(Native Method)
at sun.reflect.NativeMethodAccessorImpl.invoke(NativeMethodAccessorImpl.java:39)
at sun.reflect.DelegatingMethodAccessorImpl.invoke(DelegatingMethodAccessorImpl.java:25)
at java.lang.reflect.Method.invoke(Method.java:597)
at org.codehaus.plexus.classworlds.launcher.Launcher.launchEnhanced(Launcher.java:290)
at org.codehaus.plexus.classworlds.launcher.Launcher.launch(Launcher.java:230)
at org.codehaus.plexus.classworlds.launcher.Launcher.mainWithExitCode(Launcher.java:409)
at org.codehaus.plexus.classworlds.launcher.Launcher.main(Launcher.java:352)
Caused by: org.apache.maven.plugin.MojoExecutionException: NPANDAY-900-006: Unable to Compile: Language = C_SHARP, Vendor = null, ArtifactType = library, Source Directory = C:\Workbench\NPanday\npanday-its-1.3-incubating\target\test-classes\NPanday11480\NPanday11480
at npanday.plugin.compile.AbstractCompilerMojo.execute(AbstractCompilerMojo.java:1132)
at npanday.plugin.compile.AbstractCompilerMojo.execute(AbstractCompilerMojo.java:714)
at org.apache.maven.plugin.DefaultBuildPluginManager.executeMojo(DefaultBuildPluginManager.java:107)
at org.apache.maven.lifecycle.internal.MojoExecutor.execute(MojoExecutor.java:209)
... 19 more
Caused by: npanday.executable.ExecutionException: NPANDAY-040-001: Could not execute: Command = cmd.exe /X /C &quot;csc @C:\Workbench\NPanday\npanday-its-1.3-incubating\target\test-classes\NPanday11480\NPanday11480\target\915400\responsefile.rsp&quot;, Result = 1
at npanday.executable.CommandExecutor$Factory$1.executeCommand(CommandExecutor.java:366)
at npanday.executable.compiler.impl.BaseCompiler.execute(BaseCompiler.java:129)
at npanday.plugin.compile.AbstractCompilerMojo.execute(AbstractCompilerMojo.java:1113)
... 22 more
[ERROR]
[ERROR] Re-run Maven using the -X switch to enable full debug logging.
[ERROR]
[ERROR] For more information about the errors and possible solutions, please read the following articles:
[ERROR] [Help 1] http://cwiki.apache.org/confluence/display/MAVEN/MojoExecutionException
[ERROR]
[ERROR] After correcting the problems, you can resume the build with the command
[ERROR] mvn &lt;goals&gt; -rf :NPanday11480
at org.apache.maven.it.Verifier.executeGoals(Verifier.java:1297)
at org.apache.maven.it.Verifier.executeGoal(Verifier.java:1145)
at org.apache.maven.it.Verifier.executeGoal(Verifier.java:1139)
at npanday.its.NPandayIT11480MVCProjectTest.testMVCProject(NPandayIT11480MVCProjectTest.java:48)
at sun.reflect.NativeMethodAccessorImpl.invoke0(Native Method)
at sun.reflect.NativeMethodAccessorImpl.invoke(NativeMethodAccessorImpl.java:39)
at sun.reflect.DelegatingMethodAccessorImpl.invoke(DelegatingMethodAccessorImpl.java:25)
at java.lang.reflect.Method.invoke(Method.java:597)
at junit.framework.TestCase.runTest(TestCase.java:164)
at npanday.its.AbstractNPandayIntegrationTestCase.runTest(AbstractNPandayIntegrationTestCase.java:218)
at junit.framework.TestCase.runBare(TestCase.java:130)
at junit.framework.TestResult$1.protect(TestResult.java:106)
at junit.framework.TestResult.runProtected(TestResult.java:124)
at junit.framework.TestResult.run(TestResult.java:109)
at junit.framework.TestCase.run(TestCase.java:120)
at junit.framework.TestSuite.runTest(TestSuite.java:230)
at junit.framework.TestSuite.run(TestSuite.java:225)
at junit.framework.TestSuite.runTest(TestSuite.java:230)
at junit.framework.TestSuite.run(TestSuite.java:225)
at sun.reflect.NativeMethodAccessorImpl.invoke0(Native Method)
at sun.reflect.NativeMethodAccessorImpl.invoke(NativeMethodAccessorImpl.java:39)
at sun.reflect.DelegatingMethodAccessorImpl.invoke(DelegatingMethodAccessorImpl.java:25)
at java.lang.reflect.Method.invoke(Method.java:597)
at org.apache.maven.surefire.junit.JUnitTestSet.execute(JUnitTestSet.java:207)
at org.apache.maven.surefire.junit.JUnit3Provider.executeTestSet(JUnit3Provider.java:107)
at org.apache.maven.surefire.junit.JUnit3Provider.invoke(JUnit3Provider.java:79)
at sun.reflect.NativeMethodAccessorImpl.invoke0(Native Method)
at sun.reflect.NativeMethodAccessorImpl.invoke(NativeMethodAccessorImpl.java:39)
at sun.reflect.DelegatingMethodAccessorImpl.invoke(DelegatingMethodAccessorImpl.java:25)
at java.lang.reflect.Method.invoke(Method.java:597)
at org.apache.maven.surefire.booter.ProviderFactory$ClassLoaderProxy.invoke(ProviderFactory.java:103)
at $Proxy0.invoke(Unknown Source)
at org.apache.maven.surefire.booter.SurefireStarter.invokeProvider(SurefireStarter.java:145)
at org.apache.maven.surefire.booter.SurefireStarter.runSuitesInProcess(SurefireStarter.java:87)
at org.apache.maven.surefire.booter.ForkedBooter.main(ForkedBooter.java:69)
Caused by: org.apache.maven.plugin.MojoExecutionException: NPANDAY-900-006: Unable to Compile: Language = C_SHARP, Vendor = null, ArtifactType = library, Source Directory = C:\Workbench\NPanday\npanday-its-1.3-incubating\target\test-classes\NPanday11480\NPanday11480
at npanday.plugin.compile.AbstractCompilerMojo.execute(AbstractCompilerMojo.java:1132)
at npanday.plugin.compile.AbstractCompilerMojo.execute(AbstractCompilerMojo.java:714)
at org.apache.maven.plugin.DefaultBuildPluginManager.executeMojo(DefaultBuildPluginManager.java:107)
at org.apache.maven.lifecycle.internal.MojoExecutor.execute(MojoExecutor.java:209)
... 19 more
Caused by: npanday.executable.ExecutionException: NPANDAY-040-001: Could not execute: Command = cmd.exe /X /C &quot;csc @C:\Workbench\NPanday\npanday-its-1.3-incubating\target\test-classes\NPanday11480\NPanday11480\target\915400\responsefile.rsp&quot;, Result = 1
at npanday.executable.CommandExecutor$Factory$1.executeCommand(CommandExecutor.java:366)
at npanday.executable.compiler.impl.BaseCompiler.execute(BaseCompiler.java:129)
at npanday.plugin.compile.AbstractCompilerMojo.execute(AbstractCompilerMojo.java:1113)
... 22 more
[ERROR]
[ERROR] Re-run Maven using the -X switch to enable full debug logging.
[ERROR]
[ERROR] For more information about the errors and possible solutions, please read the following articles:
[ERROR] [Help 1] http://cwiki.apache.org/confluence/display/MAVEN/MojoExecutionException
[ERROR]
[ERROR] After correcting the problems, you can resume the build with the command
[ERROR] mvn &lt;goals&gt; -rf :NPanday11480
at org.apache.maven.it.Verifier.executeGoals(Verifier.java:1297)
at org.apache.maven.it.Verifier.executeGoal(Verifier.java:1145)
at org.apache.maven.it.Verifier.executeGoal(Verifier.java:1139)
at npanday.its.NPandayIT11480MVCProjectTest.testMVCProject(NPandayIT11480MVCProjectTest.java:48)
at sun.reflect.NativeMethodAccessorImpl.invoke0(Native Method)
at sun.reflect.NativeMethodAccessorImpl.invoke(NativeMethodAccessorImpl.java:39)
at sun.reflect.DelegatingMethodAccessorImpl.invoke(DelegatingMethodAccessorImpl.java:25)
at java.lang.reflect.Method.invoke(Method.java:597)
at junit.framework.TestCase.runTest(TestCase.java:164)
at npanday.its.AbstractNPandayIntegrationTestCase.runTest(AbstractNPandayIntegrationTestCase.java:218)
at junit.framework.TestCase.runBare(TestCase.java:130)
at junit.framework.TestResult$1.protect(TestResult.java:106)
at junit.framework.TestResult.runProtected(TestResult.java:124)
at junit.framework.TestResult.run(TestResult.java:109)
at junit.framework.TestCase.run(TestCase.java:120)
at junit.framework.TestSuite.runTest(TestSuite.java:230)
at junit.framework.TestSuite.run(TestSuite.java:225)
at junit.framework.TestSuite.runTest(TestSuite.java:230)
at junit.framework.TestSuite.run(TestSuite.java:225)
at sun.reflect.NativeMethodAccessorImpl.invoke0(Native Method)
at sun.reflect.NativeMethodAccessorImpl.invoke(NativeMethodAccessorImpl.java:39)
at sun.reflect.DelegatingMethodAccessorImpl.invoke(DelegatingMethodAccessorImpl.java:25)
at java.lang.reflect.Method.invoke(Method.java:597)
at org.apache.maven.surefire.junit.JUnitTestSet.execute(JUnitTestSet.java:207)
at org.apache.maven.surefire.junit.JUnit3Provider.executeTestSet(JUnit3Provider.java:107)
at org.apache.maven.surefire.junit.JUnit3Provider.invoke(JUnit3Provider.java:79)
at sun.reflect.NativeMethodAccessorImpl.invoke0(Native Method)
at sun.reflect.NativeMethodAccessorImpl.invoke(NativeMethodAccessorImpl.java:39)
at sun.reflect.DelegatingMethodAccessorImpl.invoke(DelegatingMethodAccessorImpl.java:25)
at java.lang.reflect.Method.invoke(Method.java:597)
at org.apache.maven.surefire.booter.ProviderFactory$ClassLoaderProxy.invoke(ProviderFactory.java:103)
at $Proxy0.invoke(Unknown Source)
at org.apache.maven.surefire.booter.SurefireStarter.invokeProvider(SurefireStarter.java:145)
at org.apache.maven.surefire.booter.SurefireStarter.runSuitesInProcess(SurefireStarter.java:87)
at org.apache.maven.surefire.booter.ForkedBooter.main(ForkedBooter.java:69)
</error>
</testcase>
<testcase time="6.547" classname="npanday.its.NPandayIT12549WpfProjectTest" name="testWpfProject">
<error message="Exit code was non-zero: 1; command line and log =
&quot;C:\Program Files\Apache\apache-maven-3.0.2\bin\mvn&quot; -Dnpanday.version=1.3-incubating -e --batch-mode &quot;-Dmaven.repo.local=C:\Users\Lars Corneliussen\.m2\repository&quot; org.apache.maven.plugins:maven-clean-plugin:clean test
[INFO] Error stacktraces are turned on.
[INFO] Scanning for projects...
[INFO]
[INFO] ------------------------------------------------------------------------
[INFO] Building NPanday.ITs.NPandayIT12549 : NPandayIT12549 1.0-SNAPSHOT
[INFO] ------------------------------------------------------------------------
[WARNING] The POM for WindowsBase:WindowsBase:dll:31bf3856ad364e35:3.0.0.0 is missing, no dependency information available
[WARNING] The POM for PresentationCore:PresentationCore:dll:31bf3856ad364e35:3.0.0.0 is missing, no dependency information available
[WARNING] The POM for PresentationFramework:PresentationFramework:dll:31bf3856ad364e35:3.0.0.0 is missing, no dependency information available
[INFO] ------------------------------------------------------------------------
[INFO] BUILD FAILURE
[INFO] ------------------------------------------------------------------------
[INFO] Total time: 4.110s
[INFO] Finished at: Wed Feb 09 15:40:06 CET 2011
[INFO] Final Memory: 6M/129M
[INFO] ------------------------------------------------------------------------
[ERROR] Failed to execute goal on project NPandayIT12549: Could not resolve dependencies for project NPanday.ITs.NPandayIT12549:NPandayIT12549:winexe:1.0-SNAPSHOT: The following artifacts could not be resolved: WindowsBase:WindowsBase:dll:31bf3856ad364e35:3.0.0.0, PresentationCore:PresentationCore:dll:31bf3856ad364e35:3.0.0.0, PresentationFramework:PresentationFramework:dll:31bf3856ad364e35:3.0.0.0: Failure to find WindowsBase:WindowsBase:dll:31bf3856ad364e35:3.0.0.0 in http://repo1.maven.org/maven2 was cached in the local repository, resolution will not be reattempted until the update interval of central has elapsed or updates are forced -&gt; [Help 1]
org.apache.maven.lifecycle.LifecycleExecutionException: Failed to execute goal on project NPandayIT12549: Could not resolve dependencies for project NPanday.ITs.NPandayIT12549:NPandayIT12549:winexe:1.0-SNAPSHOT: The following artifacts could not be resolved: WindowsBase:WindowsBase:dll:31bf3856ad364e35:3.0.0.0, PresentationCore:PresentationCore:dll:31bf3856ad364e35:3.0.0.0, PresentationFramework:PresentationFramework:dll:31bf3856ad364e35:3.0.0.0: Failure to find WindowsBase:WindowsBase:dll:31bf3856ad364e35:3.0.0.0 in http://repo1.maven.org/maven2 was cached in the local repository, resolution will not be reattempted until the update interval of central has elapsed or updates are forced
at org.apache.maven.lifecycle.internal.LifecycleDependencyResolver.getDependencies(LifecycleDependencyResolver.java:190)
at org.apache.maven.lifecycle.internal.LifecycleDependencyResolver.resolveProjectDependencies(LifecycleDependencyResolver.java:104)
at org.apache.maven.lifecycle.internal.MojoExecutor.ensureDependenciesAreResolved(MojoExecutor.java:258)
at org.apache.maven.lifecycle.internal.MojoExecutor.execute(MojoExecutor.java:201)
at org.apache.maven.lifecycle.internal.MojoExecutor.execute(MojoExecutor.java:153)
at org.apache.maven.lifecycle.internal.MojoExecutor.execute(MojoExecutor.java:145)
at org.apache.maven.lifecycle.internal.LifecycleModuleBuilder.buildProject(LifecycleModuleBuilder.java:84)
at org.apache.maven.lifecycle.internal.LifecycleModuleBuilder.buildProject(LifecycleModuleBuilder.java:59)
at org.apache.maven.lifecycle.internal.LifecycleStarter.singleThreadedBuild(LifecycleStarter.java:183)
at org.apache.maven.lifecycle.internal.LifecycleStarter.execute(LifecycleStarter.java:161)
at org.apache.maven.DefaultMaven.doExecute(DefaultMaven.java:319)
at org.apache.maven.DefaultMaven.execute(DefaultMaven.java:156)
at org.apache.maven.cli.MavenCli.execute(MavenCli.java:534)
at org.apache.maven.cli.MavenCli.doMain(MavenCli.java:196)
at org.apache.maven.cli.MavenCli.main(MavenCli.java:141)
at sun.reflect.NativeMethodAccessorImpl.invoke0(Native Method)
at sun.reflect.NativeMethodAccessorImpl.invoke(NativeMethodAccessorImpl.java:39)
at sun.reflect.DelegatingMethodAccessorImpl.invoke(DelegatingMethodAccessorImpl.java:25)
at java.lang.reflect.Method.invoke(Method.java:597)
at org.codehaus.plexus.classworlds.launcher.Launcher.launchEnhanced(Launcher.java:290)
at org.codehaus.plexus.classworlds.launcher.Launcher.launch(Launcher.java:230)
at org.codehaus.plexus.classworlds.launcher.Launcher.mainWithExitCode(Launcher.java:409)
at org.codehaus.plexus.classworlds.launcher.Launcher.main(Launcher.java:352)
Caused by: org.apache.maven.project.DependencyResolutionException: Could not resolve dependencies for project NPanday.ITs.NPandayIT12549:NPandayIT12549:winexe:1.0-SNAPSHOT: The following artifacts could not be resolved: WindowsBase:WindowsBase:dll:31bf3856ad364e35:3.0.0.0, PresentationCore:PresentationCore:dll:31bf3856ad364e35:3.0.0.0, PresentationFramework:PresentationFramework:dll:31bf3856ad364e35:3.0.0.0: Failure to find WindowsBase:WindowsBase:dll:31bf3856ad364e35:3.0.0.0 in http://repo1.maven.org/maven2 was cached in the local repository, resolution will not be reattempted until the update interval of central has elapsed or updates are forced
at org.apache.maven.project.DefaultProjectDependenciesResolver.resolve(DefaultProjectDependenciesResolver.java:156)
at org.apache.maven.lifecycle.internal.LifecycleDependencyResolver.getDependencies(LifecycleDependencyResolver.java:165)
... 22 more
Caused by: org.sonatype.aether.resolution.ArtifactResolutionException: The following artifacts could not be resolved: WindowsBase:WindowsBase:dll:31bf3856ad364e35:3.0.0.0, PresentationCore:PresentationCore:dll:31bf3856ad364e35:3.0.0.0, PresentationFramework:PresentationFramework:dll:31bf3856ad364e35:3.0.0.0: Failure to find WindowsBase:WindowsBase:dll:31bf3856ad364e35:3.0.0.0 in http://repo1.maven.org/maven2 was cached in the local repository, resolution will not be reattempted until the update interval of central has elapsed or updates are forced
at org.sonatype.aether.impl.internal.DefaultArtifactResolver.resolveArtifacts(DefaultArtifactResolver.java:526)
at org.sonatype.aether.impl.internal.DefaultRepositorySystem.resolveArtifacts(DefaultRepositorySystem.java:304)
at org.sonatype.aether.impl.internal.DefaultRepositorySystem.resolveDependencies(DefaultRepositorySystem.java:334)
at org.apache.maven.project.DefaultProjectDependenciesResolver.resolve(DefaultProjectDependenciesResolver.java:150)
... 23 more
Caused by: org.sonatype.aether.transfer.ArtifactNotFoundException: Failure to find WindowsBase:WindowsBase:dll:31bf3856ad364e35:3.0.0.0 in http://repo1.maven.org/maven2 was cached in the local repository, resolution will not be reattempted until the update interval of central has elapsed or updates are forced
at org.sonatype.aether.impl.internal.DefaultUpdateCheckManager.checkArtifact(DefaultUpdateCheckManager.java:186)
at org.sonatype.aether.impl.internal.DefaultArtifactResolver.resolveArtifacts(DefaultArtifactResolver.java:408)
... 26 more
[ERROR]
[ERROR] Re-run Maven using the -X switch to enable full debug logging.
[ERROR]
[ERROR] For more information about the errors and possible solutions, please read the following articles:
[ERROR] [Help 1] http://cwiki.apache.org/confluence/display/MAVEN/DependencyResolutionException
" type="org.apache.maven.it.VerificationException">org.apache.maven.it.VerificationException: Exit code was non-zero: 1; command line and log =
&quot;C:\Program Files\Apache\apache-maven-3.0.2\bin\mvn&quot; -Dnpanday.version=1.3-incubating -e --batch-mode &quot;-Dmaven.repo.local=C:\Users\Lars Corneliussen\.m2\repository&quot; org.apache.maven.plugins:maven-clean-plugin:clean test
[INFO] Error stacktraces are turned on.
[INFO] Scanning for projects...
[INFO]
[INFO] ------------------------------------------------------------------------
[INFO] Building NPanday.ITs.NPandayIT12549 : NPandayIT12549 1.0-SNAPSHOT
[INFO] ------------------------------------------------------------------------
[WARNING] The POM for WindowsBase:WindowsBase:dll:31bf3856ad364e35:3.0.0.0 is missing, no dependency information available
[WARNING] The POM for PresentationCore:PresentationCore:dll:31bf3856ad364e35:3.0.0.0 is missing, no dependency information available
[WARNING] The POM for PresentationFramework:PresentationFramework:dll:31bf3856ad364e35:3.0.0.0 is missing, no dependency information available
[INFO] ------------------------------------------------------------------------
[INFO] BUILD FAILURE
[INFO] ------------------------------------------------------------------------
[INFO] Total time: 4.110s
[INFO] Finished at: Wed Feb 09 15:40:06 CET 2011
[INFO] Final Memory: 6M/129M
[INFO] ------------------------------------------------------------------------
[ERROR] Failed to execute goal on project NPandayIT12549: Could not resolve dependencies for project NPanday.ITs.NPandayIT12549:NPandayIT12549:winexe:1.0-SNAPSHOT: The following artifacts could not be resolved: WindowsBase:WindowsBase:dll:31bf3856ad364e35:3.0.0.0, PresentationCore:PresentationCore:dll:31bf3856ad364e35:3.0.0.0, PresentationFramework:PresentationFramework:dll:31bf3856ad364e35:3.0.0.0: Failure to find WindowsBase:WindowsBase:dll:31bf3856ad364e35:3.0.0.0 in http://repo1.maven.org/maven2 was cached in the local repository, resolution will not be reattempted until the update interval of central has elapsed or updates are forced -&gt; [Help 1]
org.apache.maven.lifecycle.LifecycleExecutionException: Failed to execute goal on project NPandayIT12549: Could not resolve dependencies for project NPanday.ITs.NPandayIT12549:NPandayIT12549:winexe:1.0-SNAPSHOT: The following artifacts could not be resolved: WindowsBase:WindowsBase:dll:31bf3856ad364e35:3.0.0.0, PresentationCore:PresentationCore:dll:31bf3856ad364e35:3.0.0.0, PresentationFramework:PresentationFramework:dll:31bf3856ad364e35:3.0.0.0: Failure to find WindowsBase:WindowsBase:dll:31bf3856ad364e35:3.0.0.0 in http://repo1.maven.org/maven2 was cached in the local repository, resolution will not be reattempted until the update interval of central has elapsed or updates are forced
at org.apache.maven.lifecycle.internal.LifecycleDependencyResolver.getDependencies(LifecycleDependencyResolver.java:190)
at org.apache.maven.lifecycle.internal.LifecycleDependencyResolver.resolveProjectDependencies(LifecycleDependencyResolver.java:104)
at org.apache.maven.lifecycle.internal.MojoExecutor.ensureDependenciesAreResolved(MojoExecutor.java:258)
at org.apache.maven.lifecycle.internal.MojoExecutor.execute(MojoExecutor.java:201)
at org.apache.maven.lifecycle.internal.MojoExecutor.execute(MojoExecutor.java:153)
at org.apache.maven.lifecycle.internal.MojoExecutor.execute(MojoExecutor.java:145)
at org.apache.maven.lifecycle.internal.LifecycleModuleBuilder.buildProject(LifecycleModuleBuilder.java:84)
at org.apache.maven.lifecycle.internal.LifecycleModuleBuilder.buildProject(LifecycleModuleBuilder.java:59)
at org.apache.maven.lifecycle.internal.LifecycleStarter.singleThreadedBuild(LifecycleStarter.java:183)
at org.apache.maven.lifecycle.internal.LifecycleStarter.execute(LifecycleStarter.java:161)
at org.apache.maven.DefaultMaven.doExecute(DefaultMaven.java:319)
at org.apache.maven.DefaultMaven.execute(DefaultMaven.java:156)
at org.apache.maven.cli.MavenCli.execute(MavenCli.java:534)
at org.apache.maven.cli.MavenCli.doMain(MavenCli.java:196)
at org.apache.maven.cli.MavenCli.main(MavenCli.java:141)
at sun.reflect.NativeMethodAccessorImpl.invoke0(Native Method)
at sun.reflect.NativeMethodAccessorImpl.invoke(NativeMethodAccessorImpl.java:39)
at sun.reflect.DelegatingMethodAccessorImpl.invoke(DelegatingMethodAccessorImpl.java:25)
at java.lang.reflect.Method.invoke(Method.java:597)
at org.codehaus.plexus.classworlds.launcher.Launcher.launchEnhanced(Launcher.java:290)
at org.codehaus.plexus.classworlds.launcher.Launcher.launch(Launcher.java:230)
at org.codehaus.plexus.classworlds.launcher.Launcher.mainWithExitCode(Launcher.java:409)
at org.codehaus.plexus.classworlds.launcher.Launcher.main(Launcher.java:352)
Caused by: org.apache.maven.project.DependencyResolutionException: Could not resolve dependencies for project NPanday.ITs.NPandayIT12549:NPandayIT12549:winexe:1.0-SNAPSHOT: The following artifacts could not be resolved: WindowsBase:WindowsBase:dll:31bf3856ad364e35:3.0.0.0, PresentationCore:PresentationCore:dll:31bf3856ad364e35:3.0.0.0, PresentationFramework:PresentationFramework:dll:31bf3856ad364e35:3.0.0.0: Failure to find WindowsBase:WindowsBase:dll:31bf3856ad364e35:3.0.0.0 in http://repo1.maven.org/maven2 was cached in the local repository, resolution will not be reattempted until the update interval of central has elapsed or updates are forced
at org.apache.maven.project.DefaultProjectDependenciesResolver.resolve(DefaultProjectDependenciesResolver.java:156)
at org.apache.maven.lifecycle.internal.LifecycleDependencyResolver.getDependencies(LifecycleDependencyResolver.java:165)
... 22 more
Caused by: org.sonatype.aether.resolution.ArtifactResolutionException: The following artifacts could not be resolved: WindowsBase:WindowsBase:dll:31bf3856ad364e35:3.0.0.0, PresentationCore:PresentationCore:dll:31bf3856ad364e35:3.0.0.0, PresentationFramework:PresentationFramework:dll:31bf3856ad364e35:3.0.0.0: Failure to find WindowsBase:WindowsBase:dll:31bf3856ad364e35:3.0.0.0 in http://repo1.maven.org/maven2 was cached in the local repository, resolution will not be reattempted until the update interval of central has elapsed or updates are forced
at org.sonatype.aether.impl.internal.DefaultArtifactResolver.resolveArtifacts(DefaultArtifactResolver.java:526)
at org.sonatype.aether.impl.internal.DefaultRepositorySystem.resolveArtifacts(DefaultRepositorySystem.java:304)
at org.sonatype.aether.impl.internal.DefaultRepositorySystem.resolveDependencies(DefaultRepositorySystem.java:334)
at org.apache.maven.project.DefaultProjectDependenciesResolver.resolve(DefaultProjectDependenciesResolver.java:150)
... 23 more
Caused by: org.sonatype.aether.transfer.ArtifactNotFoundException: Failure to find WindowsBase:WindowsBase:dll:31bf3856ad364e35:3.0.0.0 in http://repo1.maven.org/maven2 was cached in the local repository, resolution will not be reattempted until the update interval of central has elapsed or updates are forced
at org.sonatype.aether.impl.internal.DefaultUpdateCheckManager.checkArtifact(DefaultUpdateCheckManager.java:186)
at org.sonatype.aether.impl.internal.DefaultArtifactResolver.resolveArtifacts(DefaultArtifactResolver.java:408)
... 26 more
[ERROR]
[ERROR] Re-run Maven using the -X switch to enable full debug logging.
[ERROR]
[ERROR] For more information about the errors and possible solutions, please read the following articles:
[ERROR] [Help 1] http://cwiki.apache.org/confluence/display/MAVEN/DependencyResolutionException
at org.apache.maven.it.Verifier.executeGoals(Verifier.java:1297)
at org.apache.maven.it.Verifier.executeGoal(Verifier.java:1145)
at org.apache.maven.it.Verifier.executeGoal(Verifier.java:1139)
at npanday.its.NPandayIT12549WpfProjectTest.testWpfProject(NPandayIT12549WpfProjectTest.java:41)
at sun.reflect.NativeMethodAccessorImpl.invoke0(Native Method)
at sun.reflect.NativeMethodAccessorImpl.invoke(NativeMethodAccessorImpl.java:39)
at sun.reflect.DelegatingMethodAccessorImpl.invoke(DelegatingMethodAccessorImpl.java:25)
at java.lang.reflect.Method.invoke(Method.java:597)
at junit.framework.TestCase.runTest(TestCase.java:164)
at npanday.its.AbstractNPandayIntegrationTestCase.runTest(AbstractNPandayIntegrationTestCase.java:218)
at junit.framework.TestCase.runBare(TestCase.java:130)
at junit.framework.TestResult$1.protect(TestResult.java:106)
at junit.framework.TestResult.runProtected(TestResult.java:124)
at junit.framework.TestResult.run(TestResult.java:109)
at junit.framework.TestCase.run(TestCase.java:120)
at junit.framework.TestSuite.runTest(TestSuite.java:230)
at junit.framework.TestSuite.run(TestSuite.java:225)
at junit.framework.TestSuite.runTest(TestSuite.java:230)
at junit.framework.TestSuite.run(TestSuite.java:225)
at sun.reflect.NativeMethodAccessorImpl.invoke0(Native Method)
at sun.reflect.NativeMethodAccessorImpl.invoke(NativeMethodAccessorImpl.java:39)
at sun.reflect.DelegatingMethodAccessorImpl.invoke(DelegatingMethodAccessorImpl.java:25)
at java.lang.reflect.Method.invoke(Method.java:597)
at org.apache.maven.surefire.junit.JUnitTestSet.execute(JUnitTestSet.java:207)
at org.apache.maven.surefire.junit.JUnit3Provider.executeTestSet(JUnit3Provider.java:107)
at org.apache.maven.surefire.junit.JUnit3Provider.invoke(JUnit3Provider.java:79)
at sun.reflect.NativeMethodAccessorImpl.invoke0(Native Method)
at sun.reflect.NativeMethodAccessorImpl.invoke(NativeMethodAccessorImpl.java:39)
at sun.reflect.DelegatingMethodAccessorImpl.invoke(DelegatingMethodAccessorImpl.java:25)
at java.lang.reflect.Method.invoke(Method.java:597)
at org.apache.maven.surefire.booter.ProviderFactory$ClassLoaderProxy.invoke(ProviderFactory.java:103)
at $Proxy0.invoke(Unknown Source)
at org.apache.maven.surefire.booter.SurefireStarter.invokeProvider(SurefireStarter.java:145)
at org.apache.maven.surefire.booter.SurefireStarter.runSuitesInProcess(SurefireStarter.java:87)
at org.apache.maven.surefire.booter.ForkedBooter.main(ForkedBooter.java:69)
Caused by: org.apache.maven.project.DependencyResolutionException: Could not resolve dependencies for project NPanday.ITs.NPandayIT12549:NPandayIT12549:winexe:1.0-SNAPSHOT: The following artifacts could not be resolved: WindowsBase:WindowsBase:dll:31bf3856ad364e35:3.0.0.0, PresentationCore:PresentationCore:dll:31bf3856ad364e35:3.0.0.0, PresentationFramework:PresentationFramework:dll:31bf3856ad364e35:3.0.0.0: Failure to find WindowsBase:WindowsBase:dll:31bf3856ad364e35:3.0.0.0 in http://repo1.maven.org/maven2 was cached in the local repository, resolution will not be reattempted until the update interval of central has elapsed or updates are forced
at org.apache.maven.project.DefaultProjectDependenciesResolver.resolve(DefaultProjectDependenciesResolver.java:156)
at org.apache.maven.lifecycle.internal.LifecycleDependencyResolver.getDependencies(LifecycleDependencyResolver.java:165)
... 22 more
Caused by: org.sonatype.aether.resolution.ArtifactResolutionException: The following artifacts could not be resolved: WindowsBase:WindowsBase:dll:31bf3856ad364e35:3.0.0.0, PresentationCore:PresentationCore:dll:31bf3856ad364e35:3.0.0.0, PresentationFramework:PresentationFramework:dll:31bf3856ad364e35:3.0.0.0: Failure to find WindowsBase:WindowsBase:dll:31bf3856ad364e35:3.0.0.0 in http://repo1.maven.org/maven2 was cached in the local repository, resolution will not be reattempted until the update interval of central has elapsed or updates are forced
at org.sonatype.aether.impl.internal.DefaultArtifactResolver.resolveArtifacts(DefaultArtifactResolver.java:526)
at org.sonatype.aether.impl.internal.DefaultRepositorySystem.resolveArtifacts(DefaultRepositorySystem.java:304)
at org.sonatype.aether.impl.internal.DefaultRepositorySystem.resolveDependencies(DefaultRepositorySystem.java:334)
at org.apache.maven.project.DefaultProjectDependenciesResolver.resolve(DefaultProjectDependenciesResolver.java:150)
... 23 more
Caused by: org.sonatype.aether.transfer.ArtifactNotFoundException: Failure to find WindowsBase:WindowsBase:dll:31bf3856ad364e35:3.0.0.0 in http://repo1.maven.org/maven2 was cached in the local repository, resolution will not be reattempted until the update interval of central has elapsed or updates are forced
at org.sonatype.aether.impl.internal.DefaultUpdateCheckManager.checkArtifact(DefaultUpdateCheckManager.java:186)
at org.sonatype.aether.impl.internal.DefaultArtifactResolver.resolveArtifacts(DefaultArtifactResolver.java:408)
... 26 more
[ERROR]
[ERROR] Re-run Maven using the -X switch to enable full debug logging.
[ERROR]
[ERROR] For more information about the errors and possible solutions, please read the following articles:
[ERROR] [Help 1] http://cwiki.apache.org/confluence/display/MAVEN/DependencyResolutionException
at org.apache.maven.it.Verifier.executeGoals(Verifier.java:1297)
at org.apache.maven.it.Verifier.executeGoal(Verifier.java:1145)
at org.apache.maven.it.Verifier.executeGoal(Verifier.java:1139)
at npanday.its.NPandayIT12549WpfProjectTest.testWpfProject(NPandayIT12549WpfProjectTest.java:41)
at sun.reflect.NativeMethodAccessorImpl.invoke0(Native Method)
at sun.reflect.NativeMethodAccessorImpl.invoke(NativeMethodAccessorImpl.java:39)
at sun.reflect.DelegatingMethodAccessorImpl.invoke(DelegatingMethodAccessorImpl.java:25)
at java.lang.reflect.Method.invoke(Method.java:597)
at junit.framework.TestCase.runTest(TestCase.java:164)
at npanday.its.AbstractNPandayIntegrationTestCase.runTest(AbstractNPandayIntegrationTestCase.java:218)
at junit.framework.TestCase.runBare(TestCase.java:130)
at junit.framework.TestResult$1.protect(TestResult.java:106)
at junit.framework.TestResult.runProtected(TestResult.java:124)
at junit.framework.TestResult.run(TestResult.java:109)
at junit.framework.TestCase.run(TestCase.java:120)
at junit.framework.TestSuite.runTest(TestSuite.java:230)
at junit.framework.TestSuite.run(TestSuite.java:225)
at junit.framework.TestSuite.runTest(TestSuite.java:230)
at junit.framework.TestSuite.run(TestSuite.java:225)
at sun.reflect.NativeMethodAccessorImpl.invoke0(Native Method)
at sun.reflect.NativeMethodAccessorImpl.invoke(NativeMethodAccessorImpl.java:39)
at sun.reflect.DelegatingMethodAccessorImpl.invoke(DelegatingMethodAccessorImpl.java:25)
at java.lang.reflect.Method.invoke(Method.java:597)
at org.apache.maven.surefire.junit.JUnitTestSet.execute(JUnitTestSet.java:207)
at org.apache.maven.surefire.junit.JUnit3Provider.executeTestSet(JUnit3Provider.java:107)
at org.apache.maven.surefire.junit.JUnit3Provider.invoke(JUnit3Provider.java:79)
at sun.reflect.NativeMethodAccessorImpl.invoke0(Native Method)
at sun.reflect.NativeMethodAccessorImpl.invoke(NativeMethodAccessorImpl.java:39)
at sun.reflect.DelegatingMethodAccessorImpl.invoke(DelegatingMethodAccessorImpl.java:25)
at java.lang.reflect.Method.invoke(Method.java:597)
at org.apache.maven.surefire.booter.ProviderFactory$ClassLoaderProxy.invoke(ProviderFactory.java:103)
at $Proxy0.invoke(Unknown Source)
at org.apache.maven.surefire.booter.SurefireStarter.invokeProvider(SurefireStarter.java:145)
at org.apache.maven.surefire.booter.SurefireStarter.runSuitesInProcess(SurefireStarter.java:87)
at org.apache.maven.surefire.booter.ForkedBooter.main(ForkedBooter.java:69)
</error>
</testcase>
<testcase time="11.125" classname="npanday.its.NPandayIT11579MissingGroupOrVersionTest" name="testMissingGroupIdAndVersionShouldBeInherited"/>
<testcase time="4.422" classname="npanday.its.NPandayIT11695MsBuildCopyReferencesTest" name="testMsBuildCopyReferences">
<error message="Exit code was non-zero: 1; command line and log =
&quot;C:\Program Files\Apache\apache-maven-3.0.2\bin\mvn&quot; -Dnpanday.version=1.3-incubating -e --batch-mode &quot;-Dmaven.repo.local=C:\Users\Lars Corneliussen\.m2\repository&quot; org.apache.maven.plugins:maven-clean-plugin:clean compile
[INFO] Error stacktraces are turned on.
[INFO] Scanning for projects...
[INFO]
[INFO] ------------------------------------------------------------------------
[INFO] Building NPandayIT11695 1.0-SNAPSHOT
[INFO] ------------------------------------------------------------------------
Downloading: file:C:\Workbench\NPanday\npanday-its-1.3-incubating\target\test-classes\NPandayIT11695/test-repo/test/test-snapshot/1.0-SNAPSHOT/maven-metadata.xml
[WARNING] Checksum validation failed, expected e3dd190621ba98e38e4accb701b3f8299ef82296 but is 3ad267ea34fdbeb795294d832b8d43eddda409f3 for file:C:\Workbench\NPanday\npanday-its-1.3-incubating\target\test-classes\NPandayIT11695/test-repo/test/test-snapshot/1.0-SNAPSHOT/maven-metadata.xml
[WARNING] Checksum validation failed, expected e3dd190621ba98e38e4accb701b3f8299ef82296 but is 3ad267ea34fdbeb795294d832b8d43eddda409f3 for file:C:\Workbench\NPanday\npanday-its-1.3-incubating\target\test-classes\NPandayIT11695/test-repo/test/test-snapshot/1.0-SNAPSHOT/maven-metadata.xml
Downloaded: file:C:\Workbench\NPanday\npanday-its-1.3-incubating\target\test-classes\NPandayIT11695/test-repo/test/test-snapshot/1.0-SNAPSHOT/maven-metadata.xml (2 KB at 35.2 KB/sec)
Downloading: file:C:\Workbench\NPanday\npanday-its-1.3-incubating\target\test-classes\NPandayIT11695/test-repo/test/test-snapshot/1.0-SNAPSHOT/test-snapshot-1.0-20100121.135725-1.pom
[WARNING] Checksum validation failed, expected e8ed60e76392a59c97f3769ec685560080c2f9b1 but is a9846a76c323cb89014e99ab5b74f0e54867e511 for file:C:\Workbench\NPanday\npanday-its-1.3-incubating\target\test-classes\NPandayIT11695/test-repo/test/test-snapshot/1.0-SNAPSHOT/test-snapshot-1.0-20100121.135725-1.pom
[WARNING] Checksum validation failed, expected e8ed60e76392a59c97f3769ec685560080c2f9b1 but is a9846a76c323cb89014e99ab5b74f0e54867e511 for file:C:\Workbench\NPanday\npanday-its-1.3-incubating\target\test-classes\NPandayIT11695/test-repo/test/test-snapshot/1.0-SNAPSHOT/test-snapshot-1.0-20100121.135725-1.pom
Downloaded: file:C:\Workbench\NPanday\npanday-its-1.3-incubating\target\test-classes\NPandayIT11695/test-repo/test/test-snapshot/1.0-SNAPSHOT/test-snapshot-1.0-20100121.135725-1.pom (2 KB)
Downloading: file:C:\Workbench\NPanday\npanday-its-1.3-incubating\target\test-classes\NPandayIT11695/test-repo/NUnit/NUnit.Framework/2.2.8.0/NUnit.Framework-2.2.8.0.pom
Downloading: http://repo1.maven.org/maven2/NUnit/NUnit.Framework/2.2.8.0/NUnit.Framework-2.2.8.0.pom
[WARNING] The POM for NUnit:NUnit.Framework:dll:2.2.8.0 is missing, no dependency information available
Downloading: file:C:\Workbench\NPanday\npanday-its-1.3-incubating\target\test-classes\NPandayIT11695/test-repo/test/test-snapshot/1.0-SNAPSHOT/test-snapshot-1.0-20100121.135725-1.dll
Downloading: file:C:\Workbench\NPanday\npanday-its-1.3-incubating\target\test-classes\NPandayIT11695/test-repo/NUnit/NUnit.Framework/2.2.8.0/NUnit.Framework-2.2.8.0.dll
Downloaded: file:C:\Workbench\NPanday\npanday-its-1.3-incubating\target\test-classes\NPandayIT11695/test-repo/test/test-snapshot/1.0-SNAPSHOT/test-snapshot-1.0-20100121.135725-1.dll (4 KB)
Downloading: http://repo1.maven.org/maven2/NUnit/NUnit.Framework/2.2.8.0/NUnit.Framework-2.2.8.0.dll
[INFO] ------------------------------------------------------------------------
[INFO] BUILD FAILURE
[INFO] ------------------------------------------------------------------------
[INFO] Total time: 2.812s
[INFO] Finished at: Wed Feb 09 15:40:22 CET 2011
[INFO] Final Memory: 4M/80M
[INFO] ------------------------------------------------------------------------
[ERROR] Failed to execute goal on project NPandayIT11695: Could not resolve dependencies for project NPanday.IT11695:NPandayIT11695:pom:1.0-SNAPSHOT: Could not find artifact NUnit:NUnit.Framework:dll:2.2.8.0 in test (file:C:\Workbench\NPanday\npanday-its-1.3-incubating\target\test-classes\NPandayIT11695/test-repo) -&gt; [Help 1]
org.apache.maven.lifecycle.LifecycleExecutionException: Failed to execute goal on project NPandayIT11695: Could not resolve dependencies for project NPanday.IT11695:NPandayIT11695:pom:1.0-SNAPSHOT: Could not find artifact NUnit:NUnit.Framework:dll:2.2.8.0 in test (file:C:\Workbench\NPanday\npanday-its-1.3-incubating\target\test-classes\NPandayIT11695/test-repo)
at org.apache.maven.lifecycle.internal.LifecycleDependencyResolver.getDependencies(LifecycleDependencyResolver.java:190)
at org.apache.maven.lifecycle.internal.LifecycleDependencyResolver.resolveProjectDependencies(LifecycleDependencyResolver.java:104)
at org.apache.maven.lifecycle.internal.MojoExecutor.ensureDependenciesAreResolved(MojoExecutor.java:258)
at org.apache.maven.lifecycle.internal.MojoExecutor.execute(MojoExecutor.java:201)
at org.apache.maven.lifecycle.internal.MojoExecutor.execute(MojoExecutor.java:153)
at org.apache.maven.lifecycle.internal.MojoExecutor.execute(MojoExecutor.java:145)
at org.apache.maven.lifecycle.internal.LifecycleModuleBuilder.buildProject(LifecycleModuleBuilder.java:84)
at org.apache.maven.lifecycle.internal.LifecycleModuleBuilder.buildProject(LifecycleModuleBuilder.java:59)
at org.apache.maven.lifecycle.internal.LifecycleStarter.singleThreadedBuild(LifecycleStarter.java:183)
at org.apache.maven.lifecycle.internal.LifecycleStarter.execute(LifecycleStarter.java:161)
at org.apache.maven.DefaultMaven.doExecute(DefaultMaven.java:319)
at org.apache.maven.DefaultMaven.execute(DefaultMaven.java:156)
at org.apache.maven.cli.MavenCli.execute(MavenCli.java:534)
at org.apache.maven.cli.MavenCli.doMain(MavenCli.java:196)
at org.apache.maven.cli.MavenCli.main(MavenCli.java:141)
at sun.reflect.NativeMethodAccessorImpl.invoke0(Native Method)
at sun.reflect.NativeMethodAccessorImpl.invoke(NativeMethodAccessorImpl.java:39)
at sun.reflect.DelegatingMethodAccessorImpl.invoke(DelegatingMethodAccessorImpl.java:25)
at java.lang.reflect.Method.invoke(Method.java:597)
at org.codehaus.plexus.classworlds.launcher.Launcher.launchEnhanced(Launcher.java:290)
at org.codehaus.plexus.classworlds.launcher.Launcher.launch(Launcher.java:230)
at org.codehaus.plexus.classworlds.launcher.Launcher.mainWithExitCode(Launcher.java:409)
at org.codehaus.plexus.classworlds.launcher.Launcher.main(Launcher.java:352)
Caused by: org.apache.maven.project.DependencyResolutionException: Could not resolve dependencies for project NPanday.IT11695:NPandayIT11695:pom:1.0-SNAPSHOT: Could not find artifact NUnit:NUnit.Framework:dll:2.2.8.0 in test (file:C:\Workbench\NPanday\npanday-its-1.3-incubating\target\test-classes\NPandayIT11695/test-repo)
at org.apache.maven.project.DefaultProjectDependenciesResolver.resolve(DefaultProjectDependenciesResolver.java:156)
at org.apache.maven.lifecycle.internal.LifecycleDependencyResolver.getDependencies(LifecycleDependencyResolver.java:165)
... 22 more
Caused by: org.sonatype.aether.resolution.ArtifactResolutionException: Could not find artifact NUnit:NUnit.Framework:dll:2.2.8.0 in test (file:C:\Workbench\NPanday\npanday-its-1.3-incubating\target\test-classes\NPandayIT11695/test-repo)
at org.sonatype.aether.impl.internal.DefaultArtifactResolver.resolveArtifacts(DefaultArtifactResolver.java:526)
at org.sonatype.aether.impl.internal.DefaultRepositorySystem.resolveArtifacts(DefaultRepositorySystem.java:304)
at org.sonatype.aether.impl.internal.DefaultRepositorySystem.resolveDependencies(DefaultRepositorySystem.java:334)
at org.apache.maven.project.DefaultProjectDependenciesResolver.resolve(DefaultProjectDependenciesResolver.java:150)
... 23 more
Caused by: org.sonatype.aether.transfer.ArtifactNotFoundException: Could not find artifact NUnit:NUnit.Framework:dll:2.2.8.0 in test (file:C:\Workbench\NPanday\npanday-its-1.3-incubating\target\test-classes\NPandayIT11695/test-repo)
at org.sonatype.aether.connector.wagon.WagonRepositoryConnector$4.wrap(WagonRepositoryConnector.java:945)
at org.sonatype.aether.connector.wagon.WagonRepositoryConnector$4.wrap(WagonRepositoryConnector.java:940)
at org.sonatype.aether.connector.wagon.WagonRepositoryConnector$GetTask.flush(WagonRepositoryConnector.java:696)
at org.sonatype.aether.connector.wagon.WagonRepositoryConnector$GetTask.flush(WagonRepositoryConnector.java:690)
at org.sonatype.aether.connector.wagon.WagonRepositoryConnector.get(WagonRepositoryConnector.java:435)
at org.sonatype.aether.impl.internal.DefaultArtifactResolver.resolveArtifacts(DefaultArtifactResolver.java:438)
... 26 more
[ERROR]
[ERROR] Re-run Maven using the -X switch to enable full debug logging.
[ERROR]
[ERROR] For more information about the errors and possible solutions, please read the following articles:
[ERROR] [Help 1] http://cwiki.apache.org/confluence/display/MAVEN/DependencyResolutionException
" type="org.apache.maven.it.VerificationException">org.apache.maven.it.VerificationException: Exit code was non-zero: 1; command line and log =
&quot;C:\Program Files\Apache\apache-maven-3.0.2\bin\mvn&quot; -Dnpanday.version=1.3-incubating -e --batch-mode &quot;-Dmaven.repo.local=C:\Users\Lars Corneliussen\.m2\repository&quot; org.apache.maven.plugins:maven-clean-plugin:clean compile
[INFO] Error stacktraces are turned on.
[INFO] Scanning for projects...
[INFO]
[INFO] ------------------------------------------------------------------------
[INFO] Building NPandayIT11695 1.0-SNAPSHOT
[INFO] ------------------------------------------------------------------------
Downloading: file:C:\Workbench\NPanday\npanday-its-1.3-incubating\target\test-classes\NPandayIT11695/test-repo/test/test-snapshot/1.0-SNAPSHOT/maven-metadata.xml
[WARNING] Checksum validation failed, expected e3dd190621ba98e38e4accb701b3f8299ef82296 but is 3ad267ea34fdbeb795294d832b8d43eddda409f3 for file:C:\Workbench\NPanday\npanday-its-1.3-incubating\target\test-classes\NPandayIT11695/test-repo/test/test-snapshot/1.0-SNAPSHOT/maven-metadata.xml
[WARNING] Checksum validation failed, expected e3dd190621ba98e38e4accb701b3f8299ef82296 but is 3ad267ea34fdbeb795294d832b8d43eddda409f3 for file:C:\Workbench\NPanday\npanday-its-1.3-incubating\target\test-classes\NPandayIT11695/test-repo/test/test-snapshot/1.0-SNAPSHOT/maven-metadata.xml
Downloaded: file:C:\Workbench\NPanday\npanday-its-1.3-incubating\target\test-classes\NPandayIT11695/test-repo/test/test-snapshot/1.0-SNAPSHOT/maven-metadata.xml (2 KB at 35.2 KB/sec)
Downloading: file:C:\Workbench\NPanday\npanday-its-1.3-incubating\target\test-classes\NPandayIT11695/test-repo/test/test-snapshot/1.0-SNAPSHOT/test-snapshot-1.0-20100121.135725-1.pom
[WARNING] Checksum validation failed, expected e8ed60e76392a59c97f3769ec685560080c2f9b1 but is a9846a76c323cb89014e99ab5b74f0e54867e511 for file:C:\Workbench\NPanday\npanday-its-1.3-incubating\target\test-classes\NPandayIT11695/test-repo/test/test-snapshot/1.0-SNAPSHOT/test-snapshot-1.0-20100121.135725-1.pom
[WARNING] Checksum validation failed, expected e8ed60e76392a59c97f3769ec685560080c2f9b1 but is a9846a76c323cb89014e99ab5b74f0e54867e511 for file:C:\Workbench\NPanday\npanday-its-1.3-incubating\target\test-classes\NPandayIT11695/test-repo/test/test-snapshot/1.0-SNAPSHOT/test-snapshot-1.0-20100121.135725-1.pom
Downloaded: file:C:\Workbench\NPanday\npanday-its-1.3-incubating\target\test-classes\NPandayIT11695/test-repo/test/test-snapshot/1.0-SNAPSHOT/test-snapshot-1.0-20100121.135725-1.pom (2 KB)
Downloading: file:C:\Workbench\NPanday\npanday-its-1.3-incubating\target\test-classes\NPandayIT11695/test-repo/NUnit/NUnit.Framework/2.2.8.0/NUnit.Framework-2.2.8.0.pom
Downloading: http://repo1.maven.org/maven2/NUnit/NUnit.Framework/2.2.8.0/NUnit.Framework-2.2.8.0.pom
[WARNING] The POM for NUnit:NUnit.Framework:dll:2.2.8.0 is missing, no dependency information available
Downloading: file:C:\Workbench\NPanday\npanday-its-1.3-incubating\target\test-classes\NPandayIT11695/test-repo/test/test-snapshot/1.0-SNAPSHOT/test-snapshot-1.0-20100121.135725-1.dll
Downloading: file:C:\Workbench\NPanday\npanday-its-1.3-incubating\target\test-classes\NPandayIT11695/test-repo/NUnit/NUnit.Framework/2.2.8.0/NUnit.Framework-2.2.8.0.dll
Downloaded: file:C:\Workbench\NPanday\npanday-its-1.3-incubating\target\test-classes\NPandayIT11695/test-repo/test/test-snapshot/1.0-SNAPSHOT/test-snapshot-1.0-20100121.135725-1.dll (4 KB)
Downloading: http://repo1.maven.org/maven2/NUnit/NUnit.Framework/2.2.8.0/NUnit.Framework-2.2.8.0.dll
[INFO] ------------------------------------------------------------------------
[INFO] BUILD FAILURE
[INFO] ------------------------------------------------------------------------
[INFO] Total time: 2.812s
[INFO] Finished at: Wed Feb 09 15:40:22 CET 2011
[INFO] Final Memory: 4M/80M
[INFO] ------------------------------------------------------------------------
[ERROR] Failed to execute goal on project NPandayIT11695: Could not resolve dependencies for project NPanday.IT11695:NPandayIT11695:pom:1.0-SNAPSHOT: Could not find artifact NUnit:NUnit.Framework:dll:2.2.8.0 in test (file:C:\Workbench\NPanday\npanday-its-1.3-incubating\target\test-classes\NPandayIT11695/test-repo) -&gt; [Help 1]
org.apache.maven.lifecycle.LifecycleExecutionException: Failed to execute goal on project NPandayIT11695: Could not resolve dependencies for project NPanday.IT11695:NPandayIT11695:pom:1.0-SNAPSHOT: Could not find artifact NUnit:NUnit.Framework:dll:2.2.8.0 in test (file:C:\Workbench\NPanday\npanday-its-1.3-incubating\target\test-classes\NPandayIT11695/test-repo)
at org.apache.maven.lifecycle.internal.LifecycleDependencyResolver.getDependencies(LifecycleDependencyResolver.java:190)
at org.apache.maven.lifecycle.internal.LifecycleDependencyResolver.resolveProjectDependencies(LifecycleDependencyResolver.java:104)
at org.apache.maven.lifecycle.internal.MojoExecutor.ensureDependenciesAreResolved(MojoExecutor.java:258)
at org.apache.maven.lifecycle.internal.MojoExecutor.execute(MojoExecutor.java:201)
at org.apache.maven.lifecycle.internal.MojoExecutor.execute(MojoExecutor.java:153)
at org.apache.maven.lifecycle.internal.MojoExecutor.execute(MojoExecutor.java:145)
at org.apache.maven.lifecycle.internal.LifecycleModuleBuilder.buildProject(LifecycleModuleBuilder.java:84)
at org.apache.maven.lifecycle.internal.LifecycleModuleBuilder.buildProject(LifecycleModuleBuilder.java:59)
at org.apache.maven.lifecycle.internal.LifecycleStarter.singleThreadedBuild(LifecycleStarter.java:183)
at org.apache.maven.lifecycle.internal.LifecycleStarter.execute(LifecycleStarter.java:161)
at org.apache.maven.DefaultMaven.doExecute(DefaultMaven.java:319)
at org.apache.maven.DefaultMaven.execute(DefaultMaven.java:156)
at org.apache.maven.cli.MavenCli.execute(MavenCli.java:534)
at org.apache.maven.cli.MavenCli.doMain(MavenCli.java:196)
at org.apache.maven.cli.MavenCli.main(MavenCli.java:141)
at sun.reflect.NativeMethodAccessorImpl.invoke0(Native Method)
at sun.reflect.NativeMethodAccessorImpl.invoke(NativeMethodAccessorImpl.java:39)
at sun.reflect.DelegatingMethodAccessorImpl.invoke(DelegatingMethodAccessorImpl.java:25)
at java.lang.reflect.Method.invoke(Method.java:597)
at org.codehaus.plexus.classworlds.launcher.Launcher.launchEnhanced(Launcher.java:290)
at org.codehaus.plexus.classworlds.launcher.Launcher.launch(Launcher.java:230)
at org.codehaus.plexus.classworlds.launcher.Launcher.mainWithExitCode(Launcher.java:409)
at org.codehaus.plexus.classworlds.launcher.Launcher.main(Launcher.java:352)
Caused by: org.apache.maven.project.DependencyResolutionException: Could not resolve dependencies for project NPanday.IT11695:NPandayIT11695:pom:1.0-SNAPSHOT: Could not find artifact NUnit:NUnit.Framework:dll:2.2.8.0 in test (file:C:\Workbench\NPanday\npanday-its-1.3-incubating\target\test-classes\NPandayIT11695/test-repo)
at org.apache.maven.project.DefaultProjectDependenciesResolver.resolve(DefaultProjectDependenciesResolver.java:156)
at org.apache.maven.lifecycle.internal.LifecycleDependencyResolver.getDependencies(LifecycleDependencyResolver.java:165)
... 22 more
Caused by: org.sonatype.aether.resolution.ArtifactResolutionException: Could not find artifact NUnit:NUnit.Framework:dll:2.2.8.0 in test (file:C:\Workbench\NPanday\npanday-its-1.3-incubating\target\test-classes\NPandayIT11695/test-repo)
at org.sonatype.aether.impl.internal.DefaultArtifactResolver.resolveArtifacts(DefaultArtifactResolver.java:526)
at org.sonatype.aether.impl.internal.DefaultRepositorySystem.resolveArtifacts(DefaultRepositorySystem.java:304)
at org.sonatype.aether.impl.internal.DefaultRepositorySystem.resolveDependencies(DefaultRepositorySystem.java:334)
at org.apache.maven.project.DefaultProjectDependenciesResolver.resolve(DefaultProjectDependenciesResolver.java:150)
... 23 more
Caused by: org.sonatype.aether.transfer.ArtifactNotFoundException: Could not find artifact NUnit:NUnit.Framework:dll:2.2.8.0 in test (file:C:\Workbench\NPanday\npanday-its-1.3-incubating\target\test-classes\NPandayIT11695/test-repo)
at org.sonatype.aether.connector.wagon.WagonRepositoryConnector$4.wrap(WagonRepositoryConnector.java:945)
at org.sonatype.aether.connector.wagon.WagonRepositoryConnector$4.wrap(WagonRepositoryConnector.java:940)
at org.sonatype.aether.connector.wagon.WagonRepositoryConnector$GetTask.flush(WagonRepositoryConnector.java:696)
at org.sonatype.aether.connector.wagon.WagonRepositoryConnector$GetTask.flush(WagonRepositoryConnector.java:690)
at org.sonatype.aether.connector.wagon.WagonRepositoryConnector.get(WagonRepositoryConnector.java:435)
at org.sonatype.aether.impl.internal.DefaultArtifactResolver.resolveArtifacts(DefaultArtifactResolver.java:438)
... 26 more
[ERROR]
[ERROR] Re-run Maven using the -X switch to enable full debug logging.
[ERROR]
[ERROR] For more information about the errors and possible solutions, please read the following articles:
[ERROR] [Help 1] http://cwiki.apache.org/confluence/display/MAVEN/DependencyResolutionException
at org.apache.maven.it.Verifier.executeGoals(Verifier.java:1297)
at org.apache.maven.it.Verifier.executeGoal(Verifier.java:1145)
at org.apache.maven.it.Verifier.executeGoal(Verifier.java:1139)
at npanday.its.NPandayIT11695MsBuildCopyReferencesTest.testMsBuildCopyReferences(NPandayIT11695MsBuildCopyReferencesTest.java:44)
at sun.reflect.NativeMethodAccessorImpl.invoke0(Native Method)
at sun.reflect.NativeMethodAccessorImpl.invoke(NativeMethodAccessorImpl.java:39)
at sun.reflect.DelegatingMethodAccessorImpl.invoke(DelegatingMethodAccessorImpl.java:25)
at java.lang.reflect.Method.invoke(Method.java:597)
at junit.framework.TestCase.runTest(TestCase.java:164)
at npanday.its.AbstractNPandayIntegrationTestCase.runTest(AbstractNPandayIntegrationTestCase.java:218)
at junit.framework.TestCase.runBare(TestCase.java:130)
at junit.framework.TestResult$1.protect(TestResult.java:106)
at junit.framework.TestResult.runProtected(TestResult.java:124)
at junit.framework.TestResult.run(TestResult.java:109)
at junit.framework.TestCase.run(TestCase.java:120)
at junit.framework.TestSuite.runTest(TestSuite.java:230)
at junit.framework.TestSuite.run(TestSuite.java:225)
at junit.framework.TestSuite.runTest(TestSuite.java:230)
at junit.framework.TestSuite.run(TestSuite.java:225)
at sun.reflect.NativeMethodAccessorImpl.invoke0(Native Method)
at sun.reflect.NativeMethodAccessorImpl.invoke(NativeMethodAccessorImpl.java:39)
at sun.reflect.DelegatingMethodAccessorImpl.invoke(DelegatingMethodAccessorImpl.java:25)
at java.lang.reflect.Method.invoke(Method.java:597)
at org.apache.maven.surefire.junit.JUnitTestSet.execute(JUnitTestSet.java:207)
at org.apache.maven.surefire.junit.JUnit3Provider.executeTestSet(JUnit3Provider.java:107)
at org.apache.maven.surefire.junit.JUnit3Provider.invoke(JUnit3Provider.java:79)
at sun.reflect.NativeMethodAccessorImpl.invoke0(Native Method)
at sun.reflect.NativeMethodAccessorImpl.invoke(NativeMethodAccessorImpl.java:39)
at sun.reflect.DelegatingMethodAccessorImpl.invoke(DelegatingMethodAccessorImpl.java:25)
at java.lang.reflect.Method.invoke(Method.java:597)
at org.apache.maven.surefire.booter.ProviderFactory$ClassLoaderProxy.invoke(ProviderFactory.java:103)
at $Proxy0.invoke(Unknown Source)
at org.apache.maven.surefire.booter.SurefireStarter.invokeProvider(SurefireStarter.java:145)
at org.apache.maven.surefire.booter.SurefireStarter.runSuitesInProcess(SurefireStarter.java:87)
at org.apache.maven.surefire.booter.ForkedBooter.main(ForkedBooter.java:69)
Caused by: org.apache.maven.project.DependencyResolutionException: Could not resolve dependencies for project NPanday.IT11695:NPandayIT11695:pom:1.0-SNAPSHOT: Could not find artifact NUnit:NUnit.Framework:dll:2.2.8.0 in test (file:C:\Workbench\NPanday\npanday-its-1.3-incubating\target\test-classes\NPandayIT11695/test-repo)
at org.apache.maven.project.DefaultProjectDependenciesResolver.resolve(DefaultProjectDependenciesResolver.java:156)
at org.apache.maven.lifecycle.internal.LifecycleDependencyResolver.getDependencies(LifecycleDependencyResolver.java:165)
... 22 more
Caused by: org.sonatype.aether.resolution.ArtifactResolutionException: Could not find artifact NUnit:NUnit.Framework:dll:2.2.8.0 in test (file:C:\Workbench\NPanday\npanday-its-1.3-incubating\target\test-classes\NPandayIT11695/test-repo)
at org.sonatype.aether.impl.internal.DefaultArtifactResolver.resolveArtifacts(DefaultArtifactResolver.java:526)
at org.sonatype.aether.impl.internal.DefaultRepositorySystem.resolveArtifacts(DefaultRepositorySystem.java:304)
at org.sonatype.aether.impl.internal.DefaultRepositorySystem.resolveDependencies(DefaultRepositorySystem.java:334)
at org.apache.maven.project.DefaultProjectDependenciesResolver.resolve(DefaultProjectDependenciesResolver.java:150)
... 23 more
Caused by: org.sonatype.aether.transfer.ArtifactNotFoundException: Could not find artifact NUnit:NUnit.Framework:dll:2.2.8.0 in test (file:C:\Workbench\NPanday\npanday-its-1.3-incubating\target\test-classes\NPandayIT11695/test-repo)
at org.sonatype.aether.connector.wagon.WagonRepositoryConnector$4.wrap(WagonRepositoryConnector.java:945)
at org.sonatype.aether.connector.wagon.WagonRepositoryConnector$4.wrap(WagonRepositoryConnector.java:940)
at org.sonatype.aether.connector.wagon.WagonRepositoryConnector$GetTask.flush(WagonRepositoryConnector.java:696)
at org.sonatype.aether.connector.wagon.WagonRepositoryConnector$GetTask.flush(WagonRepositoryConnector.java:690)
at org.sonatype.aether.connector.wagon.WagonRepositoryConnector.get(WagonRepositoryConnector.java:435)
at org.sonatype.aether.impl.internal.DefaultArtifactResolver.resolveArtifacts(DefaultArtifactResolver.java:438)
... 26 more
[ERROR]
[ERROR] Re-run Maven using the -X switch to enable full debug logging.
[ERROR]
[ERROR] For more information about the errors and possible solutions, please read the following articles:
[ERROR] [Help 1] http://cwiki.apache.org/confluence/display/MAVEN/DependencyResolutionException
at org.apache.maven.it.Verifier.executeGoals(Verifier.java:1297)
at org.apache.maven.it.Verifier.executeGoal(Verifier.java:1145)
at org.apache.maven.it.Verifier.executeGoal(Verifier.java:1139)
at npanday.its.NPandayIT11695MsBuildCopyReferencesTest.testMsBuildCopyReferences(NPandayIT11695MsBuildCopyReferencesTest.java:44)
at sun.reflect.NativeMethodAccessorImpl.invoke0(Native Method)
at sun.reflect.NativeMethodAccessorImpl.invoke(NativeMethodAccessorImpl.java:39)
at sun.reflect.DelegatingMethodAccessorImpl.invoke(DelegatingMethodAccessorImpl.java:25)
at java.lang.reflect.Method.invoke(Method.java:597)
at junit.framework.TestCase.runTest(TestCase.java:164)
at npanday.its.AbstractNPandayIntegrationTestCase.runTest(AbstractNPandayIntegrationTestCase.java:218)
at junit.framework.TestCase.runBare(TestCase.java:130)
at junit.framework.TestResult$1.protect(TestResult.java:106)
at junit.framework.TestResult.runProtected(TestResult.java:124)
at junit.framework.TestResult.run(TestResult.java:109)
at junit.framework.TestCase.run(TestCase.java:120)
at junit.framework.TestSuite.runTest(TestSuite.java:230)
at junit.framework.TestSuite.run(TestSuite.java:225)
at junit.framework.TestSuite.runTest(TestSuite.java:230)
at junit.framework.TestSuite.run(TestSuite.java:225)
at sun.reflect.NativeMethodAccessorImpl.invoke0(Native Method)
at sun.reflect.NativeMethodAccessorImpl.invoke(NativeMethodAccessorImpl.java:39)
at sun.reflect.DelegatingMethodAccessorImpl.invoke(DelegatingMethodAccessorImpl.java:25)
at java.lang.reflect.Method.invoke(Method.java:597)
at org.apache.maven.surefire.junit.JUnitTestSet.execute(JUnitTestSet.java:207)
at org.apache.maven.surefire.junit.JUnit3Provider.executeTestSet(JUnit3Provider.java:107)
at org.apache.maven.surefire.junit.JUnit3Provider.invoke(JUnit3Provider.java:79)
at sun.reflect.NativeMethodAccessorImpl.invoke0(Native Method)
at sun.reflect.NativeMethodAccessorImpl.invoke(NativeMethodAccessorImpl.java:39)
at sun.reflect.DelegatingMethodAccessorImpl.invoke(DelegatingMethodAccessorImpl.java:25)
at java.lang.reflect.Method.invoke(Method.java:597)
at org.apache.maven.surefire.booter.ProviderFactory$ClassLoaderProxy.invoke(ProviderFactory.java:103)
at $Proxy0.invoke(Unknown Source)
at org.apache.maven.surefire.booter.SurefireStarter.invokeProvider(SurefireStarter.java:145)
at org.apache.maven.surefire.booter.SurefireStarter.runSuitesInProcess(SurefireStarter.java:87)
at org.apache.maven.surefire.booter.ForkedBooter.main(ForkedBooter.java:69)
</error>
</testcase>
<testcase time="6.985" classname="npanday.its.NPandayIT11637MsBuildErrorHandlingTest" name="testMsBuildErrorsHandled"/>
<testcase time="10.953" classname="npanday.its.NPandayIT9903ResGenWithErrorInFileNameTest" name="testResGenWithErrorInFileName"/>
<testcase time="10.063" classname="npanday.its.NPandayITWithResourceFileTest" name="testWithResourceFile"/>
<testcase time="9.937" classname="npanday.its.NPandayITWebAppInstallTest" name="testWebAppInstall"/>
<testcase time="11.64" classname="npanday.its.NPandayITVBWebAppTest" name="testWebAppInstall"/>
<testcase time="10.86" classname="npanday.its.NPandayITSnapshotResolutionTest" name="testUniqueSnapshotResolution"/>
<testcase time="10.281" classname="npanday.its.NPandayITSnapshotResolutionTest" name="testNonUniqueSnapshotResolution">
<error message="Exit code was non-zero: 1; command line and log =
&quot;C:\Program Files\Apache\apache-maven-3.0.2\bin\mvn&quot; -Dnpanday.version=1.3-incubating -e --batch-mode &quot;-Dmaven.repo.local=C:\Users\Lars Corneliussen\.m2\repository&quot; org.apache.maven.plugins:maven-clean-plugin:clean install
[INFO] Error stacktraces are turned on.
[INFO] Scanning for projects...
[INFO]
[INFO] ------------------------------------------------------------------------
[INFO] Building test-non-unique-snapshot 1.0-SNAPSHOT
[INFO] ------------------------------------------------------------------------
[INFO]
[INFO] --- maven-clean-plugin:2.4.1:clean (default-cli) @ test-non-unique-snapshot ---
[INFO]
[INFO] --- maven-compile-plugin:1.3-incubating:initialize (default-initialize) @ test-non-unique-snapshot ---
SLF4J: Class path contains multiple SLF4J bindings.
SLF4J: Found binding in [jar:file:/C:/Users/Lars%20Corneliussen/.m2/repository/org/sonatype/gossip/gossip/1.0/gossip-1.0.jar!/org/slf4j/impl/StaticLoggerBinder.class]
SLF4J: Found binding in [jar:file:/C:/Users/Lars%20Corneliussen/.m2/repository/org/slf4j/slf4j-jdk14/1.5.11/slf4j-jdk14-1.5.11.jar!/org/slf4j/impl/StaticLoggerBinder.class]
SLF4J: See http://www.slf4j.org/codes.html#multiple_bindings for an explanation.
09.02.2011 15:41:27 npanday.registry.ConnectionsRepository lazyLoad
INFO: NPANDAY-080-001: Adding data access object: Class Name = npanday.dao.impl.ProjectDaoImpl
09.02.2011 15:41:27 npanday.registry.ConnectionsRepository lazyLoad
INFO: NPANDAY-080-004: Connection Start Up: Time = 219
09.02.2011 15:41:27 npanday.PathUtil getDotNetArtifact
WARNUNG:
NPANDAY-1005-0001: Error copying dependency test:test-snapshot:library:1.0-SNAPSHOT:compile File C:\Users\Lars Corneliussen\.m2\repository\test\test-snapshot\1.0-SNAPSHOT\test-snapshot-1.0-SNAPSHOT.dll does not exist
Downloading: file:C:\Workbench\NPanday\npanday-its-1.3-incubating\target\test-classes\test-non-unique-snapshot/test-repo/test/test-snapshot/1.0-SNAPSHOT/maven-metadata.xml
[WARNING] Checksum validation failed, expected 4f01affb3f669cec8143427af45e05f721fc0011 but is 792987d4cab0c715db313d5062d6432f65491ded for file:C:\Workbench\NPanday\npanday-its-1.3-incubating\target\test-classes\test-non-unique-snapshot/test-repo/test/test-snapshot/1.0-SNAPSHOT/maven-metadata.xml
[WARNING] Checksum validation failed, expected 4f01affb3f669cec8143427af45e05f721fc0011 but is 792987d4cab0c715db313d5062d6432f65491ded for file:C:\Workbench\NPanday\npanday-its-1.3-incubating\target\test-classes\test-non-unique-snapshot/test-repo/test/test-snapshot/1.0-SNAPSHOT/maven-metadata.xml
Downloaded: file:C:\Workbench\NPanday\npanday-its-1.3-incubating\target\test-classes\test-non-unique-snapshot/test-repo/test/test-snapshot/1.0-SNAPSHOT/maven-metadata.xml (2 KB at 22.3 KB/sec)
Downloading: file:C:\Workbench\NPanday\npanday-its-1.3-incubating\target\test-classes\test-non-unique-snapshot/test-repo/test/test-snapshot/1.0-SNAPSHOT/test-snapshot-1.0-SNAPSHOT.dll
Downloaded: file:C:\Workbench\NPanday\npanday-its-1.3-incubating\target\test-classes\test-non-unique-snapshot/test-repo/test/test-snapshot/1.0-SNAPSHOT/test-snapshot-1.0-SNAPSHOT.dll (4 KB)
09.02.2011 15:41:27 npanday.dao.impl.ProjectDaoImpl storeProjectAndResolveDependencies
INFO: NPANDAY-180-011: Project Dependency: Artifact ID = test-snapshot, Group ID = test, Version = 1.0-SNAPSHOT, Artifact Type = library
09.02.2011 15:41:27 npanday.dao.impl.ProjectDaoImpl storeProjectAndResolveDependencies
INFO: NPANDAY-180-012: Resolving artifact for unresolved dependency: test:test-snapshot:library:1.0-SNAPSHOT
09.02.2011 15:41:27 npanday.dao.impl.ProjectDaoImpl storeProjectAndResolveDependencies
INFO: NPANDAY-180-024: resolving pom artifact: test:test-snapshot:pom:1.0-SNAPSHOT
09.02.2011 15:41:27 npanday.dao.impl.ProjectDaoImpl storeProjectAndResolveDependencies
INFO: NPANDAY-180-018: Not found in local repository, now retrieving artifact from wagon:test:test-snapshot:library:1.0-SNAPSHOT, Failed Path Check = C:\Workbench\NPanday\npanday-its-1.3-incubating\target\test-classes\test-non-unique-snapshot\target\test-snapshot.dll
09.02.2011 15:41:27 npanday.dao.impl.ProjectDaoImpl storeProjectAndResolveDependencies
INFO: NPANDAY-180-011: Project Dependency: Artifact ID = NUnit.Framework, Group ID = NUnit, Version = 2.2.8.0, Artifact Type = library
09.02.2011 15:41:27 npanday.dao.impl.ProjectDaoImpl storeProjectAndResolveDependencies
INFO: NPANDAY-180-011: Project Dependency: Artifact ID = NUnit.Framework, Group ID = NUnit, Version = 2.2.8.0, Artifact Type = library
[INFO] Mojo Execution Time = 484
[INFO]
[INFO] --- maven-resolver-plugin:1.3-incubating:resolve (default-resolve) @ test-non-unique-snapshot ---
[INFO] Mojo Execution Time = 0
[INFO]
[INFO] --- NPanday.Plugin.Settings.JavaBinding:1.3-incubating:generate-settings (default-generate-settings) @ test-non-unique-snapshot ---
[INFO]
[INFO] --- maven-compile-plugin:1.3-incubating:generate-assembly-info (default-generate-assembly-info) @ test-non-unique-snapshot ---
[INFO] NPANDAY-902-000: Generating Assembly Info: Language = C_SHARP
[INFO] Mojo Execution Time = 16
[INFO]
[INFO] --- maven-compile-plugin:1.3-incubating:process-sources (default-process-sources) @ test-non-unique-snapshot ---
[INFO] NPANDAY-904-002: Copying source files: From = C:\Workbench\NPanday\npanday-its-1.3-incubating\target\test-classes\test-non-unique-snapshot\src\main\csharp, To = C:\Workbench\NPanday\npanday-its-1.3-incubating\target\test-classes\test-non-unique-snapshot\target/build-sources, File Count = 1
[INFO]
[INFO] --- maven-compile-plugin:1.3-incubating:process-test-sources (default-process-test-sources) @ test-non-unique-snapshot ---
[INFO] NPANDAY-905-002: Copying test source files: From = C:\Workbench\NPanday\npanday-its-1.3-incubating\target\test-classes\test-non-unique-snapshot\src\test\csharp, To = C:\Workbench\NPanday\npanday-its-1.3-incubating\target\test-classes\test-non-unique-snapshot\target/build-test-sources
[INFO] Mojo Execution Time = 15
[INFO]
[INFO] --- maven-resgen-plugin:1.3-incubating:copy-resources (default-copy-resources) @ test-non-unique-snapshot ---
[INFO]
[INFO] --- maven-resgen-plugin:1.3-incubating:generate (default-generate) @ test-non-unique-snapshot ---
[INFO]
[INFO] --- maven-resgen-plugin:1.3-incubating:generate-existing-resx-to-resource (default-generate-existing-resx-to-resource) @ test-non-unique-snapshot ---
[INFO]
[INFO] --- maven-compile-plugin:1.3-incubating:compile (default-compile) @ test-non-unique-snapshot ---
[INFO] NPANDAY-066-013: Found Vendor = Vendor = MICROSOFT, Vendor Version = 2.0.50727, Framework Version = 2.0.50727, Executable Paths = [C:\Windows\Microsoft.NET\Framework\v2.0.50727]
[INFO] NPANDAY-068-003: Compiling Artifact: Vendor = MICROSOFT, Language = MICROSOFT, Assembly Name = C:\Workbench\NPanday\npanday-its-1.3-incubating\target\test-classes\test-non-unique-snapshot\target\test-non-unique-snapshot.dll
target\build-sources\App\MyApp.cs(27,18): warning CS1591: Missing XML comment for publicly visible type or member &apos;App.MyApp&apos;
target\build-sources\App\MyApp.cs(31,16): warning CS1591: Missing XML comment for publicly visible type or member &apos;App.MyApp.MyApp()&apos;
target\build-sources\App\MyApp.cs(29,30): warning CS0169: The field &apos;App.MyApp.myOtherApp&apos; is never used
[INFO] NPANDAY-900-004: Compile Time = 329 ms
[INFO] Mojo Execution Time = 407
[INFO]
[INFO] --- maven-compile-plugin:1.3-incubating:testCompile (default-testCompile) @ test-non-unique-snapshot ---
[INFO] NPANDAY-066-013: Found Vendor = Vendor = MICROSOFT, Vendor Version = 2.0.50727, Framework Version = 2.0.50727, Executable Paths = [C:\Windows\Microsoft.NET\Framework\v2.0.50727]
[INFO] NPANDAY-068-003: Compiling Artifact: Vendor = MICROSOFT, Language = MICROSOFT, Assembly Name = C:\Workbench\NPanday\npanday-its-1.3-incubating\target\test-classes\test-non-unique-snapshot\target\test-non-unique-snapshot-test.dll
[INFO] NPANDAY-060-000: Ignoring unknown command: Command = /rootnamespace:npanday.its.test-non-unique-snapshot
[INFO] NPANDAY-900-004: Compile Time = 297 ms
[INFO] Mojo Execution Time = 312
[INFO]
[INFO] --- maven-test-plugin:1.3-incubating:test (default-test) @ test-non-unique-snapshot ---
09.02.2011 15:41:29 npanday.registry.ConnectionsRepository lazyLoad
INFO: NPANDAY-080-001: Adding data access object: Class Name = npanday.dao.impl.ProjectDaoImpl
09.02.2011 15:41:29 npanday.registry.ConnectionsRepository lazyLoad
INFO: NPANDAY-080-004: Connection Start Up: Time = 78
09.02.2011 15:41:30 npanday.dao.impl.ProjectDaoImpl storeProjectAndResolveDependencies
INFO: NPANDAY-180-011: Project Dependency: Artifact ID = test-snapshot, Group ID = test, Version = 1.0-SNAPSHOT, Artifact Type = library
09.02.2011 15:41:30 npanday.dao.impl.ProjectDaoImpl storeProjectAndResolveDependencies
INFO: NPANDAY-180-012: Resolving artifact for unresolved dependency: test:test-snapshot:library:1.0-SNAPSHOT
09.02.2011 15:41:30 npanday.dao.impl.ProjectDaoImpl storeProjectAndResolveDependencies
INFO: NPANDAY-180-024: resolving pom artifact: test:test-snapshot:pom:1.0-SNAPSHOT
09.02.2011 15:41:30 npanday.dao.impl.ProjectDaoImpl storeProjectAndResolveDependencies
INFO: NPANDAY-180-018: Not found in local repository, now retrieving artifact from wagon:test:test-snapshot:library:1.0-SNAPSHOT, Failed Path Check = C:\Workbench\NPanday\npanday-its-1.3-incubating\target\test-classes\test-non-unique-snapshot\target\test-snapshot.dll
09.02.2011 15:41:30 npanday.dao.impl.ProjectDaoImpl storeProjectAndResolveDependencies
INFO: NPANDAY-180-011: Project Dependency: Artifact ID = NUnit.Framework, Group ID = NUnit, Version = 2.2.8.0, Artifact Type = library
09.02.2011 15:41:30 info.aduna.lang.service.ServiceRegistry &lt;init&gt;
INFO: Registered service class org.openrdf.query.parser.serql.SeRQLParserFactory
09.02.2011 15:41:30 info.aduna.lang.service.ServiceRegistry &lt;init&gt;
INFO: Registered service class org.openrdf.query.parser.sparql.SPARQLParserFactory
[INFO]
09.02.2011 15:41:30 npanday.dao.impl.ProjectDaoImpl storeProjectAndResolveDependencies
INFO: NPANDAY-180-011: Project Dependency: Artifact ID = NUnit.Framework, Group ID = NUnit, Version = 2.2.8.0, Artifact Type = library
NUnit version 2.5.9.10348
Copyright (C) 2002-2009 Charlie Poole.
Copyright (C) 2002-2004 James W. Newkirk, Michael C. Two, Alexei A. Vorontsov.
Copyright (C) 2000-2002 Philip Craig.
All Rights Reserved.
Runtime Environment -
OS Version: Microsoft Windows NT 6.1.7600.0
CLR Version: 2.0.50727.4952 ( Net 2.0 )
ProcessModel: Default DomainUsage: Single
Execution Runtime: Default
Tests run: 2, Errors: 0, Failures: 0, Inconclusive: 0, Time: 0,0624988 seconds
Not run: 0, Invalid: 0, Ignored: 0, Skipped: 0
[INFO]
[INFO] --- maven-repository-plugin:1.3-incubating:convert-artifact (default-convert-artifact) @ test-non-unique-snapshot ---
09.02.2011 15:41:32 npanday.registry.ConnectionsRepository lazyLoad
INFO: NPANDAY-080-001: Adding data access object: Class Name = npanday.dao.impl.ProjectDaoImpl
09.02.2011 15:41:32 npanday.registry.ConnectionsRepository lazyLoad
INFO: NPANDAY-080-004: Connection Start Up: Time = 15
09.02.2011 15:41:32 info.aduna.lang.service.ServiceRegistry &lt;init&gt;
INFO: Registered service class org.openrdf.query.parser.serql.SeRQLParserFactory
09.02.2011 15:41:32 info.aduna.lang.service.ServiceRegistry &lt;init&gt;
INFO: Registered service class org.openrdf.query.parser.sparql.SPARQLParserFactory
09.02.2011 15:41:32 npanday.repository.impl.RepositoryConverterImpl convertRepositoryFormatFor
INFO: NPANDAY-190-002: Converting Project: Artifact ID = test-non-unique-snapshot, Dependency Count =2
[INFO]
[INFO] --- maven-install-plugin:1.3-incubating:install (default-install) @ test-non-unique-snapshot ---
09.02.2011 15:41:33 npanday.registry.ConnectionsRepository lazyLoad
INFO: NPANDAY-080-001: Adding data access object: Class Name = npanday.dao.impl.ProjectDaoImpl
09.02.2011 15:41:33 npanday.registry.ConnectionsRepository lazyLoad
INFO: NPANDAY-080-004: Connection Start Up: Time = 93
09.02.2011 15:41:33 npanday.dao.impl.ProjectDaoImpl storeProjectAndResolveDependencies
INFO: NPANDAY-180-011: Project Dependency: Artifact ID = test-snapshot, Group ID = test, Version = 1.0-SNAPSHOT, Artifact Type = library
09.02.2011 15:41:33 npanday.dao.impl.ProjectDaoImpl storeProjectAndResolveDependencies
INFO: NPANDAY-180-012: Resolving artifact for unresolved dependency: test:test-snapshot:library:1.0-SNAPSHOT
09.02.2011 15:41:33 npanday.dao.impl.ProjectDaoImpl storeProjectAndResolveDependencies
INFO: NPANDAY-180-024: resolving pom artifact: test:test-snapshot:pom:1.0-SNAPSHOT
09.02.2011 15:41:33 npanday.dao.impl.ProjectDaoImpl storeProjectAndResolveDependencies
INFO: NPANDAY-180-018: Not found in local repository, now retrieving artifact from wagon:test:test-snapshot:library:1.0-SNAPSHOT, Failed Path Check = C:\Workbench\NPanday\npanday-its-1.3-incubating\target\test-classes\test-non-unique-snapshot\target\test-snapshot.dll
09.02.2011 15:41:33 npanday.dao.impl.ProjectDaoImpl storeProjectAndResolveDependencies
SCHWERWIEGEND: NPANDAY-180-0201: Error resolving artifact. Reason:
org.apache.maven.artifact.resolver.ArtifactNotFoundException: Could not find artifact test:test-snapshot:dll:1.0-SNAPSHOT
Try downloading the file manually from the project website.
Then, install it using the command:
mvn install:install-file -DgroupId=test -DartifactId=test-snapshot -Dversion=1.0-SNAPSHOT -Dpackaging=library -Dfile=/path/to/file
Alternatively, if you host your own repository you can deploy the file there:
mvn deploy:deploy-file -DgroupId=test -DartifactId=test-snapshot -Dversion=1.0-SNAPSHOT -Dpackaging=library -Dfile=/path/to/file -Durl=[url] -DrepositoryId=[id]
test:test-snapshot:library:1.0-SNAPSHOT
from the specified remote repositories:
(none)
at org.apache.maven.artifact.resolver.DefaultArtifactResolver.resolve(DefaultArtifactResolver.java:235)
at org.apache.maven.artifact.resolver.DefaultArtifactResolver.resolve(DefaultArtifactResolver.java:173)
at org.apache.maven.artifact.resolver.DefaultArtifactResolver.resolve(DefaultArtifactResolver.java:541)
at npanday.dao.impl.ProjectDaoImpl.storeProjectAndResolveDependencies(ProjectDaoImpl.java:791)
at npanday.dao.impl.ProjectDaoImpl.storeProjectAndResolveDependencies(ProjectDaoImpl.java:414)
at npanday.dao.impl.ProjectDaoImpl.storeModelAndResolveDependencies(ProjectDaoImpl.java:889)
at npanday.artifact.impl.ArtifactInstallerImpl.installArtifactWithPom(ArtifactInstallerImpl.java:401)
at npanday.plugin.install.InstallerMojo.execute(InstallerMojo.java:177)
at org.apache.maven.plugin.DefaultBuildPluginManager.executeMojo(DefaultBuildPluginManager.java:107)
at org.apache.maven.lifecycle.internal.MojoExecutor.execute(MojoExecutor.java:209)
at org.apache.maven.lifecycle.internal.MojoExecutor.execute(MojoExecutor.java:153)
at org.apache.maven.lifecycle.internal.MojoExecutor.execute(MojoExecutor.java:145)
at org.apache.maven.lifecycle.internal.LifecycleModuleBuilder.buildProject(LifecycleModuleBuilder.java:84)
at org.apache.maven.lifecycle.internal.LifecycleModuleBuilder.buildProject(LifecycleModuleBuilder.java:59)
at org.apache.maven.lifecycle.internal.LifecycleStarter.singleThreadedBuild(LifecycleStarter.java:183)
at org.apache.maven.lifecycle.internal.LifecycleStarter.execute(LifecycleStarter.java:161)
at org.apache.maven.DefaultMaven.doExecute(DefaultMaven.java:319)
at org.apache.maven.DefaultMaven.execute(DefaultMaven.java:156)
at org.apache.maven.cli.MavenCli.execute(MavenCli.java:534)
at org.apache.maven.cli.MavenCli.doMain(MavenCli.java:196)
at org.apache.maven.cli.MavenCli.main(MavenCli.java:141)
at sun.reflect.NativeMethodAccessorImpl.invoke0(Native Method)
at sun.reflect.NativeMethodAccessorImpl.invoke(NativeMethodAccessorImpl.java:39)
at sun.reflect.DelegatingMethodAccessorImpl.invoke(DelegatingMethodAccessorImpl.java:25)
at java.lang.reflect.Method.invoke(Method.java:597)
at org.codehaus.plexus.classworlds.launcher.Launcher.launchEnhanced(Launcher.java:290)
at org.codehaus.plexus.classworlds.launcher.Launcher.launch(Launcher.java:230)
at org.codehaus.plexus.classworlds.launcher.Launcher.mainWithExitCode(Launcher.java:409)
at org.codehaus.plexus.classworlds.launcher.Launcher.main(Launcher.java:352)
Caused by: org.sonatype.aether.resolution.ArtifactResolutionException: Could not find artifact test:test-snapshot:dll:1.0-SNAPSHOT
at org.sonatype.aether.impl.internal.DefaultArtifactResolver.resolveArtifacts(DefaultArtifactResolver.java:526)
at org.sonatype.aether.impl.internal.DefaultArtifactResolver.resolveArtifact(DefaultArtifactResolver.java:214)
at org.sonatype.aether.impl.internal.DefaultRepositorySystem.resolveArtifact(DefaultRepositorySystem.java:296)
at org.apache.maven.artifact.resolver.DefaultArtifactResolver.resolve(DefaultArtifactResolver.java:229)
... 28 more
Caused by: org.sonatype.aether.transfer.ArtifactNotFoundException: Could not find artifact test:test-snapshot:dll:1.0-SNAPSHOT
at org.sonatype.aether.impl.internal.DefaultArtifactResolver.resolveArtifacts(DefaultArtifactResolver.java:517)
... 31 more
java.io.IOException: NPANDAY-180-020: Problem in resolving artifact: Artifact = test:test-snapshot:library:1.0-SNAPSHOT, Message = Could not find artifact test:test-snapshot:dll:1.0-SNAPSHOT
Try downloading the file manually from the project website.
Then, install it using the command:
mvn install:install-file -DgroupId=test -DartifactId=test-snapshot -Dversion=1.0-SNAPSHOT -Dpackaging=library -Dfile=/path/to/file
Alternatively, if you host your own repository you can deploy the file there:
mvn deploy:deploy-file -DgroupId=test -DartifactId=test-snapshot -Dversion=1.0-SNAPSHOT -Dpackaging=library -Dfile=/path/to/file -Durl=[url] -DrepositoryId=[id]
test:test-snapshot:library:1.0-SNAPSHOT
from the specified remote repositories:
(none)
at npanday.dao.impl.ProjectDaoImpl.storeProjectAndResolveDependencies(ProjectDaoImpl.java:806)
at npanday.dao.impl.ProjectDaoImpl.storeProjectAndResolveDependencies(ProjectDaoImpl.java:414)
at npanday.dao.impl.ProjectDaoImpl.storeModelAndResolveDependencies(ProjectDaoImpl.java:889)
at npanday.artifact.impl.ArtifactInstallerImpl.installArtifactWithPom(ArtifactInstallerImpl.java:401)
at npanday.plugin.install.InstallerMojo.execute(InstallerMojo.java:177)
at org.apache.maven.plugin.DefaultBuildPluginManager.executeMojo(DefaultBuildPluginManager.java:107)
at org.apache.maven.lifecycle.internal.MojoExecutor.execute(MojoExecutor.java:209)
at org.apache.maven.lifecycle.internal.MojoExecutor.execute(MojoExecutor.java:153)
at org.apache.maven.lifecycle.internal.MojoExecutor.execute(MojoExecutor.java:145)
at org.apache.maven.lifecycle.internal.LifecycleModuleBuilder.buildProject(LifecycleModuleBuilder.java:84)
at org.apache.maven.lifecycle.internal.LifecycleModuleBuilder.buildProject(LifecycleModuleBuilder.java:59)
at org.apache.maven.lifecycle.internal.LifecycleStarter.singleThreadedBuild(LifecycleStarter.java:183)
at org.apache.maven.lifecycle.internal.LifecycleStarter.execute(LifecycleStarter.java:161)
at org.apache.maven.DefaultMaven.doExecute(DefaultMaven.java:319)
at org.apache.maven.DefaultMaven.execute(DefaultMaven.java:156)
at org.apache.maven.cli.MavenCli.execute(MavenCli.java:534)
at org.apache.maven.cli.MavenCli.doMain(MavenCli.java:196)
at org.apache.maven.cli.MavenCli.main(MavenCli.java:141)
at sun.reflect.NativeMethodAccessorImpl.invoke0(Native Method)
at sun.reflect.NativeMethodAccessorImpl.invoke(NativeMethodAccessorImpl.java:39)
at sun.reflect.DelegatingMethodAccessorImpl.invoke(DelegatingMethodAccessorImpl.java:25)
at java.lang.reflect.Method.invoke(Method.java:597)
at org.codehaus.plexus.classworlds.launcher.Launcher.launchEnhanced(Launcher.java:290)
at org.codehaus.plexus.classworlds.launcher.Launcher.launch(Launcher.java:230)
at org.codehaus.plexus.classworlds.launcher.Launcher.mainWithExitCode(Launcher.java:409)
at org.codehaus.plexus.classworlds.launcher.Launcher.main(Launcher.java:352)
[INFO] ------------------------------------------------------------------------
[INFO] BUILD FAILURE
[INFO] ------------------------------------------------------------------------
[INFO] Total time: 8.437s
[INFO] Finished at: Wed Feb 09 15:41:33 CET 2011
[INFO] Final Memory: 12M/185M
[INFO] ------------------------------------------------------------------------
[ERROR] Failed to execute goal npanday.plugin:maven-install-plugin:1.3-incubating:install (default-install) on project test-non-unique-snapshot: NPANDAY-1001-000: Failed to install artifacts: NPANDAY-001-014: Unable to store model: Message = NPANDAY-180-020: Problem in resolving artifact: Artifact = test:test-snapshot:library:1.0-SNAPSHOT, Message = Could not find artifact test:test-snapshot:dll:1.0-SNAPSHOT
[ERROR]
[ERROR] Try downloading the file manually from the project website.
[ERROR]
[ERROR] Then, install it using the command:
[ERROR] mvn install:install-file -DgroupId=test -DartifactId=test-snapshot -Dversion=1.0-SNAPSHOT -Dpackaging=library -Dfile=/path/to/file
[ERROR]
[ERROR] Alternatively, if you host your own repository you can deploy the file there:
[ERROR] mvn deploy:deploy-file -DgroupId=test -DartifactId=test-snapshot -Dversion=1.0-SNAPSHOT -Dpackaging=library -Dfile=/path/to/file -Durl=[url] -DrepositoryId=[id]
[ERROR]
[ERROR]
[ERROR] test:test-snapshot:library:1.0-SNAPSHOT
[ERROR]
[ERROR] from the specified remote repositories:
[ERROR] (none)
[ERROR] -&gt; [Help 1]
org.apache.maven.lifecycle.LifecycleExecutionException: Failed to execute goal npanday.plugin:maven-install-plugin:1.3-incubating:install (default-install) on project test-non-unique-snapshot: NPANDAY-1001-000: Failed to install artifacts
at org.apache.maven.lifecycle.internal.MojoExecutor.execute(MojoExecutor.java:217)
at org.apache.maven.lifecycle.internal.MojoExecutor.execute(MojoExecutor.java:153)
at org.apache.maven.lifecycle.internal.MojoExecutor.execute(MojoExecutor.java:145)
at org.apache.maven.lifecycle.internal.LifecycleModuleBuilder.buildProject(LifecycleModuleBuilder.java:84)
at org.apache.maven.lifecycle.internal.LifecycleModuleBuilder.buildProject(LifecycleModuleBuilder.java:59)
at org.apache.maven.lifecycle.internal.LifecycleStarter.singleThreadedBuild(LifecycleStarter.java:183)
at org.apache.maven.lifecycle.internal.LifecycleStarter.execute(LifecycleStarter.java:161)
at org.apache.maven.DefaultMaven.doExecute(DefaultMaven.java:319)
at org.apache.maven.DefaultMaven.execute(DefaultMaven.java:156)
at org.apache.maven.cli.MavenCli.execute(MavenCli.java:534)
at org.apache.maven.cli.MavenCli.doMain(MavenCli.java:196)
at org.apache.maven.cli.MavenCli.main(MavenCli.java:141)
at sun.reflect.NativeMethodAccessorImpl.invoke0(Native Method)
at sun.reflect.NativeMethodAccessorImpl.invoke(NativeMethodAccessorImpl.java:39)
at sun.reflect.DelegatingMethodAccessorImpl.invoke(DelegatingMethodAccessorImpl.java:25)
at java.lang.reflect.Method.invoke(Method.java:597)
at org.codehaus.plexus.classworlds.launcher.Launcher.launchEnhanced(Launcher.java:290)
at org.codehaus.plexus.classworlds.launcher.Launcher.launch(Launcher.java:230)
at org.codehaus.plexus.classworlds.launcher.Launcher.mainWithExitCode(Launcher.java:409)
at org.codehaus.plexus.classworlds.launcher.Launcher.main(Launcher.java:352)
Caused by: org.apache.maven.plugin.MojoExecutionException: NPANDAY-1001-000: Failed to install artifacts
at npanday.plugin.install.InstallerMojo.execute(InstallerMojo.java:181)
at org.apache.maven.plugin.DefaultBuildPluginManager.executeMojo(DefaultBuildPluginManager.java:107)
at org.apache.maven.lifecycle.internal.MojoExecutor.execute(MojoExecutor.java:209)
... 19 more
Caused by: org.apache.maven.artifact.installer.ArtifactInstallationException: NPANDAY-001-014: Unable to store model: Message = NPANDAY-180-020: Problem in resolving artifact: Artifact = test:test-snapshot:library:1.0-SNAPSHOT, Message = Could not find artifact test:test-snapshot:dll:1.0-SNAPSHOT
Try downloading the file manually from the project website.
Then, install it using the command:
mvn install:install-file -DgroupId=test -DartifactId=test-snapshot -Dversion=1.0-SNAPSHOT -Dpackaging=library -Dfile=/path/to/file
Alternatively, if you host your own repository you can deploy the file there:
mvn deploy:deploy-file -DgroupId=test -DartifactId=test-snapshot -Dversion=1.0-SNAPSHOT -Dpackaging=library -Dfile=/path/to/file -Durl=[url] -DrepositoryId=[id]
test:test-snapshot:library:1.0-SNAPSHOT
from the specified remote repositories:
(none)
at npanday.artifact.impl.ArtifactInstallerImpl.installArtifactWithPom(ArtifactInstallerImpl.java:407)
at npanday.plugin.install.InstallerMojo.execute(InstallerMojo.java:177)
... 21 more
[ERROR]
[ERROR] Re-run Maven using the -X switch to enable full debug logging.
[ERROR]
[ERROR] For more information about the errors and possible solutions, please read the following articles:
[ERROR] [Help 1] http://cwiki.apache.org/confluence/display/MAVEN/MojoExecutionException
" type="org.apache.maven.it.VerificationException">org.apache.maven.it.VerificationException: Exit code was non-zero: 1; command line and log =
&quot;C:\Program Files\Apache\apache-maven-3.0.2\bin\mvn&quot; -Dnpanday.version=1.3-incubating -e --batch-mode &quot;-Dmaven.repo.local=C:\Users\Lars Corneliussen\.m2\repository&quot; org.apache.maven.plugins:maven-clean-plugin:clean install
[INFO] Error stacktraces are turned on.
[INFO] Scanning for projects...
[INFO]
[INFO] ------------------------------------------------------------------------
[INFO] Building test-non-unique-snapshot 1.0-SNAPSHOT
[INFO] ------------------------------------------------------------------------
[INFO]
[INFO] --- maven-clean-plugin:2.4.1:clean (default-cli) @ test-non-unique-snapshot ---
[INFO]
[INFO] --- maven-compile-plugin:1.3-incubating:initialize (default-initialize) @ test-non-unique-snapshot ---
SLF4J: Class path contains multiple SLF4J bindings.
SLF4J: Found binding in [jar:file:/C:/Users/Lars%20Corneliussen/.m2/repository/org/sonatype/gossip/gossip/1.0/gossip-1.0.jar!/org/slf4j/impl/StaticLoggerBinder.class]
SLF4J: Found binding in [jar:file:/C:/Users/Lars%20Corneliussen/.m2/repository/org/slf4j/slf4j-jdk14/1.5.11/slf4j-jdk14-1.5.11.jar!/org/slf4j/impl/StaticLoggerBinder.class]
SLF4J: See http://www.slf4j.org/codes.html#multiple_bindings for an explanation.
09.02.2011 15:41:27 npanday.registry.ConnectionsRepository lazyLoad
INFO: NPANDAY-080-001: Adding data access object: Class Name = npanday.dao.impl.ProjectDaoImpl
09.02.2011 15:41:27 npanday.registry.ConnectionsRepository lazyLoad
INFO: NPANDAY-080-004: Connection Start Up: Time = 219
09.02.2011 15:41:27 npanday.PathUtil getDotNetArtifact
WARNUNG:
NPANDAY-1005-0001: Error copying dependency test:test-snapshot:library:1.0-SNAPSHOT:compile File C:\Users\Lars Corneliussen\.m2\repository\test\test-snapshot\1.0-SNAPSHOT\test-snapshot-1.0-SNAPSHOT.dll does not exist
Downloading: file:C:\Workbench\NPanday\npanday-its-1.3-incubating\target\test-classes\test-non-unique-snapshot/test-repo/test/test-snapshot/1.0-SNAPSHOT/maven-metadata.xml
[WARNING] Checksum validation failed, expected 4f01affb3f669cec8143427af45e05f721fc0011 but is 792987d4cab0c715db313d5062d6432f65491ded for file:C:\Workbench\NPanday\npanday-its-1.3-incubating\target\test-classes\test-non-unique-snapshot/test-repo/test/test-snapshot/1.0-SNAPSHOT/maven-metadata.xml
[WARNING] Checksum validation failed, expected 4f01affb3f669cec8143427af45e05f721fc0011 but is 792987d4cab0c715db313d5062d6432f65491ded for file:C:\Workbench\NPanday\npanday-its-1.3-incubating\target\test-classes\test-non-unique-snapshot/test-repo/test/test-snapshot/1.0-SNAPSHOT/maven-metadata.xml
Downloaded: file:C:\Workbench\NPanday\npanday-its-1.3-incubating\target\test-classes\test-non-unique-snapshot/test-repo/test/test-snapshot/1.0-SNAPSHOT/maven-metadata.xml (2 KB at 22.3 KB/sec)
Downloading: file:C:\Workbench\NPanday\npanday-its-1.3-incubating\target\test-classes\test-non-unique-snapshot/test-repo/test/test-snapshot/1.0-SNAPSHOT/test-snapshot-1.0-SNAPSHOT.dll
Downloaded: file:C:\Workbench\NPanday\npanday-its-1.3-incubating\target\test-classes\test-non-unique-snapshot/test-repo/test/test-snapshot/1.0-SNAPSHOT/test-snapshot-1.0-SNAPSHOT.dll (4 KB)
09.02.2011 15:41:27 npanday.dao.impl.ProjectDaoImpl storeProjectAndResolveDependencies
INFO: NPANDAY-180-011: Project Dependency: Artifact ID = test-snapshot, Group ID = test, Version = 1.0-SNAPSHOT, Artifact Type = library
09.02.2011 15:41:27 npanday.dao.impl.ProjectDaoImpl storeProjectAndResolveDependencies
INFO: NPANDAY-180-012: Resolving artifact for unresolved dependency: test:test-snapshot:library:1.0-SNAPSHOT
09.02.2011 15:41:27 npanday.dao.impl.ProjectDaoImpl storeProjectAndResolveDependencies
INFO: NPANDAY-180-024: resolving pom artifact: test:test-snapshot:pom:1.0-SNAPSHOT
09.02.2011 15:41:27 npanday.dao.impl.ProjectDaoImpl storeProjectAndResolveDependencies
INFO: NPANDAY-180-018: Not found in local repository, now retrieving artifact from wagon:test:test-snapshot:library:1.0-SNAPSHOT, Failed Path Check = C:\Workbench\NPanday\npanday-its-1.3-incubating\target\test-classes\test-non-unique-snapshot\target\test-snapshot.dll
09.02.2011 15:41:27 npanday.dao.impl.ProjectDaoImpl storeProjectAndResolveDependencies
INFO: NPANDAY-180-011: Project Dependency: Artifact ID = NUnit.Framework, Group ID = NUnit, Version = 2.2.8.0, Artifact Type = library
09.02.2011 15:41:27 npanday.dao.impl.ProjectDaoImpl storeProjectAndResolveDependencies
INFO: NPANDAY-180-011: Project Dependency: Artifact ID = NUnit.Framework, Group ID = NUnit, Version = 2.2.8.0, Artifact Type = library
[INFO] Mojo Execution Time = 484
[INFO]
[INFO] --- maven-resolver-plugin:1.3-incubating:resolve (default-resolve) @ test-non-unique-snapshot ---
[INFO] Mojo Execution Time = 0
[INFO]
[INFO] --- NPanday.Plugin.Settings.JavaBinding:1.3-incubating:generate-settings (default-generate-settings) @ test-non-unique-snapshot ---
[INFO]
[INFO] --- maven-compile-plugin:1.3-incubating:generate-assembly-info (default-generate-assembly-info) @ test-non-unique-snapshot ---
[INFO] NPANDAY-902-000: Generating Assembly Info: Language = C_SHARP
[INFO] Mojo Execution Time = 16
[INFO]
[INFO] --- maven-compile-plugin:1.3-incubating:process-sources (default-process-sources) @ test-non-unique-snapshot ---
[INFO] NPANDAY-904-002: Copying source files: From = C:\Workbench\NPanday\npanday-its-1.3-incubating\target\test-classes\test-non-unique-snapshot\src\main\csharp, To = C:\Workbench\NPanday\npanday-its-1.3-incubating\target\test-classes\test-non-unique-snapshot\target/build-sources, File Count = 1
[INFO]
[INFO] --- maven-compile-plugin:1.3-incubating:process-test-sources (default-process-test-sources) @ test-non-unique-snapshot ---
[INFO] NPANDAY-905-002: Copying test source files: From = C:\Workbench\NPanday\npanday-its-1.3-incubating\target\test-classes\test-non-unique-snapshot\src\test\csharp, To = C:\Workbench\NPanday\npanday-its-1.3-incubating\target\test-classes\test-non-unique-snapshot\target/build-test-sources
[INFO] Mojo Execution Time = 15
[INFO]
[INFO] --- maven-resgen-plugin:1.3-incubating:copy-resources (default-copy-resources) @ test-non-unique-snapshot ---
[INFO]
[INFO] --- maven-resgen-plugin:1.3-incubating:generate (default-generate) @ test-non-unique-snapshot ---
[INFO]
[INFO] --- maven-resgen-plugin:1.3-incubating:generate-existing-resx-to-resource (default-generate-existing-resx-to-resource) @ test-non-unique-snapshot ---
[INFO]
[INFO] --- maven-compile-plugin:1.3-incubating:compile (default-compile) @ test-non-unique-snapshot ---
[INFO] NPANDAY-066-013: Found Vendor = Vendor = MICROSOFT, Vendor Version = 2.0.50727, Framework Version = 2.0.50727, Executable Paths = [C:\Windows\Microsoft.NET\Framework\v2.0.50727]
[INFO] NPANDAY-068-003: Compiling Artifact: Vendor = MICROSOFT, Language = MICROSOFT, Assembly Name = C:\Workbench\NPanday\npanday-its-1.3-incubating\target\test-classes\test-non-unique-snapshot\target\test-non-unique-snapshot.dll
target\build-sources\App\MyApp.cs(27,18): warning CS1591: Missing XML comment for publicly visible type or member &apos;App.MyApp&apos;
target\build-sources\App\MyApp.cs(31,16): warning CS1591: Missing XML comment for publicly visible type or member &apos;App.MyApp.MyApp()&apos;
target\build-sources\App\MyApp.cs(29,30): warning CS0169: The field &apos;App.MyApp.myOtherApp&apos; is never used
[INFO] NPANDAY-900-004: Compile Time = 329 ms
[INFO] Mojo Execution Time = 407
[INFO]
[INFO] --- maven-compile-plugin:1.3-incubating:testCompile (default-testCompile) @ test-non-unique-snapshot ---
[INFO] NPANDAY-066-013: Found Vendor = Vendor = MICROSOFT, Vendor Version = 2.0.50727, Framework Version = 2.0.50727, Executable Paths = [C:\Windows\Microsoft.NET\Framework\v2.0.50727]
[INFO] NPANDAY-068-003: Compiling Artifact: Vendor = MICROSOFT, Language = MICROSOFT, Assembly Name = C:\Workbench\NPanday\npanday-its-1.3-incubating\target\test-classes\test-non-unique-snapshot\target\test-non-unique-snapshot-test.dll
[INFO] NPANDAY-060-000: Ignoring unknown command: Command = /rootnamespace:npanday.its.test-non-unique-snapshot
[INFO] NPANDAY-900-004: Compile Time = 297 ms
[INFO] Mojo Execution Time = 312
[INFO]
[INFO] --- maven-test-plugin:1.3-incubating:test (default-test) @ test-non-unique-snapshot ---
09.02.2011 15:41:29 npanday.registry.ConnectionsRepository lazyLoad
INFO: NPANDAY-080-001: Adding data access object: Class Name = npanday.dao.impl.ProjectDaoImpl
09.02.2011 15:41:29 npanday.registry.ConnectionsRepository lazyLoad
INFO: NPANDAY-080-004: Connection Start Up: Time = 78
09.02.2011 15:41:30 npanday.dao.impl.ProjectDaoImpl storeProjectAndResolveDependencies
INFO: NPANDAY-180-011: Project Dependency: Artifact ID = test-snapshot, Group ID = test, Version = 1.0-SNAPSHOT, Artifact Type = library
09.02.2011 15:41:30 npanday.dao.impl.ProjectDaoImpl storeProjectAndResolveDependencies
INFO: NPANDAY-180-012: Resolving artifact for unresolved dependency: test:test-snapshot:library:1.0-SNAPSHOT
09.02.2011 15:41:30 npanday.dao.impl.ProjectDaoImpl storeProjectAndResolveDependencies
INFO: NPANDAY-180-024: resolving pom artifact: test:test-snapshot:pom:1.0-SNAPSHOT
09.02.2011 15:41:30 npanday.dao.impl.ProjectDaoImpl storeProjectAndResolveDependencies
INFO: NPANDAY-180-018: Not found in local repository, now retrieving artifact from wagon:test:test-snapshot:library:1.0-SNAPSHOT, Failed Path Check = C:\Workbench\NPanday\npanday-its-1.3-incubating\target\test-classes\test-non-unique-snapshot\target\test-snapshot.dll
09.02.2011 15:41:30 npanday.dao.impl.ProjectDaoImpl storeProjectAndResolveDependencies
INFO: NPANDAY-180-011: Project Dependency: Artifact ID = NUnit.Framework, Group ID = NUnit, Version = 2.2.8.0, Artifact Type = library
09.02.2011 15:41:30 info.aduna.lang.service.ServiceRegistry &lt;init&gt;
INFO: Registered service class org.openrdf.query.parser.serql.SeRQLParserFactory
09.02.2011 15:41:30 info.aduna.lang.service.ServiceRegistry &lt;init&gt;
INFO: Registered service class org.openrdf.query.parser.sparql.SPARQLParserFactory
[INFO]
09.02.2011 15:41:30 npanday.dao.impl.ProjectDaoImpl storeProjectAndResolveDependencies
INFO: NPANDAY-180-011: Project Dependency: Artifact ID = NUnit.Framework, Group ID = NUnit, Version = 2.2.8.0, Artifact Type = library
NUnit version 2.5.9.10348
Copyright (C) 2002-2009 Charlie Poole.
Copyright (C) 2002-2004 James W. Newkirk, Michael C. Two, Alexei A. Vorontsov.
Copyright (C) 2000-2002 Philip Craig.
All Rights Reserved.
Runtime Environment -
OS Version: Microsoft Windows NT 6.1.7600.0
CLR Version: 2.0.50727.4952 ( Net 2.0 )
ProcessModel: Default DomainUsage: Single
Execution Runtime: Default
Tests run: 2, Errors: 0, Failures: 0, Inconclusive: 0, Time: 0,0624988 seconds
Not run: 0, Invalid: 0, Ignored: 0, Skipped: 0
[INFO]
[INFO] --- maven-repository-plugin:1.3-incubating:convert-artifact (default-convert-artifact) @ test-non-unique-snapshot ---
09.02.2011 15:41:32 npanday.registry.ConnectionsRepository lazyLoad
INFO: NPANDAY-080-001: Adding data access object: Class Name = npanday.dao.impl.ProjectDaoImpl
09.02.2011 15:41:32 npanday.registry.ConnectionsRepository lazyLoad
INFO: NPANDAY-080-004: Connection Start Up: Time = 15
09.02.2011 15:41:32 info.aduna.lang.service.ServiceRegistry &lt;init&gt;
INFO: Registered service class org.openrdf.query.parser.serql.SeRQLParserFactory
09.02.2011 15:41:32 info.aduna.lang.service.ServiceRegistry &lt;init&gt;
INFO: Registered service class org.openrdf.query.parser.sparql.SPARQLParserFactory
09.02.2011 15:41:32 npanday.repository.impl.RepositoryConverterImpl convertRepositoryFormatFor
INFO: NPANDAY-190-002: Converting Project: Artifact ID = test-non-unique-snapshot, Dependency Count =2
[INFO]
[INFO] --- maven-install-plugin:1.3-incubating:install (default-install) @ test-non-unique-snapshot ---
09.02.2011 15:41:33 npanday.registry.ConnectionsRepository lazyLoad
INFO: NPANDAY-080-001: Adding data access object: Class Name = npanday.dao.impl.ProjectDaoImpl
09.02.2011 15:41:33 npanday.registry.ConnectionsRepository lazyLoad
INFO: NPANDAY-080-004: Connection Start Up: Time = 93
09.02.2011 15:41:33 npanday.dao.impl.ProjectDaoImpl storeProjectAndResolveDependencies
INFO: NPANDAY-180-011: Project Dependency: Artifact ID = test-snapshot, Group ID = test, Version = 1.0-SNAPSHOT, Artifact Type = library
09.02.2011 15:41:33 npanday.dao.impl.ProjectDaoImpl storeProjectAndResolveDependencies
INFO: NPANDAY-180-012: Resolving artifact for unresolved dependency: test:test-snapshot:library:1.0-SNAPSHOT
09.02.2011 15:41:33 npanday.dao.impl.ProjectDaoImpl storeProjectAndResolveDependencies
INFO: NPANDAY-180-024: resolving pom artifact: test:test-snapshot:pom:1.0-SNAPSHOT
09.02.2011 15:41:33 npanday.dao.impl.ProjectDaoImpl storeProjectAndResolveDependencies
INFO: NPANDAY-180-018: Not found in local repository, now retrieving artifact from wagon:test:test-snapshot:library:1.0-SNAPSHOT, Failed Path Check = C:\Workbench\NPanday\npanday-its-1.3-incubating\target\test-classes\test-non-unique-snapshot\target\test-snapshot.dll
09.02.2011 15:41:33 npanday.dao.impl.ProjectDaoImpl storeProjectAndResolveDependencies
SCHWERWIEGEND: NPANDAY-180-0201: Error resolving artifact. Reason:
org.apache.maven.artifact.resolver.ArtifactNotFoundException: Could not find artifact test:test-snapshot:dll:1.0-SNAPSHOT
Try downloading the file manually from the project website.
Then, install it using the command:
mvn install:install-file -DgroupId=test -DartifactId=test-snapshot -Dversion=1.0-SNAPSHOT -Dpackaging=library -Dfile=/path/to/file
Alternatively, if you host your own repository you can deploy the file there:
mvn deploy:deploy-file -DgroupId=test -DartifactId=test-snapshot -Dversion=1.0-SNAPSHOT -Dpackaging=library -Dfile=/path/to/file -Durl=[url] -DrepositoryId=[id]
test:test-snapshot:library:1.0-SNAPSHOT
from the specified remote repositories:
(none)
at org.apache.maven.artifact.resolver.DefaultArtifactResolver.resolve(DefaultArtifactResolver.java:235)
at org.apache.maven.artifact.resolver.DefaultArtifactResolver.resolve(DefaultArtifactResolver.java:173)
at org.apache.maven.artifact.resolver.DefaultArtifactResolver.resolve(DefaultArtifactResolver.java:541)
at npanday.dao.impl.ProjectDaoImpl.storeProjectAndResolveDependencies(ProjectDaoImpl.java:791)
at npanday.dao.impl.ProjectDaoImpl.storeProjectAndResolveDependencies(ProjectDaoImpl.java:414)
at npanday.dao.impl.ProjectDaoImpl.storeModelAndResolveDependencies(ProjectDaoImpl.java:889)
at npanday.artifact.impl.ArtifactInstallerImpl.installArtifactWithPom(ArtifactInstallerImpl.java:401)
at npanday.plugin.install.InstallerMojo.execute(InstallerMojo.java:177)
at org.apache.maven.plugin.DefaultBuildPluginManager.executeMojo(DefaultBuildPluginManager.java:107)
at org.apache.maven.lifecycle.internal.MojoExecutor.execute(MojoExecutor.java:209)
at org.apache.maven.lifecycle.internal.MojoExecutor.execute(MojoExecutor.java:153)
at org.apache.maven.lifecycle.internal.MojoExecutor.execute(MojoExecutor.java:145)
at org.apache.maven.lifecycle.internal.LifecycleModuleBuilder.buildProject(LifecycleModuleBuilder.java:84)
at org.apache.maven.lifecycle.internal.LifecycleModuleBuilder.buildProject(LifecycleModuleBuilder.java:59)
at org.apache.maven.lifecycle.internal.LifecycleStarter.singleThreadedBuild(LifecycleStarter.java:183)
at org.apache.maven.lifecycle.internal.LifecycleStarter.execute(LifecycleStarter.java:161)
at org.apache.maven.DefaultMaven.doExecute(DefaultMaven.java:319)
at org.apache.maven.DefaultMaven.execute(DefaultMaven.java:156)
at org.apache.maven.cli.MavenCli.execute(MavenCli.java:534)
at org.apache.maven.cli.MavenCli.doMain(MavenCli.java:196)
at org.apache.maven.cli.MavenCli.main(MavenCli.java:141)
at sun.reflect.NativeMethodAccessorImpl.invoke0(Native Method)
at sun.reflect.NativeMethodAccessorImpl.invoke(NativeMethodAccessorImpl.java:39)
at sun.reflect.DelegatingMethodAccessorImpl.invoke(DelegatingMethodAccessorImpl.java:25)
at java.lang.reflect.Method.invoke(Method.java:597)
at org.codehaus.plexus.classworlds.launcher.Launcher.launchEnhanced(Launcher.java:290)
at org.codehaus.plexus.classworlds.launcher.Launcher.launch(Launcher.java:230)
at org.codehaus.plexus.classworlds.launcher.Launcher.mainWithExitCode(Launcher.java:409)
at org.codehaus.plexus.classworlds.launcher.Launcher.main(Launcher.java:352)
Caused by: org.sonatype.aether.resolution.ArtifactResolutionException: Could not find artifact test:test-snapshot:dll:1.0-SNAPSHOT
at org.sonatype.aether.impl.internal.DefaultArtifactResolver.resolveArtifacts(DefaultArtifactResolver.java:526)
at org.sonatype.aether.impl.internal.DefaultArtifactResolver.resolveArtifact(DefaultArtifactResolver.java:214)
at org.sonatype.aether.impl.internal.DefaultRepositorySystem.resolveArtifact(DefaultRepositorySystem.java:296)
at org.apache.maven.artifact.resolver.DefaultArtifactResolver.resolve(DefaultArtifactResolver.java:229)
... 28 more
Caused by: org.sonatype.aether.transfer.ArtifactNotFoundException: Could not find artifact test:test-snapshot:dll:1.0-SNAPSHOT
at org.sonatype.aether.impl.internal.DefaultArtifactResolver.resolveArtifacts(DefaultArtifactResolver.java:517)
... 31 more
java.io.IOException: NPANDAY-180-020: Problem in resolving artifact: Artifact = test:test-snapshot:library:1.0-SNAPSHOT, Message = Could not find artifact test:test-snapshot:dll:1.0-SNAPSHOT
Try downloading the file manually from the project website.
Then, install it using the command:
mvn install:install-file -DgroupId=test -DartifactId=test-snapshot -Dversion=1.0-SNAPSHOT -Dpackaging=library -Dfile=/path/to/file
Alternatively, if you host your own repository you can deploy the file there:
mvn deploy:deploy-file -DgroupId=test -DartifactId=test-snapshot -Dversion=1.0-SNAPSHOT -Dpackaging=library -Dfile=/path/to/file -Durl=[url] -DrepositoryId=[id]
test:test-snapshot:library:1.0-SNAPSHOT
from the specified remote repositories:
(none)
at npanday.dao.impl.ProjectDaoImpl.storeProjectAndResolveDependencies(ProjectDaoImpl.java:806)
at npanday.dao.impl.ProjectDaoImpl.storeProjectAndResolveDependencies(ProjectDaoImpl.java:414)
at npanday.dao.impl.ProjectDaoImpl.storeModelAndResolveDependencies(ProjectDaoImpl.java:889)
at npanday.artifact.impl.ArtifactInstallerImpl.installArtifactWithPom(ArtifactInstallerImpl.java:401)
at npanday.plugin.install.InstallerMojo.execute(InstallerMojo.java:177)
at org.apache.maven.plugin.DefaultBuildPluginManager.executeMojo(DefaultBuildPluginManager.java:107)
at org.apache.maven.lifecycle.internal.MojoExecutor.execute(MojoExecutor.java:209)
at org.apache.maven.lifecycle.internal.MojoExecutor.execute(MojoExecutor.java:153)
at org.apache.maven.lifecycle.internal.MojoExecutor.execute(MojoExecutor.java:145)
at org.apache.maven.lifecycle.internal.LifecycleModuleBuilder.buildProject(LifecycleModuleBuilder.java:84)
at org.apache.maven.lifecycle.internal.LifecycleModuleBuilder.buildProject(LifecycleModuleBuilder.java:59)
at org.apache.maven.lifecycle.internal.LifecycleStarter.singleThreadedBuild(LifecycleStarter.java:183)
at org.apache.maven.lifecycle.internal.LifecycleStarter.execute(LifecycleStarter.java:161)
at org.apache.maven.DefaultMaven.doExecute(DefaultMaven.java:319)
at org.apache.maven.DefaultMaven.execute(DefaultMaven.java:156)