secret
Created

  • Download Gist
gistfile1.txt
1
/usr/bin/gcc -Wl,-search_paths_first -Wl,-headerpad_max_install_names CMakeFiles/libwatcheditTest.dir/configuration_test.c.o -o libwatcheditTest ../libwatchedit.a -lcmockery /usr/local/lib/liblog4c.dylib
18:20 build (master) $ clear && make clean && cmake ../ && make all VERBOSE=1 && CTEST_OUTPUT_ON_FAILURE=yes ctest -VV
-- Found Log4C: /usr/local/lib/liblog4c.dylib
-- Configuring done
-- Generating done
-- Build files have been written to: /Users/codebeaker/Projects/watchedit-client-code/src/libwatchedit/build
/usr/local/Cellar/cmake/2.8.5/bin/cmake -H/Users/codebeaker/Projects/watchedit-client-code/src/libwatchedit -B/Users/codebeaker/Projects/watchedit-client-code/src/libwatchedit/build --check-build-system CMakeFiles/Makefile.cmake 0
/usr/local/Cellar/cmake/2.8.5/bin/cmake -E cmake_progress_start /Users/codebeaker/Projects/watchedit-client-code/src/libwatchedit/build/CMakeFiles /Users/codebeaker/Projects/watchedit-client-code/src/libwatchedit/build/CMakeFiles/progress.marks
make -f CMakeFiles/Makefile2 all
make -f CMakeFiles/watchedit.dir/build.make CMakeFiles/watchedit.dir/depend
cd /Users/codebeaker/Projects/watchedit-client-code/src/libwatchedit/build && /usr/local/Cellar/cmake/2.8.5/bin/cmake -E cmake_depends "Unix Makefiles" /Users/codebeaker/Projects/watchedit-client-code/src/libwatchedit /Users/codebeaker/Projects/watchedit-client-code/src/libwatchedit /Users/codebeaker/Projects/watchedit-client-code/src/libwatchedit/build /Users/codebeaker/Projects/watchedit-client-code/src/libwatchedit/build /Users/codebeaker/Projects/watchedit-client-code/src/libwatchedit/build/CMakeFiles/watchedit.dir/DependInfo.cmake --color=
make -f CMakeFiles/watchedit.dir/build.make CMakeFiles/watchedit.dir/build
/usr/local/Cellar/cmake/2.8.5/bin/cmake -E cmake_progress_report /Users/codebeaker/Projects/watchedit-client-code/src/libwatchedit/build/CMakeFiles 2
[ 50%] Building C object CMakeFiles/watchedit.dir/src/configuration.c.o
/usr/bin/gcc   -I/Users/codebeaker/Projects/watchedit-client-code/src/libwatchedit/include    -o CMakeFiles/watchedit.dir/src/configuration.c.o   -c /Users/codebeaker/Projects/watchedit-client-code/src/libwatchedit/src/configuration.c
Linking C static library libwatchedit.a
/usr/local/Cellar/cmake/2.8.5/bin/cmake -P CMakeFiles/watchedit.dir/cmake_clean_target.cmake
/usr/local/Cellar/cmake/2.8.5/bin/cmake -E cmake_link_script CMakeFiles/watchedit.dir/link.txt --verbose=1
/usr/bin/ar cr libwatchedit.a  CMakeFiles/watchedit.dir/src/configuration.c.o
/usr/bin/ranlib libwatchedit.a
/usr/local/Cellar/cmake/2.8.5/bin/cmake -E cmake_progress_report /Users/codebeaker/Projects/watchedit-client-code/src/libwatchedit/build/CMakeFiles  2
[ 50%] Built target watchedit
make -f test/CMakeFiles/libwatcheditTest.dir/build.make test/CMakeFiles/libwatcheditTest.dir/depend
cd /Users/codebeaker/Projects/watchedit-client-code/src/libwatchedit/build && /usr/local/Cellar/cmake/2.8.5/bin/cmake -E cmake_depends "Unix Makefiles" /Users/codebeaker/Projects/watchedit-client-code/src/libwatchedit /Users/codebeaker/Projects/watchedit-client-code/src/libwatchedit/test /Users/codebeaker/Projects/watchedit-client-code/src/libwatchedit/build /Users/codebeaker/Projects/watchedit-client-code/src/libwatchedit/build/test /Users/codebeaker/Projects/watchedit-client-code/src/libwatchedit/build/test/CMakeFiles/libwatcheditTest.dir/DependInfo.cmake --color=
make -f test/CMakeFiles/libwatcheditTest.dir/build.make test/CMakeFiles/libwatcheditTest.dir/build
/usr/local/Cellar/cmake/2.8.5/bin/cmake -E cmake_progress_report /Users/codebeaker/Projects/watchedit-client-code/src/libwatchedit/build/CMakeFiles 1
[100%] Building C object test/CMakeFiles/libwatcheditTest.dir/configuration_test.c.o
cd /Users/codebeaker/Projects/watchedit-client-code/src/libwatchedit/build/test && /usr/bin/gcc   -I/Users/codebeaker/Projects/watchedit-client-code/src/libwatchedit/include -I/usr/local/include    -o CMakeFiles/libwatcheditTest.dir/configuration_test.c.o   -c /Users/codebeaker/Projects/watchedit-client-code/src/libwatchedit/test/configuration_test.c
Linking C executable libwatcheditTest
cd /Users/codebeaker/Projects/watchedit-client-code/src/libwatchedit/build/test && /usr/local/Cellar/cmake/2.8.5/bin/cmake -E cmake_link_script CMakeFiles/libwatcheditTest.dir/link.txt --verbose=1
/usr/bin/gcc   -Wl,-search_paths_first -Wl,-headerpad_max_install_names   CMakeFiles/libwatcheditTest.dir/configuration_test.c.o  -o libwatcheditTest  ../libwatchedit.a -lcmockery /usr/local/lib/liblog4c.dylib 
ld: duplicate symbol _wit_configuration_file_path in ../libwatchedit.a(configuration.c.o) and CMakeFiles/libwatcheditTest.dir/configuration_test.c.o for architecture x86_64
collect2: ld returned 1 exit status
make[2]: *** [test/libwatcheditTest] Error 1
make[1]: *** [test/CMakeFiles/libwatcheditTest.dir/all] Error 2
make: *** [all] Error 2

Please sign in to comment on this gist.

Something went wrong with that request. Please try again.