Created
March 25, 2025 16:16
pw947161-p14028964
This file contains bidirectional Unicode text that may be interpreted or compiled differently than what appears below. To review, open the file in an editor that reveals hidden Unicode characters.
Learn more about bidirectional Unicode characters
Full log: | |
W: Support for running offline not available (unshare: unshare failed: Operation not permitted) | |
I: config: PASS in 0:00:08.360053 | |
I: default: FAIL in 0:00:07.458558 | |
I: kernel: SKIP in 0:00:00.000010 | |
I: xipkernel: SKIP in 0:00:00.000004 | |
I: modules: FAIL in 0:00:00.088133 | |
I: dtbs: PASS in 0:00:01.299828 | |
I: dtbs-legacy: SKIP in 0:00:00.004541 | |
I: debugkernel: SKIP in 0:00:00.000005 | |
I: headers: PASS in 0:00:00.980963 | |
I: build output in /build/tmp.uKlV1PE8np | |
tuxmake --download-all-korg-gcc-toolchains --target-arch=riscv --kconfig=rv32_defconfig --toolchain=llvm --wrapper=ccache --environment=KBUILD_BUILD_TIMESTAMP=@1621270510 --environment=KBUILD_BUILD_USER=tuxmake --environment=KBUILD_BUILD_HOST=tuxmake --environment=KCFLAGS=-ffile-prefix-map=/build/tmp.uKlV1PE8np/build/= --runtime=null --image=docker.io/tuxmake/riscv_clang CROSS_COMPILE=riscv64-linux- config default kernel xipkernel modules dtbs dtbs-legacy debugkernel headers | |
make --silent --keep-going --jobs=48 O=/build/tmp.uKlV1PE8np/build ARCH=riscv CROSS_COMPILE=riscv64-linux- LLVM=1 'CC=ccache clang' 'HOSTCC=ccache clang' rv32_defconfig | |
make --silent --keep-going --jobs=48 O=/build/tmp.uKlV1PE8np/build ARCH=riscv CROSS_COMPILE=riscv64-linux- LLVM=1 'CC=ccache clang' 'HOSTCC=ccache clang' | |
error: unknown target ABI 'ilp32' | |
make[3]: *** [/build/tmpozj07t_d/scripts/Makefile.build:352: arch/riscv/kernel/vdso/vdso.lds] Error 1 | |
make[3]: Target 'include/generated/vdso-offsets.h' not remade because of errors. | |
make[2]: *** [/build/tmpozj07t_d/arch/riscv/Makefile:196: vdso_prepare] Error 2 | |
make[2]: Target '__all' not remade because of errors. | |
make[1]: *** [/build/tmpozj07t_d/Makefile:251: __sub-make] Error 2 | |
make[1]: Target '__all' not remade because of errors. | |
make: *** [Makefile:251: __sub-make] Error 2 | |
make: Target '__all' not remade because of errors. | |
rm -rf /build/tmp.uKlV1PE8np/build/modinstall | |
make --silent --keep-going --jobs=48 O=/build/tmp.uKlV1PE8np/build INSTALL_MOD_STRIP=1 INSTALL_MOD_PATH=/build/tmp.uKlV1PE8np/build/modinstall ARCH=riscv CROSS_COMPILE=riscv64-linux- LLVM=1 'CC=ccache clang' 'HOSTCC=ccache clang' modules_install | |
make[3]: *** No rule to make target 'modules.order', needed by '/build/tmp.uKlV1PE8np/build/modinstall/lib/modules/6.14.0-rc1-00018-g3c8ee892c6d2/modules.order'. | |
make[3]: *** No rule to make target 'modules.builtin', needed by '/build/tmp.uKlV1PE8np/build/modinstall/lib/modules/6.14.0-rc1-00018-g3c8ee892c6d2/modules.builtin'. | |
make[3]: *** No rule to make target 'modules.builtin.modinfo', needed by '/build/tmp.uKlV1PE8np/build/modinstall/lib/modules/6.14.0-rc1-00018-g3c8ee892c6d2/modules.builtin.modinfo'. | |
make[3]: Target '__modinst' not remade because of errors. | |
make[2]: *** [/build/tmpozj07t_d/Makefile:1900: modules_install] Error 2 | |
make[1]: *** [/build/tmpozj07t_d/Makefile:251: __sub-make] Error 2 | |
make[1]: Target 'modules_install' not remade because of errors. | |
make: *** [Makefile:251: __sub-make] Error 2 | |
make: Target 'modules_install' not remade because of errors. | |
make --silent --keep-going --jobs=48 O=/build/tmp.uKlV1PE8np/build INSTALL_DTBS_PATH=/build/tmp.uKlV1PE8np/build/dtbsinstall/dtbs ARCH=riscv CROSS_COMPILE=riscv64-linux- LLVM=1 'CC=ccache clang' 'HOSTCC=ccache clang' dtbs | |
rm -rf /build/tmp.uKlV1PE8np/build/dtbsinstall | |
mkdir -p /build/tmp.uKlV1PE8np/build/dtbsinstall/dtbs | |
make --silent --keep-going --jobs=48 O=/build/tmp.uKlV1PE8np/build INSTALL_DTBS_PATH=/build/tmp.uKlV1PE8np/build/dtbsinstall/dtbs ARCH=riscv CROSS_COMPILE=riscv64-linux- LLVM=1 'CC=ccache clang' 'HOSTCC=ccache clang' dtbs_install | |
tar --sort=name --owner=tuxmake:1000 --group=tuxmake:1000 --mtime=@1742912375 --clamp-mtime -caf /build/tmp.uKlV1PE8np/build/dtbs.tar -C /build/tmp.uKlV1PE8np/build/dtbsinstall dtbs | |
rm -rf /build/tmp.uKlV1PE8np/build/install_hdr | |
make --silent --keep-going --jobs=48 O=/build/tmp.uKlV1PE8np/build INSTALL_HDR_PATH=/build/tmp.uKlV1PE8np/build/install_hdr/ ARCH=riscv CROSS_COMPILE=riscv64-linux- LLVM=1 'CC=ccache clang' 'HOSTCC=ccache clang' headers_install | |
tar --sort=name --owner=tuxmake:1000 --group=tuxmake:1000 --mtime=@1742912375 --clamp-mtime -caf /build/tmp.uKlV1PE8np/build/headers.tar -C /build/tmp.uKlV1PE8np/build/install_hdr . | |
warnings/errors: | |
error: unknown target ABI 'ilp32' | |
Sign up for free
to join this conversation on GitHub.
Already have an account?
Sign in to comment