Skip to content

Instantly share code, notes, and snippets.

Embed
What would you like to do?
[lloyd@lappro ~] $ sudo port -d install db46
Password:
DEBUG: Found port in file:///opt/local/var/macports/sources/rsync.macports.org/release/ports/databases/db46
DEBUG: Changing to port directory: /opt/local/var/macports/sources/rsync.macports.org/release/ports/databases/db46
DEBUG: OS Platform: darwin
DEBUG: OS Version: 10.0.0d1
DEBUG: Mac OS X Version: 10.6
DEBUG: System Arch: i386
DEBUG: setting option os.universal_supported to yes
DEBUG: Going to use alternate build prefix: /Users/lloyd/.macports
DEBUG: portbuildpath = /Users/lloyd/.macports/opt/local/var/macports/build/_opt_local_var_macports_sources_rsync.macports.org_release_ports_databases_db46
DEBUG: workpath = /Users/lloyd/.macports/opt/local/var/macports/build/_opt_local_var_macports_sources_rsync.macports.org_release_ports_databases_db46/work
DEBUG: org.macports.load registered provides 'load', a pre-existing procedure. Target override will not be provided
DEBUG: org.macports.distfiles registered provides 'distfiles', a pre-existing procedure. Target override will not be provided
DEBUG: Using group file /opt/local/var/macports/sources/rsync.macports.org/release/ports/_resources/port1.0/group/muniversal-1.0.tcl
DEBUG: Reading variant descriptions from /opt/local/var/macports/sources/rsync.macports.org/release/ports/_resources/port1.0/variant_descriptions.conf
DEBUG: universal variant already exists, so not adding the default one
DEBUG: Requested variant darwin is not provided by port db46.
DEBUG: Requested variant i386 is not provided by port db46.
DEBUG: Requested variant macosx is not provided by port db46.
---> Computing dependencies for db46
DEBUG: Executing org.macports.main (db46)
DEBUG: Skipping completed org.macports.fetch (db46)
DEBUG: Skipping completed org.macports.checksum (db46)
DEBUG: Skipping completed org.macports.extract (db46)
DEBUG: Skipping completed org.macports.patch (db46)
DEBUG: Skipping completed org.macports.configure (db46)
---> Building db46
DEBUG: Executing org.macports.build (db46)
DEBUG: Environment: CPATH='/opt/local/include' LIBRARY_PATH='/opt/local/lib' MACOSX_DEPLOYMENT_TARGET='10.6'
DEBUG: Assembled command: 'cd "/Users/lloyd/.macports/opt/local/var/macports/build/_opt_local_var_macports_sources_rsync.macports.org_release_ports_databases_db46/work/db-4.6.21/build_unix" && /usr/bin/make -j2 all'
/bin/sh ./libtool --mode=link /usr/bin/gcc-4.2 -O2 -arch x86_64 -o db_archive -L/opt/local/lib \
db_archive.lo util_sig.lo libdb-4.6.la
/bin/sh ./libtool --mode=link /usr/bin/gcc-4.2 -O2 -arch x86_64 -o db_checkpoint -L/opt/local/lib \
db_checkpoint.lo util_log.lo util_sig.lo libdb-4.6.la
/usr/bin/gcc-4.2 -O2 -arch x86_64 -o .libs/db_checkpoint .libs/db_checkpoint.o .libs/util_log.o .libs/util_sig.o -L/opt/local/lib ./.libs/libdb-4.6.dylib
/usr/bin/gcc-4.2 -O2 -arch x86_64 -o .libs/db_archive .libs/db_archive.o .libs/util_sig.o -L/opt/local/lib ./.libs/libdb-4.6.dylib
ld warning: in ./.libs/libdb-4.6.dylib, file is not of required architecture
Undefined symbols:
"___os_id", referenced from:
___db_util_logset in util_log.o
"_db_env_create", referenced from:
_main in db_checkpoint.o
"_db_strerror", referenced from:
_main in db_checkpoint.o
_main in db_checkpoint.o
"___os_sleep", referenced from:
_main in db_checkpoint.o
"___db_ctime", referenced from:
_main in db_checkpoint.o
_main in db_checkpoint.o
___db_util_logset in util_log.o
"___db_getlong", referenced from:
_main in db_checkpoint.o
_main in db_checkpoint.o
"___db_rpath", referenced from:
_main in db_checkpoint.o
"_db_version", referenced from:
_version_check in db_checkpoint.o
_main in db_checkpoint.o
ld: symbol(s) not found
collect2: ld returned 1 exit status
ld warning: in ./.libs/libdb-4.6.dylib, file is not of required architecture
Undefined symbols:
"_db_env_create", referenced from:
_main in db_archive.o
"_db_strerror", referenced from:
_main in db_archive.o
_main in db_archive.o
"___db_rpath", referenced from:
_main in db_archive.o
"_db_version", referenced from:
_version_check in db_archive.o
_main in db_archive.o
ld: symbol(s) not found
collect2: ld returned 1 exit status
make: *** [db_checkpoint] Error 1
make: *** Waiting for unfinished jobs....
make: *** [db_archive] Error 1
Error: Target org.macports.build returned: shell command " cd "/Users/lloyd/.macports/opt/local/var/macports/build/_opt_local_var_macports_sources_rsync.macports.org_release_ports_databases_db46/work/db-4.6.21/build_unix" && /usr/bin/make -j2 all " returned error 2
Command output: _main in db_checkpoint.o
_main in db_checkpoint.o
___db_util_logset in util_log.o
"___db_getlong", referenced from:
_main in db_checkpoint.o
_main in db_checkpoint.o
"___db_rpath", referenced from:
_main in db_checkpoint.o
"_db_version", referenced from:
_version_check in db_checkpoint.o
_main in db_checkpoint.o
ld: symbol(s) not found
collect2: ld returned 1 exit status
ld warning: in ./.libs/libdb-4.6.dylib, file is not of required architecture
Undefined symbols:
"_db_env_create", referenced from:
_main in db_archive.o
"_db_strerror", referenced from:
_main in db_archive.o
_main in db_archive.o
"___db_rpath", referenced from:
_main in db_archive.o
"_db_version", referenced from:
_version_check in db_archive.o
_main in db_archive.o
ld: symbol(s) not found
collect2: ld returned 1 exit status
make: *** [db_checkpoint] Error 1
make: *** Waiting for unfinished jobs....
make: *** [db_archive] Error 1
DEBUG: Backtrace: shell command " cd "/Users/lloyd/.macports/opt/local/var/macports/build/_opt_local_var_macports_sources_rsync.macports.org_release_ports_databases_db46/work/db-4.6.21/build_unix" && /usr/bin/make -j2 all " returned error 2
Command output: _main in db_checkpoint.o
_main in db_checkpoint.o
___db_util_logset in util_log.o
"___db_getlong", referenced from:
_main in db_checkpoint.o
_main in db_checkpoint.o
"___db_rpath", referenced from:
_main in db_checkpoint.o
"_db_version", referenced from:
_version_check in db_checkpoint.o
_main in db_checkpoint.o
ld: symbol(s) not found
collect2: ld returned 1 exit status
ld warning: in ./.libs/libdb-4.6.dylib, file is not of required architecture
Undefined symbols:
"_db_env_create", referenced from:
_main in db_archive.o
"_db_strerror", referenced from:
_main in db_archive.o
_main in db_archive.o
"___db_rpath", referenced from:
_main in db_archive.o
"_db_version", referenced from:
_version_check in db_archive.o
_main in db_archive.o
ld: symbol(s) not found
collect2: ld returned 1 exit status
make: *** [db_checkpoint] Error 1
make: *** Waiting for unfinished jobs....
make: *** [db_archive] Error 1
while executing
"command_exec build"
(procedure "portbuild::build_main" line 9)
invoked from within
"$procedure $targetname"
Warning: the following items did not execute (for db46): org.macports.activate org.macports.build org.macports.destroot org.macports.install
Error: Status 1 encountered during processing.
Sign up for free to join this conversation on GitHub. Already have an account? Sign in to comment
You can’t perform that action at this time.