Skip to content

Instantly share code, notes, and snippets.

@longton95 longton95/Without flag Secret
Created Jun 19, 2018

Embed
What would you like to do?
C:\Users\Josh\appc\deviceTest>appc run -p windows -T wp-device -l trace
Appcelerator Command-Line Interface, version 7.0.4
Copyright (c) 2014-2018, Appcelerator, Inc. All Rights Reserved.
2018-06-19T14:04:11.253Z | TRACE | set environment to {"registry":"https://registry.platform.axway.com","baseurl":"https://platform.axway.com"}
2018-06-19T14:04:11.254Z | TRACE | checking credentials for existing session
2018-06-19T14:04:11.358Z | TRACE | Attempting to load session info from config file
2018-06-19T14:04:11.365Z | TRACE | check if session is invalidated
2018-06-19T14:04:12.081Z | TRACE | refresh session expiry to: 1530021850639
2018-06-19T14:04:12.093Z | TRACE | session expiry 1530021850639 false
2018-06-19T14:04:12.094Z | TRACE | Arrow Cloud config file: C:\Users\Josh\.acs
2018-06-19T14:04:12.095Z | TRACE | found Arrow Cloud login { mid: '61d948f777821e064d758acf32716b0449f663a6',
publishPort: 443,
publishHost: 'https://admin.cloudapp-enterprise.appcelerator.com',
username: 'jlongton@axway.com',
cookie:
[ 'connect.sid=s%3AraqzbMjfOZqE-bSBezXCrSnXN5jRs6Us.OXXr5k4CinIAvbygfa1DDFJREjmglv4x8AJct4HV8nA; Path=/; Expires=Thu, 28 Jun 2018 22:28:14 GMT; HttpOnly' ],
defaultEP:
{ publishHost: 'https://admin.cloudapp-enterprise.appcelerator.com',
publishPort: 443 } } , checking nodeACSEndpoint= https://admin.cloudapp-enterprise.appcelerator.com
2018-06-19T14:04:12.096Z | TRACE | Arrow Cloud cookie expiry [ 1530224894000 ]
2018-06-19T14:04:12.097Z | TRACE | session already loaded in opts.session
2018-06-19T14:04:12.098Z | TRACE | getCredentials() session:
{
"ipaddress": "169.254.80.80",
"username": "jlongton@axway.com",
"password": "<OMITTED>",
"session": "<OMITTED>",
"nonce": "<OMITTED>",
"environment": {
"name": "production",
"isProduction": true,
"acsBaseUrl": "https://api.cloud.appcelerator.com",
"acsAuthBaseUrl": "https://secure-identity.cloud.appcelerator.com",
"nodeACSEndpoint": "https://admin.cloudapp-enterprise.appcelerator.com"
},
"token": "<OMITTED>",
"fingerprint": "61d948f777821e064d758acf32716b0449f663a6",
"fingerprint_description": "Windows Machine ID: baf7c630-eb97-4701-b171-3569c3992453",
"org_id": 100000675,
"expiry": 1530021850639
}
2018-06-19T14:04:12.099Z | TRACE | loading plugins for command "run"
2018-06-19T14:04:12.111Z | TRACE | run search paths:
[
"C:\\Users\\Josh\\.appcelerator\\install\\7.0.4\\package",
"C:\\Users\\Josh\\.appcelerator\\install\\7.0.4\\package\\node_modules",
"C:\\Users\\Josh\\appc\\deviceTest\\plugins",
"C:\\Users\\Josh\\appc\\deviceTest\\node_modules",
"C:\\Users\\Josh\\appc\\node_modules",
"C:\\Users\\Josh\\node_modules",
"C:\\Users\\node_modules",
"C:\\node_modules",
"C:\\Users\\Josh\\.appcelerator\\.npm\\lib\\node_modules"
]
2018-06-19T14:04:12.112Z | DEBUG | [PLUGIN-LOAD] 0ms C:\Users\Josh\.appcelerator\install\7.0.4\package\appc.js
2018-06-19T14:04:12.160Z | DEBUG | [PLUGIN-LOAD] 45ms C:\Users\Josh\.appcelerator\install\7.0.4\package\node_modules\appc-cli-titanium\appc.js
2018-06-19T14:04:12.161Z | DEBUG | run plugin: C:\Users\Josh\.appcelerator\install\7.0.4\package\node_modules\appc-cli-titanium
2018-06-19T14:04:12.166Z | DEBUG | [PLUGIN-LOAD] 0ms C:\Users\Josh\.appcelerator\install\7.0.4\package\node_modules\arrow\appc.js
2018-06-19T14:04:12.168Z | DEBUG | run plugin: C:\Users\Josh\.appcelerator\install\7.0.4\package\node_modules\arrow
2018-06-19T14:04:12.217Z | TRACE | plugin "arrow" failed its "when" function check, skipping...
2018-06-19T14:04:12.218Z | TRACE | loading plugin "titanium" for command "run" CLI options via function
2018-06-19T14:04:12.219Z | TRACE | loading plugin "titanium" for command "run" CLI options via array
2018-06-19T14:04:12.221Z | TRACE | executing command "run" with the following plugins:
["titanium"]
2018-06-19T14:04:12.222Z | TRACE | session already loaded in opts.session
2018-06-19T14:04:12.223Z | DEBUG | Titanium Downloads Last Checked: 1529334472806
2018-6-19 15:04:18
Operating System
Name = Microsoft Windows 10 Pro
Version = 10.0.17134
Architecture = 32bit
# CPUs = 8
Memory = 34295439360
Node.js
Node.js Version = 8.9.1
npm Version = 5.5.1
Titanium CLI
CLI Version = 5.1.1
Titanium SDK
SDK Version = 7.3.0.v20180618062809
SDK Path = C:\ProgramData\Titanium\mobilesdk\win32\7.3.0.v20180618062809
Target Platform = windows
Command
C:\Program Files (x86)\nodejs\node.exe C:\Users\Josh\.appcelerator\install\7.0.4\package\node_modules\titanium\lib\titanium.js build -p windows -T wp-device -l trace --config-file C:\Users\Josh\AppData\Local\Temp\build-1529417052223.json --no-banner --project-dir C:\Users\Josh\appc\deviceTest
[DEBUG] Detecting modules in C:\ProgramData\Application Data\Titanium\modules
[DEBUG] Detected android module: com.appc.mod 1.0.0 @ C:\ProgramData\Application Data\Titanium\modules\android\com.appc.mod\1.0.0
[DEBUG] Detected android module: com.appcelerator.apm 1.1.5 @ C:\ProgramData\Application Data\Titanium\modules\android\com.appcelerator.apm\1.1.5
[DEBUG] Detected android module: com.appcelerator.apm 2.0.0 @ C:\ProgramData\Application Data\Titanium\modules\android\com.appcelerator.apm\2.0.0
[DEBUG] Detected android module: com.appcelerator.apm 3.0.0 @ C:\ProgramData\Application Data\Titanium\modules\android\com.appcelerator.apm\3.0.0
[DEBUG] Detected android module: com.appcelerator.apm 3.1.0 @ C:\ProgramData\Application Data\Titanium\modules\android\com.appcelerator.apm\3.1.0
[DEBUG] Detected android module: com.appcelerator.apm 3.1.1 @ C:\ProgramData\Application Data\Titanium\modules\android\com.appcelerator.apm\3.1.1
[DEBUG] Detected android module: com.appcelerator.apm 3.1.2 @ C:\ProgramData\Application Data\Titanium\modules\android\com.appcelerator.apm\3.1.2
[DEBUG] Detected android module: facebook 6.0.1 @ C:\ProgramData\Application Data\Titanium\modules\android\facebook\6.0.1
[DEBUG] Detected android module: facebook 6.2.0 @ C:\ProgramData\Application Data\Titanium\modules\android\facebook\6.2.0
[DEBUG] Detected android module: facebook 7.0.0 @ C:\ProgramData\Application Data\Titanium\modules\android\facebook\7.0.0
[DEBUG] Detected android module: facebook 7.1.0 @ C:\ProgramData\Application Data\Titanium\modules\android\facebook\7.1.0
[DEBUG] Detected android module: facebook 7.2.0 @ C:\ProgramData\Application Data\Titanium\modules\android\facebook\7.2.0
[DEBUG] Detected android module: hyperloop 1.2.8 @ C:\ProgramData\Application Data\Titanium\modules\android\hyperloop\1.2.8
[DEBUG] Detected android module: hyperloop 2.1.3 @ C:\ProgramData\Application Data\Titanium\modules\android\hyperloop\2.1.3
[DEBUG] Detected android module: hyperloop 2.2.0 @ C:\ProgramData\Application Data\Titanium\modules\android\hyperloop\2.2.0
[DEBUG] Detected android module: hyperloop 2.2.1 @ C:\ProgramData\Application Data\Titanium\modules\android\hyperloop\2.2.1
[DEBUG] Detected android module: hyperloop 2.2.2 @ C:\ProgramData\Application Data\Titanium\modules\android\hyperloop\2.2.2
[DEBUG] Detected android module: hyperloop 3.0.0 @ C:\ProgramData\Application Data\Titanium\modules\android\hyperloop\3.0.0
[DEBUG] Detected android module: hyperloop 3.0.1 @ C:\ProgramData\Application Data\Titanium\modules\android\hyperloop\3.0.1
[DEBUG] Detected android module: hyperloop 3.0.2 @ C:\ProgramData\Application Data\Titanium\modules\android\hyperloop\3.0.2
[DEBUG] Detected android module: hyperloop 3.0.3 @ C:\ProgramData\Application Data\Titanium\modules\android\hyperloop\3.0.3
[DEBUG] Detected android module: hyperloop 3.0.4 @ C:\ProgramData\Application Data\Titanium\modules\android\hyperloop\3.0.4
[DEBUG] Detected android module: hyperloop 3.0.5 @ C:\ProgramData\Application Data\Titanium\modules\android\hyperloop\3.0.5
[DEBUG] Detected android module: ti.cloudpush 4.0.3 @ C:\ProgramData\Application Data\Titanium\modules\android\ti.cloudpush\4.0.3
[DEBUG] Detected android module: ti.cloudpush 4.0.4 @ C:\ProgramData\Application Data\Titanium\modules\android\ti.cloudpush\4.0.4
[DEBUG] Detected android module: ti.cloudpush 5.0.0 @ C:\ProgramData\Application Data\Titanium\modules\android\ti.cloudpush\5.0.0
[DEBUG] Detected android module: ti.cloudpush 5.0.1 @ C:\ProgramData\Application Data\Titanium\modules\android\ti.cloudpush\5.0.1
[DEBUG] Detected android module: ti.cloudpush 5.0.2 @ C:\ProgramData\Application Data\Titanium\modules\android\ti.cloudpush\5.0.2
[DEBUG] Detected android module: ti.cloudpush 5.1.0 @ C:\ProgramData\Application Data\Titanium\modules\android\ti.cloudpush\5.1.0
[DEBUG] Detected android module: ti.identity 1.0.0 @ C:\ProgramData\Application Data\Titanium\modules\android\ti.identity\1.0.0
[DEBUG] Detected android module: ti.identity 2.0.0 @ C:\ProgramData\Application Data\Titanium\modules\android\ti.identity\2.0.0
[DEBUG] Detected android module: ti.identity 2.1.0 @ C:\ProgramData\Application Data\Titanium\modules\android\ti.identity\2.1.0
[DEBUG] Detected android module: ti.map 3.0.1 @ C:\ProgramData\Application Data\Titanium\modules\android\ti.map\3.0.1
[DEBUG] Detected android module: ti.map 3.3.0 @ C:\ProgramData\Application Data\Titanium\modules\android\ti.map\3.3.0
[DEBUG] Detected android module: ti.map 3.3.1 @ C:\ProgramData\Application Data\Titanium\modules\android\ti.map\3.3.1
[DEBUG] Detected android module: ti.map 4.0.0 @ C:\ProgramData\Application Data\Titanium\modules\android\ti.map\4.0.0
[DEBUG] Detected android module: ti.map 4.1.1 @ C:\ProgramData\Application Data\Titanium\modules\android\ti.map\4.1.1
[DEBUG] Detected android module: ti.map 4.2.0 @ C:\ProgramData\Application Data\Titanium\modules\android\ti.map\4.2.0
[DEBUG] Detected android module: ti.playservices 11.0.40 @ C:\ProgramData\Application Data\Titanium\modules\android\ti.playservices\11.0.40
[DEBUG] Detected android module: ti.touchid 2.0.1 @ C:\ProgramData\Application Data\Titanium\modules\android\ti.touchid\2.0.1
[DEBUG] Detected android module: ti.touchid 2.2.0 @ C:\ProgramData\Application Data\Titanium\modules\android\ti.touchid\2.2.0
[DEBUG] Detected android module: ti.touchid 3.0.0 @ C:\ProgramData\Application Data\Titanium\modules\android\ti.touchid\3.0.0
[DEBUG] Detected android module: ti.touchid 3.0.1 @ C:\ProgramData\Application Data\Titanium\modules\android\ti.touchid\3.0.1
[DEBUG] Detected android module: ti.webdialog 1.1.0 @ C:\ProgramData\Application Data\Titanium\modules\android\ti.webdialog\1.1.0
[DEBUG] Detected commonjs module: ti.cloud 3.2.11 @ C:\ProgramData\Application Data\Titanium\modules\commonjs\ti.cloud\3.2.11
[DEBUG] Detected iphone module: hyperloop 3.0.5 @ C:\ProgramData\Application Data\Titanium\modules\iphone\hyperloop\3.0.5
[DEBUG] Detected windows module: com.appc.modder 1.0.0 @ C:\ProgramData\Application Data\Titanium\modules\windows\com.appc.modder\1.0.0
[DEBUG] Detected windows module: com.appc.modwin 1.0.0 @ C:\ProgramData\Application Data\Titanium\modules\windows\com.appc.modwin\1.0.0
[DEBUG] Detected windows module: com.appc.smoke 1.0.0 @ C:\ProgramData\Application Data\Titanium\modules\windows\com.appc.smoke\1.0.0
[DEBUG] Detected windows module: hyperloop 2.1.3 @ C:\ProgramData\Application Data\Titanium\modules\windows\hyperloop\2.1.3
[DEBUG] Detected windows module: hyperloop 2.2.0 @ C:\ProgramData\Application Data\Titanium\modules\windows\hyperloop\2.2.0
[DEBUG] Detected windows module: hyperloop 2.2.1 @ C:\ProgramData\Application Data\Titanium\modules\windows\hyperloop\2.2.1
[DEBUG] Detected windows module: hyperloop 2.2.2 @ C:\ProgramData\Application Data\Titanium\modules\windows\hyperloop\2.2.2
[DEBUG] Detected windows module: hyperloop 3.0.0 @ C:\ProgramData\Application Data\Titanium\modules\windows\hyperloop\3.0.0
[DEBUG] Detected windows module: hyperloop 3.0.1 @ C:\ProgramData\Application Data\Titanium\modules\windows\hyperloop\3.0.1
[DEBUG] Detected windows module: hyperloop 3.0.2 @ C:\ProgramData\Application Data\Titanium\modules\windows\hyperloop\3.0.2
[DEBUG] Detected windows module: hyperloop 3.0.3 @ C:\ProgramData\Application Data\Titanium\modules\windows\hyperloop\3.0.3
[DEBUG] Detected windows module: hyperloop 3.0.4 @ C:\ProgramData\Application Data\Titanium\modules\windows\hyperloop\3.0.4
[DEBUG] Detected windows module: hyperloop 3.0.5 @ C:\ProgramData\Application Data\Titanium\modules\windows\hyperloop\3.0.5
[DEBUG] Detected windows module: hyperloop 3.1.0 @ C:\ProgramData\Application Data\Titanium\modules\windows\hyperloop\3.1.0
[DEBUG] Detected windows module: ti.paint 2.0.0 @ C:\ProgramData\Application Data\Titanium\modules\windows\ti.paint\2.0.0
[DEBUG] Detected windows module: ti.paint 3.0.0 @ C:\ProgramData\Application Data\Titanium\modules\windows\ti.paint\3.0.0
[DEBUG] Detected windows module: ti.paint 3.1.0 @ C:\ProgramData\Application Data\Titanium\modules\windows\ti.paint\3.1.0
[DEBUG] Detected windows module: ti.xaml.listview 1.1.0 @ C:\ProgramData\Application Data\Titanium\modules\windows\ti.xaml.listview\1.1.0
[DEBUG] Detecting modules in C:\ProgramData\Titanium\modules
[DEBUG] Detected android module: com.appc.mod 1.0.0 @ C:\ProgramData\Titanium\modules\android\com.appc.mod\1.0.0
[DEBUG] Detected android module: com.appcelerator.apm 1.1.5 @ C:\ProgramData\Titanium\modules\android\com.appcelerator.apm\1.1.5
[DEBUG] Detected android module: com.appcelerator.apm 2.0.0 @ C:\ProgramData\Titanium\modules\android\com.appcelerator.apm\2.0.0
[DEBUG] Detected android module: com.appcelerator.apm 3.0.0 @ C:\ProgramData\Titanium\modules\android\com.appcelerator.apm\3.0.0
[DEBUG] Detected android module: com.appcelerator.apm 3.1.0 @ C:\ProgramData\Titanium\modules\android\com.appcelerator.apm\3.1.0
[DEBUG] Detected android module: com.appcelerator.apm 3.1.1 @ C:\ProgramData\Titanium\modules\android\com.appcelerator.apm\3.1.1
[DEBUG] Detected android module: com.appcelerator.apm 3.1.2 @ C:\ProgramData\Titanium\modules\android\com.appcelerator.apm\3.1.2
[DEBUG] Detected android module: facebook 6.0.1 @ C:\ProgramData\Titanium\modules\android\facebook\6.0.1
[DEBUG] Detected android module: facebook 6.2.0 @ C:\ProgramData\Titanium\modules\android\facebook\6.2.0
[DEBUG] Detected android module: facebook 7.0.0 @ C:\ProgramData\Titanium\modules\android\facebook\7.0.0
[DEBUG] Detected android module: facebook 7.1.0 @ C:\ProgramData\Titanium\modules\android\facebook\7.1.0
[DEBUG] Detected android module: facebook 7.2.0 @ C:\ProgramData\Titanium\modules\android\facebook\7.2.0
[DEBUG] Detected android module: hyperloop 1.2.8 @ C:\ProgramData\Titanium\modules\android\hyperloop\1.2.8
[DEBUG] Detected android module: hyperloop 2.1.3 @ C:\ProgramData\Titanium\modules\android\hyperloop\2.1.3
[DEBUG] Detected android module: hyperloop 2.2.0 @ C:\ProgramData\Titanium\modules\android\hyperloop\2.2.0
[DEBUG] Detected android module: hyperloop 2.2.1 @ C:\ProgramData\Titanium\modules\android\hyperloop\2.2.1
[DEBUG] Detected android module: hyperloop 2.2.2 @ C:\ProgramData\Titanium\modules\android\hyperloop\2.2.2
[DEBUG] Detected android module: hyperloop 3.0.0 @ C:\ProgramData\Titanium\modules\android\hyperloop\3.0.0
[DEBUG] Detected android module: hyperloop 3.0.1 @ C:\ProgramData\Titanium\modules\android\hyperloop\3.0.1
[DEBUG] Detected android module: hyperloop 3.0.2 @ C:\ProgramData\Titanium\modules\android\hyperloop\3.0.2
[DEBUG] Detected android module: hyperloop 3.0.3 @ C:\ProgramData\Titanium\modules\android\hyperloop\3.0.3
[DEBUG] Detected android module: hyperloop 3.0.4 @ C:\ProgramData\Titanium\modules\android\hyperloop\3.0.4
[DEBUG] Detected android module: hyperloop 3.0.5 @ C:\ProgramData\Titanium\modules\android\hyperloop\3.0.5
[DEBUG] Detected android module: ti.cloudpush 4.0.3 @ C:\ProgramData\Titanium\modules\android\ti.cloudpush\4.0.3
[DEBUG] Detected android module: ti.cloudpush 4.0.4 @ C:\ProgramData\Titanium\modules\android\ti.cloudpush\4.0.4
[DEBUG] Detected android module: ti.cloudpush 5.0.0 @ C:\ProgramData\Titanium\modules\android\ti.cloudpush\5.0.0
[DEBUG] Detected android module: ti.cloudpush 5.0.1 @ C:\ProgramData\Titanium\modules\android\ti.cloudpush\5.0.1
[DEBUG] Detected android module: ti.cloudpush 5.0.2 @ C:\ProgramData\Titanium\modules\android\ti.cloudpush\5.0.2
[DEBUG] Detected android module: ti.cloudpush 5.1.0 @ C:\ProgramData\Titanium\modules\android\ti.cloudpush\5.1.0
[DEBUG] Detected android module: ti.identity 1.0.0 @ C:\ProgramData\Titanium\modules\android\ti.identity\1.0.0
[DEBUG] Detected android module: ti.identity 2.0.0 @ C:\ProgramData\Titanium\modules\android\ti.identity\2.0.0
[DEBUG] Detected android module: ti.identity 2.1.0 @ C:\ProgramData\Titanium\modules\android\ti.identity\2.1.0
[DEBUG] Detected android module: ti.map 3.0.1 @ C:\ProgramData\Titanium\modules\android\ti.map\3.0.1
[DEBUG] Detected android module: ti.map 3.3.0 @ C:\ProgramData\Titanium\modules\android\ti.map\3.3.0
[DEBUG] Detected android module: ti.map 3.3.1 @ C:\ProgramData\Titanium\modules\android\ti.map\3.3.1
[DEBUG] Detected android module: ti.map 4.0.0 @ C:\ProgramData\Titanium\modules\android\ti.map\4.0.0
[DEBUG] Detected android module: ti.map 4.1.1 @ C:\ProgramData\Titanium\modules\android\ti.map\4.1.1
[DEBUG] Detected android module: ti.map 4.2.0 @ C:\ProgramData\Titanium\modules\android\ti.map\4.2.0
[DEBUG] Detected android module: ti.playservices 11.0.40 @ C:\ProgramData\Titanium\modules\android\ti.playservices\11.0.40
[DEBUG] Detected android module: ti.touchid 2.0.1 @ C:\ProgramData\Titanium\modules\android\ti.touchid\2.0.1
[DEBUG] Detected android module: ti.touchid 2.2.0 @ C:\ProgramData\Titanium\modules\android\ti.touchid\2.2.0
[DEBUG] Detected android module: ti.touchid 3.0.0 @ C:\ProgramData\Titanium\modules\android\ti.touchid\3.0.0
[DEBUG] Detected android module: ti.touchid 3.0.1 @ C:\ProgramData\Titanium\modules\android\ti.touchid\3.0.1
[DEBUG] Detected android module: ti.webdialog 1.1.0 @ C:\ProgramData\Titanium\modules\android\ti.webdialog\1.1.0
[DEBUG] Detected commonjs module: ti.cloud 3.2.11 @ C:\ProgramData\Titanium\modules\commonjs\ti.cloud\3.2.11
[DEBUG] Detected iphone module: hyperloop 3.0.5 @ C:\ProgramData\Titanium\modules\iphone\hyperloop\3.0.5
[DEBUG] Detected windows module: com.appc.modder 1.0.0 @ C:\ProgramData\Titanium\modules\windows\com.appc.modder\1.0.0
[DEBUG] Detected windows module: com.appc.modwin 1.0.0 @ C:\ProgramData\Titanium\modules\windows\com.appc.modwin\1.0.0
[DEBUG] Detected windows module: com.appc.smoke 1.0.0 @ C:\ProgramData\Titanium\modules\windows\com.appc.smoke\1.0.0
[DEBUG] Detected windows module: hyperloop 2.1.3 @ C:\ProgramData\Titanium\modules\windows\hyperloop\2.1.3
[DEBUG] Detected windows module: hyperloop 2.2.0 @ C:\ProgramData\Titanium\modules\windows\hyperloop\2.2.0
[DEBUG] Detected windows module: hyperloop 2.2.1 @ C:\ProgramData\Titanium\modules\windows\hyperloop\2.2.1
[DEBUG] Detected windows module: hyperloop 2.2.2 @ C:\ProgramData\Titanium\modules\windows\hyperloop\2.2.2
[DEBUG] Detected windows module: hyperloop 3.0.0 @ C:\ProgramData\Titanium\modules\windows\hyperloop\3.0.0
[DEBUG] Detected windows module: hyperloop 3.0.1 @ C:\ProgramData\Titanium\modules\windows\hyperloop\3.0.1
[DEBUG] Detected windows module: hyperloop 3.0.2 @ C:\ProgramData\Titanium\modules\windows\hyperloop\3.0.2
[DEBUG] Detected windows module: hyperloop 3.0.3 @ C:\ProgramData\Titanium\modules\windows\hyperloop\3.0.3
[DEBUG] Detected windows module: hyperloop 3.0.4 @ C:\ProgramData\Titanium\modules\windows\hyperloop\3.0.4
[DEBUG] Detected windows module: hyperloop 3.0.5 @ C:\ProgramData\Titanium\modules\windows\hyperloop\3.0.5
[DEBUG] Detected windows module: hyperloop 3.1.0 @ C:\ProgramData\Titanium\modules\windows\hyperloop\3.1.0
[DEBUG] Detected windows module: ti.paint 2.0.0 @ C:\ProgramData\Titanium\modules\windows\ti.paint\2.0.0
[DEBUG] Detected windows module: ti.paint 3.0.0 @ C:\ProgramData\Titanium\modules\windows\ti.paint\3.0.0
[DEBUG] Detected windows module: ti.paint 3.1.0 @ C:\ProgramData\Titanium\modules\windows\ti.paint\3.1.0
[DEBUG] Detected windows module: ti.xaml.listview 1.1.0 @ C:\ProgramData\Titanium\modules\windows\ti.xaml.listview\1.1.0
[DEBUG] Looking for Titanium module id=ti.cloud version=latest platform=commonjs deploy-type=test
[INFO] Found Titanium module id=ti.cloud version=3.2.11 platform=commonjs deploy-type=test path=C:\ProgramData\Application Data\Titanium\modules\commonjs\ti.cloud\3.2.11
[DEBUG] Detecting plugins in C:\Users\Josh\appc\deviceTest\plugins
[DEBUG] Detected plugin: ti.alloy @ C:\Users\Josh\appc\deviceTest\plugins\ti.alloy
[DEBUG] Detecting plugins in C:\ProgramData\Titanium\plugins
[DEBUG] Detected plugin: com.appcelerator.test @ C:\ProgramData\Titanium\plugins\com.appcelerator.test
[DEBUG] Detected plugin: hyperloop 1.2.8 @ C:\ProgramData\Titanium\plugins\hyperloop\1.2.8
[DEBUG] Detected plugin: hyperloop 2.1.3 @ C:\ProgramData\Titanium\plugins\hyperloop\2.1.3
[DEBUG] Detected plugin: hyperloop 2.2.0 @ C:\ProgramData\Titanium\plugins\hyperloop\2.2.0
[DEBUG] Detected plugin: hyperloop 2.2.1 @ C:\ProgramData\Titanium\plugins\hyperloop\2.2.1
[DEBUG] Detected plugin: hyperloop 2.2.2 @ C:\ProgramData\Titanium\plugins\hyperloop\2.2.2
[DEBUG] Detected plugin: ti.es6 1.1.0 @ C:\ProgramData\Titanium\plugins\ti.es6\1.1.0
[DEBUG] Detecting plugins in C:\ProgramData\Application Data\Titanium\plugins
[DEBUG] Detected plugin: com.appcelerator.test @ C:\ProgramData\Application Data\Titanium\plugins\com.appcelerator.test
[DEBUG] Detected plugin: hyperloop 1.2.8 @ C:\ProgramData\Application Data\Titanium\plugins\hyperloop\1.2.8
[DEBUG] Detected plugin: hyperloop 2.1.3 @ C:\ProgramData\Application Data\Titanium\plugins\hyperloop\2.1.3
[DEBUG] Detected plugin: hyperloop 2.2.0 @ C:\ProgramData\Application Data\Titanium\plugins\hyperloop\2.2.0
[DEBUG] Detected plugin: hyperloop 2.2.1 @ C:\ProgramData\Application Data\Titanium\plugins\hyperloop\2.2.1
[DEBUG] Detected plugin: hyperloop 2.2.2 @ C:\ProgramData\Application Data\Titanium\plugins\hyperloop\2.2.2
[DEBUG] Detected plugin: ti.es6 1.1.0 @ C:\ProgramData\Application Data\Titanium\plugins\ti.es6\1.1.0
[DEBUG] Looking for Titanium plugin id=ti.alloy version=1.0
[INFO] Found Titanium plugin id=ti.alloy version=1.0
[INFO] Building for Windows Phone device: 00000015-d0d8-1ced-0000-000000000000
[DEBUG] CMake generator name: Visual Studio 15 2017
[DEBUG] CMAKE_SYSTEM_NAME: WindowsStore
[DEBUG] CMAKE_SYSTEM_VERSION: 10.0
[DEBUG] Titanium SDK Windows directory: C:\ProgramData\Titanium\mobilesdk\win32\7.3.0.v20180618062809\windows
[INFO] Deploy type: test
[INFO] Debugging disabled
[INFO] Profiler disabled
[INFO] Forcing rebuild: C:\Users\Josh\.titanium\vsbuild\deviceTest\build-manifest.json does not exist
[INFO] Found Alloy app in C:\Users\Josh\appc\deviceTest\app
[INFO] Executing Alloy compile: C:\Program Files (x86)\nodejs\node.exe C:\Users\Josh\.appcelerator\install\7.0.4\package\node_modules\alloy\bin\alloy compile C:\Users\Josh\appc\deviceTest\app --config platform=windows,version=0,simtype=none,devicefamily=none,deploytype=test,target=wp-device
[DEBUG] .__ .__
[DEBUG] _____ | | | | ____ ___.__.
[DEBUG] \__ \ | | | | / _ < | |
[DEBUG] / __ \| |_| |_( <_> )___ |
[DEBUG] (____ /____/____/\____// ____|
[DEBUG] \/ \/
[DEBUG] Alloy 1.12.0 by Appcelerator. The MVC app framework for Titanium.
[DEBUG]
[DEBUG] ----- CONFIGURATION -----
[DEBUG] raw config = "platform=windows,version=0,simtype=none,devicefamily=none,deploytype=test,target=wp-device"
[DEBUG] platform = windows
[DEBUG] version = 0
[DEBUG] simtype = none
[DEBUG] devicefamily = none
[DEBUG] deploytype = test
[DEBUG] target = wp-device
[DEBUG] project path = C:\Users\Josh\appc\deviceTest
[DEBUG] app path = C:\Users\Josh\appc\deviceTest\app
[DEBUG]
[DEBUG] ----- CONFIG.JSON -----
[DEBUG] dependencies = {}
[INFO] [config.json] regenerating CFG.js from config.json...
[DEBUG] {
[DEBUG] "dependencies": {},
[DEBUG] "sourcemap": true,
[DEBUG] "autoStyle": false,
[DEBUG] "adapters": [
[DEBUG] "localStorage",
[DEBUG] "properties",
[DEBUG] "sql"
[DEBUG] ]
[DEBUG] }
[DEBUG]
[DEBUG] ----- CLEANING RESOURCES -----
[DEBUG] Removing orphaned controllers ...
[DEBUG] Removing orphaned models ...
[DEBUG] Removing orphaned styles ...
[DEBUG] Removing orphaned sync adapters...
[DEBUG] Removing orphaned assets and libs...
[TRACE] * assets/
[TRACE] * windows/alloy/
[DEBUG]
[DEBUG] ----- BASE RUNTIME FILES -----
[TRACE] SRC_DIR=C:\Users\Josh\.appcelerator\install\7.0.4\package\node_modules\alloy\Alloy\lib
[TRACE] Copying SRC_DIR\alloy\widget.js --> Resources\windows\alloy\widget.js
[TRACE] Copying SRC_DIR\alloy\underscore.js --> Resources\windows\alloy\underscore.js
[TRACE] Copying SRC_DIR\alloy\sync\sql.js --> Resources\windows\alloy\sync\sql.js
[TRACE] Copying SRC_DIR\alloy\sync\properties.js --> Resources\windows\alloy\sync\properties.js
[TRACE] Copying SRC_DIR\alloy\sync\localStorage.js --> Resources\windows\alloy\sync\localStorage.js
[TRACE] Copying SRC_DIR\alloy\controllers\BaseController.js --> Resources\windows\alloy\controllers\BaseController.js
[TRACE]
[TRACE] Generating ..\Resources\windows\alloy.js
[TRACE] SRC_DIR=C:\Users\Josh\.appcelerator\install\7.0.4\package\node_modules\alloy\Alloy\common
[TRACE] Copying SRC_DIR\constants.js --> Resources\windows\alloy\constants.js
[TRACE]
[TRACE] SRC_DIR=C:\Users\Josh\appc\deviceTest\app\assets
[TRACE] Copying SRC_DIR\windows\appicon.png --> Resources\windows\appicon.png
[TRACE]
[DEBUG]
[DEBUG]
[INFO] ----- MVC GENERATION -----
[INFO] [app.tss] global style processing...
[INFO] [global style] writing to cache...
[INFO] [index.xml] view processing...
[INFO] style: "index.tss"
[INFO] view: "index.xml"
[INFO] controller: "index.js"
[INFO] created: "Resources\windows\alloy\controllers\index.js"
[INFO] created: "Resources\windows\alloy\styles\index.js"
[INFO]
[INFO] [app.js] Titanium entry point processing...
[INFO] created: "Resources\windows\app.js"
[INFO]
[INFO] ----- OPTIMIZING -----
[INFO] - windows/alloy.js
[INFO] - windows/alloy/sync/localStorage.js
[INFO] - windows/alloy/sync/properties.js
[INFO] - windows/alloy/sync/sql.js
[TRACE]
[TRACE] Benchmarking
[TRACE] ------------
[TRACE] [0.42595s] TOTAL
[INFO]
[INFO] Alloy compiled in 0.42595s
[INFO] Alloy compiler completed successfully
[DEBUG] Log relay listening on port 8666 on 169.254.80.80, 172.16.80.1, 192.168.0.11, 172.31.9.161
[INFO] Using existing temporary pfx
[TRACE] offline build file C:\Users\Josh\AppData\Local\Temp\build-8aa2ca7cfdff89e0e42685b54648efbebeb76577.json
[TRACE] online 1
[TRACE] sending request {"json":{"username":"jlongton@axway.com","session":"bddbe01dde50ef7153276c462ea9d75f14a4a001 1VKJV2sRtQw+yotDko8h9YA/Lf2ntrPrdWuoG/a6zbueol386GYvqkohD4jqL93mZxgOZXYD7DRXFiDAdVnINqFOJTZvq4LEVtDIW7iToRycgjLlUrotpvb1xHj5o8y/hVIyKn3bXsQhrJwoVonXX9itmThpEbRbkEvtKl+H8ksm8cdakqM8kv+IYOmGQ8T1Aao0BovKzdQ6nWnLCaOp/fSN7FCDcM6HLzGbvikvzt7DTQT5ntJV/tlfbIK3cN3K9h20NLBvQmssGVn2oOEgW+Y6Y+rBQa5AddfFFgDfiCjgn5+smpNSa2QzOKFzhW7X4JxcsJHggS9B/vslsM4n3IGHWSwTJpxaOVn+GcpdUAoRSgjb+9KhJMLZ5i8ZW7k0YSbJKmVAx8Uzwq16hd91BiQaSKVeXSZl/880061Ise64xfFS5tmUXeqS7VpOTAn9iguwunsH/UEqRcLW3TJWioPxzTLY/yBPgzSoDB5QzyQw9YRM99H+4GsL0jxR5+6kzbrm7Up0fodxIUfs8NQaqxRgKRmSwITfDF03pc3cDq5Ecwqe+A79IIUJ8hYudwid/QQMrFhLJDaXDDZXZzd2Xo7xdi2IRDAZRE/vA/Qy1H/3UTGZPNhmc90tbieiyBj2E1a/bw5TlGbJIF26ljwcvemySqQ/hxiEmkFe6YOJWJpQF8j6l1eIW09e+9IwNwmLhFk4OyKteJeJ46UFeey0Ow==","ipaddress":"169.254.80.80","fingerprint":"61d948f777821e064d758acf32716b0449f663a6","fingerprint_description":"Windows Machine ID: baf7c630-eb97-4701-b171-3569c3992453","guid":"fa7f98b1-18c9-4e2a-9fff-0d5d0c846d97","appid":"com.appc.dev","name":"deviceTest","org_id":100000675,"deploytype":"test","tiappxml":"<?xml version=\"1.0\" encoding=\"UTF-8\"?>\n<ti:app \n xmlns:ti=\"http://ti.appcelerator.org\">\n <id>com.appc.dev</id>\n <name>deviceTest</name>\n <version>1.0</version>\n <publisher>not specified</publisher>\n <url>unspecified</url>\n <description/>\n <copyright>not specified</copyright>\n <icon>appicon.png</icon>\n <fullscreen>false</fullscreen>\n <navbar-hidden>false</navbar-hidden>\n <analytics>true</analytics>\n <guid>fa7f98b1-18c9-4e2a-9fff-0d5d0c846d97</guid>\n <property name=\"ti.ui.defaultunit\" type=\"string\">dp</property>\n <property name=\"run-on-main-thread\" type=\"bool\">***</property>\n <ios>\n <enable-launch-screen-storyboard>true</enable-launch-screen-storyboard>\n <use-app-thinning>true</use-app-thinning>\n <plist>\n <dict>\n <key>UISupportedInterfaceOrientations~iphone</key>\n <array>\n <string>UIInterfaceOrientationPortrait</string>\n </array>\n <key>UISupportedInterfaceOrientations~ipad</key>\n <array>\n <string>UIInterfaceOrientationPortrait</string>\n <string>UIInterfaceOrientationPortraitUpsideDown</string>\n <string>UIInterfaceOrientationLandscapeLeft</string>\n <string>UIInterfaceOrientationLandscapeRight</string>\n </array>\n <key>UIRequiresPersistentWiFi</key>\n <false/>\n <key>UIPrerenderedIcon</key>\n <false/>\n <key>UIStatusBarHidden</key>\n <false/>\n <key>UIStatusBarStyle</key>\n <string>UIStatusBarStyleDefault</string>\n </dict>\n </plist>\n </ios>\n <android \n xmlns:android=\"http://schemas.android.com/apk/res/android\">\n </android>\n <modules>\n <module platform=\"android\">hyperloop</module>\n <module platform=\"commonjs\">ti.cloud</module>\n <module platform=\"android\">com.appcelerator.apm</module>\n </modules>\n <deployment-targets>\n <target device=\"android\">true</target>\n <target device=\"windows\">true</target>\n </deployment-targets>\n <sdk-version>7.3.0.v20180618062809</sdk-version>\n <plugins>\n <plugin version=\"1.0\">ti.alloy</plugin>\n </plugins>\n <property name=\"appc-app-id\" type=\"string\">5b290cefb6dc51186eb17ea0</property>\n <property name=\"acs-authbase-url-development\" type=\"string\">***</property>\n <property name=\"acs-base-url-development\" type=\"string\">***</property>\n <property name=\"acs-oauth-secret-development\" type=\"string\">***</property>\n <property name=\"acs-oauth-key-development\" type=\"string\">***</property>\n <property name=\"acs-api-key-development\" type=\"string\">***</property>\n <property name=\"acs-username-development\" type=\"string\">***</property>\n <property name=\"acs-password-development\" type=\"string\">***</property>\n <property name=\"acs-authbase-url-production\" type=\"string\">***</property>\n <property name=\"acs-base-url-production\" type=\"string\">***</property>\n <property name=\"acs-oauth-secret-production\" type=\"string\">***</property>\n <property name=\"acs-oauth-key-production\" type=\"string\">***</property>\n <property name=\"acs-api-key-production\" type=\"string\">***</property>\n <property name=\"acs-username-production\" type=\"string\">***</property>\n <property name=\"acs-password-production\" type=\"string\">***</property>\n <property name=\"appc-org-id\" type=\"string\">100000675</property>\n <property name=\"appc-creator-user-id\" type=\"string\">284d4909-dad3-4b57-8bee-0fb4b6a43747</property>\n <property name=\"com-appcelerator-apm-id\" type=\"string\">***</property>\n</ti:app>","modules":[{"id":"ti.cloud","platform":["commonjs"],"deployType":["test"],"modulePath":"C:\\ProgramData\\Application Data\\Titanium\\modules\\commonjs\\ti.cloud\\3.2.11","version":"3.2.11","manifest":{"version":"3.2.11","description":"Appcelerator Cloud Services","author":"Dawson Toth, Jeff English, Jon Alter, Paul Lv, Michael Goff, and Pedro Enrique","license":"Appcelerator Commercial License","copyright":"Copyright (c) 2011-2014 by Appcelerator, Inc.","name":"ti.cloud","moduleid":"ti.cloud","guid":"1056b5d2-2bb5-4339-b930-297637aeec4e","platform":"commonjs","minsdk":"2.1.0"}}]},"gzip":true,"followAllRedirects":true,"url":"https://platform.axway.com/api/v1/auth/build-verify"}
[TRACE] result from /build-verify=> {"key":"bprAxkE0D2cvSO6NMVXZ+g==","pepper":"hl4FQh4idah/6ELi5Kqk4A==","hmacKey":"AfbqLj8ZhZ1rXyAOSYMKSQ==","o":100000675,"u":"284d4909-dad3-4b57-8bee-0fb4b6a43747","p":"enterprise","i":"5b290d67b6dc51186eb17eac","success":true}, err=null
[INFO] JavaScript files need to be encrypted
[DEBUG] Copying C:\ProgramData\Titanium\mobilesdk\win32\7.3.0.v20180618062809\windows\templates\build\Assets\SplashScreen.scale-100.png => C:\Users\Josh\.titanium\vsbuild\deviceTest\Assets\SplashScreen.scale-100.png
[DEBUG] Copying C:\ProgramData\Titanium\mobilesdk\win32\7.3.0.v20180618062809\windows\templates\build\Assets\SplashScreen.scale-200.png => C:\Users\Josh\.titanium\vsbuild\deviceTest\Assets\SplashScreen.scale-200.png
[DEBUG] Copying C:\ProgramData\Titanium\mobilesdk\win32\7.3.0.v20180618062809\windows\templates\build\Assets\SplashScreen.scale-240.png => C:\Users\Josh\.titanium\vsbuild\deviceTest\Assets\SplashScreen.scale-240.png
[DEBUG] Copying C:\ProgramData\Titanium\mobilesdk\win32\7.3.0.v20180618062809\windows\templates\build\Assets\SplashScreen.scale-400.png => C:\Users\Josh\.titanium\vsbuild\deviceTest\Assets\SplashScreen.scale-400.png
[DEBUG] Copying C:\ProgramData\Titanium\mobilesdk\win32\7.3.0.v20180618062809\windows\templates\build\Assets\SplashScreen480x800.png => C:\Users\Josh\.titanium\vsbuild\deviceTest\Assets\SplashScreen480x800.png
[DEBUG] Copying C:\ProgramData\Titanium\mobilesdk\win32\7.3.0.v20180618062809\windows\templates\build\cmake\FindHAL.cmake => C:\Users\Josh\.titanium\vsbuild\deviceTest\cmake\FindHAL.cmake
[DEBUG] Copying C:\ProgramData\Titanium\mobilesdk\win32\7.3.0.v20180618062809\windows\templates\build\cmake\FindJavaScriptCore.cmake => C:\Users\Josh\.titanium\vsbuild\deviceTest\cmake\FindJavaScriptCore.cmake
[DEBUG] Copying C:\ProgramData\Titanium\mobilesdk\win32\7.3.0.v20180618062809\windows\templates\build\cmake\FindLayoutEngine.cmake => C:\Users\Josh\.titanium\vsbuild\deviceTest\cmake\FindLayoutEngine.cmake
[DEBUG] Copying C:\ProgramData\Titanium\mobilesdk\win32\7.3.0.v20180618062809\windows\templates\build\cmake\FindNativeModule.cmake.ejs => C:\Users\Josh\.titanium\vsbuild\deviceTest\cmake\FindNativeModule.cmake.ejs
[DEBUG] Copying C:\ProgramData\Titanium\mobilesdk\win32\7.3.0.v20180618062809\windows\templates\build\cmake\FindTitaniumKit.cmake => C:\Users\Josh\.titanium\vsbuild\deviceTest\cmake\FindTitaniumKit.cmake
[DEBUG] Copying C:\ProgramData\Titanium\mobilesdk\win32\7.3.0.v20180618062809\windows\templates\build\cmake\FindTitaniumWindows.cmake => C:\Users\Josh\.titanium\vsbuild\deviceTest\cmake\FindTitaniumWindows.cmake
[DEBUG] Copying C:\ProgramData\Titanium\mobilesdk\win32\7.3.0.v20180618062809\windows\templates\build\cmake\FindTitaniumWindows_Filesystem.cmake => C:\Users\Josh\.titanium\vsbuild\deviceTest\cmake\FindTitaniumWindows_Filesystem.cmake
[DEBUG] Copying C:\ProgramData\Titanium\mobilesdk\win32\7.3.0.v20180618062809\windows\templates\build\cmake\FindTitaniumWindows_Global.cmake => C:\Users\Josh\.titanium\vsbuild\deviceTest\cmake\FindTitaniumWindows_Global.cmake
[DEBUG] Copying C:\ProgramData\Titanium\mobilesdk\win32\7.3.0.v20180618062809\windows\templates\build\cmake\FindTitaniumWindows_Map.cmake => C:\Users\Josh\.titanium\vsbuild\deviceTest\cmake\FindTitaniumWindows_Map.cmake
[DEBUG] Copying C:\ProgramData\Titanium\mobilesdk\win32\7.3.0.v20180618062809\windows\templates\build\cmake\FindTitaniumWindows_Media.cmake => C:\Users\Josh\.titanium\vsbuild\deviceTest\cmake\FindTitaniumWindows_Media.cmake
[DEBUG] Copying C:\ProgramData\Titanium\mobilesdk\win32\7.3.0.v20180618062809\windows\templates\build\cmake\FindTitaniumWindows_Network.cmake => C:\Users\Josh\.titanium\vsbuild\deviceTest\cmake\FindTitaniumWindows_Network.cmake
[DEBUG] Copying C:\ProgramData\Titanium\mobilesdk\win32\7.3.0.v20180618062809\windows\templates\build\cmake\FindTitaniumWindows_Sensors.cmake => C:\Users\Josh\.titanium\vsbuild\deviceTest\cmake\FindTitaniumWindows_Sensors.cmake
[DEBUG] Copying C:\ProgramData\Titanium\mobilesdk\win32\7.3.0.v20180618062809\windows\templates\build\cmake\FindTitaniumWindows_Ti.cmake => C:\Users\Josh\.titanium\vsbuild\deviceTest\cmake\FindTitaniumWindows_Ti.cmake
[DEBUG] Copying C:\ProgramData\Titanium\mobilesdk\win32\7.3.0.v20180618062809\windows\templates\build\cmake\FindTitaniumWindows_UI.cmake => C:\Users\Josh\.titanium\vsbuild\deviceTest\cmake\FindTitaniumWindows_UI.cmake
[DEBUG] Copying C:\ProgramData\Titanium\mobilesdk\win32\7.3.0.v20180618062809\windows\templates\build\cmake\FindTitaniumWindows_Utility.cmake => C:\Users\Josh\.titanium\vsbuild\deviceTest\cmake\FindTitaniumWindows_Utility.cmake
[DEBUG] Copying C:\ProgramData\Titanium\mobilesdk\win32\7.3.0.v20180618062809\windows\templates\build\cmake\internal_utils.cmake => C:\Users\Josh\.titanium\vsbuild\deviceTest\cmake\internal_utils.cmake
[DEBUG] Copying C:\ProgramData\Titanium\mobilesdk\win32\7.3.0.v20180618062809\windows\templates\build\CMakeLists.txt.ejs => C:\Users\Josh\.titanium\vsbuild\deviceTest\CMakeLists.txt.ejs
[DEBUG] Copying C:\ProgramData\Titanium\mobilesdk\win32\7.3.0.v20180618062809\windows\templates\build\include\OutputDebugStringBuf.hpp => C:\Users\Josh\.titanium\vsbuild\deviceTest\include\OutputDebugStringBuf.hpp
[DEBUG] Copying C:\ProgramData\Titanium\mobilesdk\win32\7.3.0.v20180618062809\windows\templates\build\include\pch.h => C:\Users\Josh\.titanium\vsbuild\deviceTest\include\pch.h
[DEBUG] Copying C:\ProgramData\Titanium\mobilesdk\win32\7.3.0.v20180618062809\windows\templates\build\Native\CMakeLists.txt.ejs => C:\Users\Josh\.titanium\vsbuild\deviceTest\Native\CMakeLists.txt.ejs
[DEBUG] Copying C:\ProgramData\Titanium\mobilesdk\win32\7.3.0.v20180618062809\windows\templates\build\Native\include\RequireHook.hpp => C:\Users\Josh\.titanium\vsbuild\deviceTest\Native\include\RequireHook.hpp
[DEBUG] Copying C:\ProgramData\Titanium\mobilesdk\win32\7.3.0.v20180618062809\windows\templates\build\Native\src\RequireHook.cpp.ejs => C:\Users\Josh\.titanium\vsbuild\deviceTest\Native\src\RequireHook.cpp.ejs
[DEBUG] Copying C:\ProgramData\Titanium\mobilesdk\win32\7.3.0.v20180618062809\windows\templates\build\Package.phone.appxmanifest.in.ejs => C:\Users\Josh\.titanium\vsbuild\deviceTest\Package.phone.appxmanifest.in.ejs
[DEBUG] Copying C:\ProgramData\Titanium\mobilesdk\win32\7.3.0.v20180618062809\windows\templates\build\Package.store.appxmanifest.in.ejs => C:\Users\Josh\.titanium\vsbuild\deviceTest\Package.store.appxmanifest.in.ejs
[DEBUG] Copying C:\ProgramData\Titanium\mobilesdk\win32\7.3.0.v20180618062809\windows\templates\build\Package.win10.appxmanifest.in.ejs => C:\Users\Josh\.titanium\vsbuild\deviceTest\Package.win10.appxmanifest.in.ejs
[DEBUG] Copying C:\ProgramData\Titanium\mobilesdk\win32\7.3.0.v20180618062809\windows\templates\build\Resources.resw => C:\Users\Josh\.titanium\vsbuild\deviceTest\Resources.resw
[DEBUG] Copying C:\ProgramData\Titanium\mobilesdk\win32\7.3.0.v20180618062809\windows\templates\build\src\main.cpp => C:\Users\Josh\.titanium\vsbuild\deviceTest\src\main.cpp
[DEBUG] Copying C:\ProgramData\Titanium\mobilesdk\win32\7.3.0.v20180618062809\windows\templates\build\TemporaryKey.pfx => C:\Users\Josh\.titanium\vsbuild\deviceTest\TemporaryKey.pfx
[DEBUG] Copying C:\ProgramData\Titanium\mobilesdk\win32\7.3.0.v20180618062809\windows\templates\build\TitaniumWindows_Hyperloop\bin\phone\Debug\TitaniumWindows_Hyperloop.winmd => C:\Users\Josh\.titanium\vsbuild\deviceTest\TitaniumWindows_Hyperloop\bin\phone\Debug\TitaniumWindows_Hyperloop.winmd
[DEBUG] Copying C:\ProgramData\Titanium\mobilesdk\win32\7.3.0.v20180618062809\windows\templates\build\TitaniumWindows_Hyperloop\bin\phone\Release\TitaniumWindows_Hyperloop.winmd => C:\Users\Josh\.titanium\vsbuild\deviceTest\TitaniumWindows_Hyperloop\bin\phone\Release\TitaniumWindows_Hyperloop.winmd
[DEBUG] Copying C:\ProgramData\Titanium\mobilesdk\win32\7.3.0.v20180618062809\windows\templates\build\TitaniumWindows_Hyperloop\bin\store\Debug\TitaniumWindows_Hyperloop.winmd => C:\Users\Josh\.titanium\vsbuild\deviceTest\TitaniumWindows_Hyperloop\bin\store\Debug\TitaniumWindows_Hyperloop.winmd
[DEBUG] Copying C:\ProgramData\Titanium\mobilesdk\win32\7.3.0.v20180618062809\windows\templates\build\TitaniumWindows_Hyperloop\bin\store\Release\TitaniumWindows_Hyperloop.winmd => C:\Users\Josh\.titanium\vsbuild\deviceTest\TitaniumWindows_Hyperloop\bin\store\Release\TitaniumWindows_Hyperloop.winmd
[DEBUG] Copying C:\ProgramData\Titanium\mobilesdk\win32\7.3.0.v20180618062809\windows\templates\build\TitaniumWindows_Hyperloop\bin\win10\Debug\TitaniumWindows_Hyperloop.winmd => C:\Users\Josh\.titanium\vsbuild\deviceTest\TitaniumWindows_Hyperloop\bin\win10\Debug\TitaniumWindows_Hyperloop.winmd
[DEBUG] Copying C:\ProgramData\Titanium\mobilesdk\win32\7.3.0.v20180618062809\windows\templates\build\TitaniumWindows_Hyperloop\bin\win10\Release\TitaniumWindows_Hyperloop.winmd => C:\Users\Josh\.titanium\vsbuild\deviceTest\TitaniumWindows_Hyperloop\bin\win10\Release\TitaniumWindows_Hyperloop.winmd
[DEBUG] Copying C:\ProgramData\Titanium\mobilesdk\win32\7.3.0.v20180618062809\windows\templates\build\TitaniumWindows_Hyperloop\phone\TitaniumWindows_Hyperloop.csproj.ejs => C:\Users\Josh\.titanium\vsbuild\deviceTest\TitaniumWindows_Hyperloop\phone\TitaniumWindows_Hyperloop.csproj.ejs
[DEBUG] Copying C:\ProgramData\Titanium\mobilesdk\win32\7.3.0.v20180618062809\windows\templates\build\TitaniumWindows_Hyperloop\phone\TitaniumWindows_Hyperloop.sln => C:\Users\Josh\.titanium\vsbuild\deviceTest\TitaniumWindows_Hyperloop\phone\TitaniumWindows_Hyperloop.sln
[DEBUG] Copying C:\ProgramData\Titanium\mobilesdk\win32\7.3.0.v20180618062809\windows\templates\build\TitaniumWindows_Hyperloop\src\Properties\AssemblyInfo.cs => C:\Users\Josh\.titanium\vsbuild\deviceTest\TitaniumWindows_Hyperloop\src\Properties\AssemblyInfo.cs
[DEBUG] Copying C:\ProgramData\Titanium\mobilesdk\win32\7.3.0.v20180618062809\windows\templates\build\TitaniumWindows_Hyperloop\src\TypeHelper.cs.ejs => C:\Users\Josh\.titanium\vsbuild\deviceTest\TitaniumWindows_Hyperloop\src\TypeHelper.cs.ejs
[DEBUG] Copying C:\ProgramData\Titanium\mobilesdk\win32\7.3.0.v20180618062809\windows\templates\build\TitaniumWindows_Hyperloop\store\TitaniumWindows_Hyperloop.csproj.ejs => C:\Users\Josh\.titanium\vsbuild\deviceTest\TitaniumWindows_Hyperloop\store\TitaniumWindows_Hyperloop.csproj.ejs
[DEBUG] Copying C:\ProgramData\Titanium\mobilesdk\win32\7.3.0.v20180618062809\windows\templates\build\TitaniumWindows_Hyperloop\store\TitaniumWindows_Hyperloop.sln => C:\Users\Josh\.titanium\vsbuild\deviceTest\TitaniumWindows_Hyperloop\store\TitaniumWindows_Hyperloop.sln
[DEBUG] Copying C:\ProgramData\Titanium\mobilesdk\win32\7.3.0.v20180618062809\windows\templates\build\TitaniumWindows_Hyperloop\win10\project.json => C:\Users\Josh\.titanium\vsbuild\deviceTest\TitaniumWindows_Hyperloop\win10\project.json
[DEBUG] Copying C:\ProgramData\Titanium\mobilesdk\win32\7.3.0.v20180618062809\windows\templates\build\TitaniumWindows_Hyperloop\win10\project.lock.json => C:\Users\Josh\.titanium\vsbuild\deviceTest\TitaniumWindows_Hyperloop\win10\project.lock.json
[DEBUG] Copying C:\ProgramData\Titanium\mobilesdk\win32\7.3.0.v20180618062809\windows\templates\build\TitaniumWindows_Hyperloop\win10\TitaniumWindows_Hyperloop.csproj.ejs => C:\Users\Josh\.titanium\vsbuild\deviceTest\TitaniumWindows_Hyperloop\win10\TitaniumWindows_Hyperloop.csproj.ejs
[DEBUG] Copying C:\ProgramData\Titanium\mobilesdk\win32\7.3.0.v20180618062809\windows\templates\build\TitaniumWindows_Hyperloop\win10\TitaniumWindows_Hyperloop.sln => C:\Users\Josh\.titanium\vsbuild\deviceTest\TitaniumWindows_Hyperloop\win10\TitaniumWindows_Hyperloop.sln
[DEBUG] Copying C:\ProgramData\Titanium\mobilesdk\win32\7.3.0.v20180618062809\windows\templates\build\titanium_settings.ini.ejs => C:\Users\Josh\.titanium\vsbuild\deviceTest\titanium_settings.ini.ejs
[DEBUG] Overwriting file C:\Users\Josh\.titanium\vsbuild\deviceTest\cmake\FindHAL.cmake
[DEBUG] Copying C:\ProgramData\Titanium\mobilesdk\win32\7.3.0.v20180618062809\windows\templates\build\cmake\FindHAL.cmake => C:\Users\Josh\.titanium\vsbuild\deviceTest\cmake\FindHAL.cmake
[DEBUG] Overwriting file C:\Users\Josh\.titanium\vsbuild\deviceTest\cmake\FindJavaScriptCore.cmake
[DEBUG] Copying C:\ProgramData\Titanium\mobilesdk\win32\7.3.0.v20180618062809\windows\templates\build\cmake\FindJavaScriptCore.cmake => C:\Users\Josh\.titanium\vsbuild\deviceTest\cmake\FindJavaScriptCore.cmake
[DEBUG] Overwriting file C:\Users\Josh\.titanium\vsbuild\deviceTest\cmake\FindLayoutEngine.cmake
[DEBUG] Copying C:\ProgramData\Titanium\mobilesdk\win32\7.3.0.v20180618062809\windows\templates\build\cmake\FindLayoutEngine.cmake => C:\Users\Josh\.titanium\vsbuild\deviceTest\cmake\FindLayoutEngine.cmake
[DEBUG] Overwriting file C:\Users\Josh\.titanium\vsbuild\deviceTest\cmake\FindNativeModule.cmake.ejs
[DEBUG] Copying C:\ProgramData\Titanium\mobilesdk\win32\7.3.0.v20180618062809\windows\templates\build\cmake\FindNativeModule.cmake.ejs => C:\Users\Josh\.titanium\vsbuild\deviceTest\cmake\FindNativeModule.cmake.ejs
[DEBUG] Overwriting file C:\Users\Josh\.titanium\vsbuild\deviceTest\cmake\FindTitaniumKit.cmake
[DEBUG] Copying C:\ProgramData\Titanium\mobilesdk\win32\7.3.0.v20180618062809\windows\templates\build\cmake\FindTitaniumKit.cmake => C:\Users\Josh\.titanium\vsbuild\deviceTest\cmake\FindTitaniumKit.cmake
[DEBUG] Overwriting file C:\Users\Josh\.titanium\vsbuild\deviceTest\cmake\FindTitaniumWindows.cmake
[DEBUG] Copying C:\ProgramData\Titanium\mobilesdk\win32\7.3.0.v20180618062809\windows\templates\build\cmake\FindTitaniumWindows.cmake => C:\Users\Josh\.titanium\vsbuild\deviceTest\cmake\FindTitaniumWindows.cmake
[DEBUG] Overwriting file C:\Users\Josh\.titanium\vsbuild\deviceTest\cmake\FindTitaniumWindows_Filesystem.cmake
[DEBUG] Copying C:\ProgramData\Titanium\mobilesdk\win32\7.3.0.v20180618062809\windows\templates\build\cmake\FindTitaniumWindows_Filesystem.cmake => C:\Users\Josh\.titanium\vsbuild\deviceTest\cmake\FindTitaniumWindows_Filesystem.cmake
[DEBUG] Overwriting file C:\Users\Josh\.titanium\vsbuild\deviceTest\cmake\FindTitaniumWindows_Global.cmake
[DEBUG] Copying C:\ProgramData\Titanium\mobilesdk\win32\7.3.0.v20180618062809\windows\templates\build\cmake\FindTitaniumWindows_Global.cmake => C:\Users\Josh\.titanium\vsbuild\deviceTest\cmake\FindTitaniumWindows_Global.cmake
[DEBUG] Overwriting file C:\Users\Josh\.titanium\vsbuild\deviceTest\cmake\FindTitaniumWindows_Map.cmake
[DEBUG] Copying C:\ProgramData\Titanium\mobilesdk\win32\7.3.0.v20180618062809\windows\templates\build\cmake\FindTitaniumWindows_Map.cmake => C:\Users\Josh\.titanium\vsbuild\deviceTest\cmake\FindTitaniumWindows_Map.cmake
[DEBUG] Overwriting file C:\Users\Josh\.titanium\vsbuild\deviceTest\cmake\FindTitaniumWindows_Media.cmake
[DEBUG] Copying C:\ProgramData\Titanium\mobilesdk\win32\7.3.0.v20180618062809\windows\templates\build\cmake\FindTitaniumWindows_Media.cmake => C:\Users\Josh\.titanium\vsbuild\deviceTest\cmake\FindTitaniumWindows_Media.cmake
[DEBUG] Overwriting file C:\Users\Josh\.titanium\vsbuild\deviceTest\cmake\FindTitaniumWindows_Network.cmake
[DEBUG] Copying C:\ProgramData\Titanium\mobilesdk\win32\7.3.0.v20180618062809\windows\templates\build\cmake\FindTitaniumWindows_Network.cmake => C:\Users\Josh\.titanium\vsbuild\deviceTest\cmake\FindTitaniumWindows_Network.cmake
[DEBUG] Overwriting file C:\Users\Josh\.titanium\vsbuild\deviceTest\cmake\FindTitaniumWindows_Sensors.cmake
[DEBUG] Copying C:\ProgramData\Titanium\mobilesdk\win32\7.3.0.v20180618062809\windows\templates\build\cmake\FindTitaniumWindows_Sensors.cmake => C:\Users\Josh\.titanium\vsbuild\deviceTest\cmake\FindTitaniumWindows_Sensors.cmake
[DEBUG] Overwriting file C:\Users\Josh\.titanium\vsbuild\deviceTest\cmake\FindTitaniumWindows_Ti.cmake
[DEBUG] Copying C:\ProgramData\Titanium\mobilesdk\win32\7.3.0.v20180618062809\windows\templates\build\cmake\FindTitaniumWindows_Ti.cmake => C:\Users\Josh\.titanium\vsbuild\deviceTest\cmake\FindTitaniumWindows_Ti.cmake
[DEBUG] Overwriting file C:\Users\Josh\.titanium\vsbuild\deviceTest\cmake\FindTitaniumWindows_UI.cmake
[DEBUG] Copying C:\ProgramData\Titanium\mobilesdk\win32\7.3.0.v20180618062809\windows\templates\build\cmake\FindTitaniumWindows_UI.cmake => C:\Users\Josh\.titanium\vsbuild\deviceTest\cmake\FindTitaniumWindows_UI.cmake
[DEBUG] Overwriting file C:\Users\Josh\.titanium\vsbuild\deviceTest\cmake\FindTitaniumWindows_Utility.cmake
[DEBUG] Copying C:\ProgramData\Titanium\mobilesdk\win32\7.3.0.v20180618062809\windows\templates\build\cmake\FindTitaniumWindows_Utility.cmake => C:\Users\Josh\.titanium\vsbuild\deviceTest\cmake\FindTitaniumWindows_Utility.cmake
[DEBUG] Overwriting file C:\Users\Josh\.titanium\vsbuild\deviceTest\cmake\internal_utils.cmake
[DEBUG] Copying C:\ProgramData\Titanium\mobilesdk\win32\7.3.0.v20180618062809\windows\templates\build\cmake\internal_utils.cmake => C:\Users\Josh\.titanium\vsbuild\deviceTest\cmake\internal_utils.cmake
[DEBUG] Ignoring C:\Users\Josh\appc\deviceTest\Resources\android
[DEBUG] Ignoring C:\Users\Josh\appc\deviceTest\Resources\windows
[DEBUG] Copying C:\Users\Josh\appc\deviceTest\Resources\windows\appicon.png => C:\Users\Josh\.titanium\vsbuild\deviceTest\Assets\appicon.png
[DEBUG] Copying C:\ProgramData\Titanium\mobilesdk\win32\7.3.0.v20180618062809\windows\lib\TitaniumKit\win10\ARM\TitaniumKit.dll => C:\Users\Josh\.titanium\vsbuild\deviceTest\lib\TitaniumKit.dll
[DEBUG] Copying C:\ProgramData\Titanium\mobilesdk\win32\7.3.0.v20180618062809\windows\lib\HAL\win10\ARM\AXWAYHAL.dll => C:\Users\Josh\.titanium\vsbuild\deviceTest\lib\AXWAYHAL.dll
[DEBUG] C:\Users\Josh\.titanium\vsbuild\deviceTest\Assets\SmallLogo.png missing, generating...
[DEBUG] C:\Users\Josh\.titanium\vsbuild\deviceTest\Assets\StoreLogo.png missing, generating...
[DEBUG] C:\Users\Josh\.titanium\vsbuild\deviceTest\Assets\Logo.png missing, generating...
[DEBUG] C:\Users\Josh\.titanium\vsbuild\deviceTest\Assets\Square310x310Logo.png missing, generating...
[DEBUG] C:\Users\Josh\.titanium\vsbuild\deviceTest\Assets\Square150x150Logo.png missing, generating...
[DEBUG] C:\Users\Josh\.titanium\vsbuild\deviceTest\Assets\Square71x71Logo.png missing, generating...
[DEBUG] C:\Users\Josh\.titanium\vsbuild\deviceTest\Assets\Square44x44Logo.png missing, generating...
[DEBUG] C:\Users\Josh\.titanium\vsbuild\deviceTest\Assets\Square24x24Logo.png missing, generating...
[DEBUG] Found C:\Users\Josh\appc\deviceTest\DefaultIcon.png (1024x1024)
[INFO] Missing 8 app icons, generating missing icons
[INFO] Square24x24Logo.png - Used for badge - size: 24x24
[INFO] Square44x44Logo.png - Used for logo - size: 44x44
[INFO] Square71x71Logo.png - Used for logo - size: 71x71
[INFO] Square150x150Logo.png - Used for logo - size: 150x150
[INFO] Square310x310Logo.png - Used for logo - size: 310x310
[INFO] Logo.png - Used for logo - size: 150x150
[INFO] StoreLogo.png - Used for logo - size: 50x50
[INFO] SmallLogo.png - Used for logo - size: 30x30
[TRACE] Resizing images: java -jar "C:\ProgramData\Titanium\mobilesdk\win32\7.3.0.v20180618062809\node_modules\node-appc\tools\resizer\resizer.jar" "C:\Users\Josh\appc\deviceTest\DefaultIcon.png" "C:\Users\Josh\.titanium\vsbuild\deviceTest\Assets\Square24x24Logo.png" 24 24 "C:\Users\Josh\.titanium\vsbuild\deviceTest\Assets\Square44x44Logo.png" 44 44 "C:\Users\Josh\.titanium\vsbuild\deviceTest\Assets\Square71x71Logo.png" 71 71 "C:\Users\Josh\.titanium\vsbuild\deviceTest\Assets\Square150x150Logo.png" 150 150 "C:\Users\Josh\.titanium\vsbuild\deviceTest\Assets\Square310x310Logo.png" 310 310 "C:\Users\Josh\.titanium\vsbuild\deviceTest\Assets\Logo.png" 150 150 "C:\Users\Josh\.titanium\vsbuild\deviceTest\Assets\StoreLogo.png" 50 50 "C:\Users\Josh\.titanium\vsbuild\deviceTest\Assets\SmallLogo.png" 30 30
[DEBUG] Copying C:\ProgramData\Application Data\Titanium\modules\commonjs\ti.cloud\3.2.11\documentation\changelog.html => C:\Users\Josh\.titanium\vsbuild\deviceTest\Assets\node_modules\ti.cloud\documentation\changelog.html
[DEBUG] Copying C:\ProgramData\Application Data\Titanium\modules\commonjs\ti.cloud\3.2.11\documentation\index.html => C:\Users\Josh\.titanium\vsbuild\deviceTest\Assets\node_modules\ti.cloud\documentation\index.html
[DEBUG] Copying C:\ProgramData\Application Data\Titanium\modules\commonjs\ti.cloud\3.2.11\example\android\appicon.png => C:\Users\Josh\.titanium\vsbuild\deviceTest\Assets\node_modules\ti.cloud\example\android\appicon.png
[DEBUG] Copying C:\ProgramData\Application Data\Titanium\modules\commonjs\ti.cloud\3.2.11\example\android\default.png => C:\Users\Josh\.titanium\vsbuild\deviceTest\Assets\node_modules\ti.cloud\example\android\default.png
[DEBUG] Copying C:\ProgramData\Application Data\Titanium\modules\commonjs\ti.cloud\3.2.11\example\android\images\res-long-land-hdpi\default.png => C:\Users\Josh\.titanium\vsbuild\deviceTest\Assets\node_modules\ti.cloud\example\android\images\res-long-land-hdpi\default.png
[DEBUG] Copying C:\ProgramData\Application Data\Titanium\modules\commonjs\ti.cloud\3.2.11\example\android\images\res-long-land-ldpi\default.png => C:\Users\Josh\.titanium\vsbuild\deviceTest\Assets\node_modules\ti.cloud\example\android\images\res-long-land-ldpi\default.png
[DEBUG] Copying C:\ProgramData\Application Data\Titanium\modules\commonjs\ti.cloud\3.2.11\example\android\images\res-long-port-hdpi\default.png => C:\Users\Josh\.titanium\vsbuild\deviceTest\Assets\node_modules\ti.cloud\example\android\images\res-long-port-hdpi\default.png
[DEBUG] Copying C:\ProgramData\Application Data\Titanium\modules\commonjs\ti.cloud\3.2.11\example\android\images\res-long-port-ldpi\default.png => C:\Users\Josh\.titanium\vsbuild\deviceTest\Assets\node_modules\ti.cloud\example\android\images\res-long-port-ldpi\default.png
[DEBUG] Copying C:\ProgramData\Application Data\Titanium\modules\commonjs\ti.cloud\3.2.11\example\android\images\res-notlong-land-hdpi\default.png => C:\Users\Josh\.titanium\vsbuild\deviceTest\Assets\node_modules\ti.cloud\example\android\images\res-notlong-land-hdpi\default.png
[DEBUG] Copying C:\ProgramData\Application Data\Titanium\modules\commonjs\ti.cloud\3.2.11\example\android\images\res-notlong-land-ldpi\default.png => C:\Users\Josh\.titanium\vsbuild\deviceTest\Assets\node_modules\ti.cloud\example\android\images\res-notlong-land-ldpi\default.png
[DEBUG] Copying C:\ProgramData\Application Data\Titanium\modules\commonjs\ti.cloud\3.2.11\example\android\images\res-notlong-land-mdpi\default.png => C:\Users\Josh\.titanium\vsbuild\deviceTest\Assets\node_modules\ti.cloud\example\android\images\res-notlong-land-mdpi\default.png
[DEBUG] Copying C:\ProgramData\Application Data\Titanium\modules\commonjs\ti.cloud\3.2.11\example\android\images\res-notlong-port-hdpi\default.png => C:\Users\Josh\.titanium\vsbuild\deviceTest\Assets\node_modules\ti.cloud\example\android\images\res-notlong-port-hdpi\default.png
[DEBUG] Copying C:\ProgramData\Application Data\Titanium\modules\commonjs\ti.cloud\3.2.11\example\android\images\res-notlong-port-ldpi\default.png => C:\Users\Josh\.titanium\vsbuild\deviceTest\Assets\node_modules\ti.cloud\example\android\images\res-notlong-port-ldpi\default.png
[DEBUG] Copying C:\ProgramData\Application Data\Titanium\modules\commonjs\ti.cloud\3.2.11\example\android\images\res-notlong-port-mdpi\default.png => C:\Users\Josh\.titanium\vsbuild\deviceTest\Assets\node_modules\ti.cloud\example\android\images\res-notlong-port-mdpi\default.png
[DEBUG] Copying C:\ProgramData\Application Data\Titanium\modules\commonjs\ti.cloud\3.2.11\example\app.js => C:\Users\Josh\.titanium\vsbuild\deviceTest\Assets\node_modules\ti.cloud\example\app.js
[DEBUG] Copying C:\ProgramData\Application Data\Titanium\modules\commonjs\ti.cloud\3.2.11\example\helper\Utils.js => C:\Users\Josh\.titanium\vsbuild\deviceTest\Assets\node_modules\ti.cloud\example\helper\Utils.js
[DEBUG] Copying C:\ProgramData\Application Data\Titanium\modules\commonjs\ti.cloud\3.2.11\example\helper\WindowManager.js => C:\Users\Josh\.titanium\vsbuild\deviceTest\Assets\node_modules\ti.cloud\example\helper\WindowManager.js
[DEBUG] Copying C:\ProgramData\Application Data\Titanium\modules\commonjs\ti.cloud\3.2.11\example\iphone\Default-568h@2x.png => C:\Users\Josh\.titanium\vsbuild\deviceTest\Assets\node_modules\ti.cloud\example\iphone\Default-568h@2x.png
[DEBUG] Copying C:\ProgramData\Application Data\Titanium\modules\commonjs\ti.cloud\3.2.11\example\iphone\Default-667h@2x.png => C:\Users\Josh\.titanium\vsbuild\deviceTest\Assets\node_modules\ti.cloud\example\iphone\Default-667h@2x.png
[DEBUG] Copying C:\ProgramData\Application Data\Titanium\modules\commonjs\ti.cloud\3.2.11\example\iphone\Default-Landscape-736h@3x.png => C:\Users\Josh\.titanium\vsbuild\deviceTest\Assets\node_modules\ti.cloud\example\iphone\Default-Landscape-736h@3x.png
[DEBUG] Copying C:\ProgramData\Application Data\Titanium\modules\commonjs\ti.cloud\3.2.11\example\iphone\Default-Landscape.png => C:\Users\Josh\.titanium\vsbuild\deviceTest\Assets\node_modules\ti.cloud\example\iphone\Default-Landscape.png
[DEBUG] Copying C:\ProgramData\Application Data\Titanium\modules\commonjs\ti.cloud\3.2.11\example\iphone\Default-Landscape@2x.png => C:\Users\Josh\.titanium\vsbuild\deviceTest\Assets\node_modules\ti.cloud\example\iphone\Default-Landscape@2x.png
[DEBUG] Copying C:\ProgramData\Application Data\Titanium\modules\commonjs\ti.cloud\3.2.11\example\iphone\Default-Portrait-736h@3x.png => C:\Users\Josh\.titanium\vsbuild\deviceTest\Assets\node_modules\ti.cloud\example\iphone\Default-Portrait-736h@3x.png
[DEBUG] Copying C:\ProgramData\Application Data\Titanium\modules\commonjs\ti.cloud\3.2.11\example\iphone\Default-Portrait.png => C:\Users\Josh\.titanium\vsbuild\deviceTest\Assets\node_modules\ti.cloud\example\iphone\Default-Portrait.png
[DEBUG] Copying C:\ProgramData\Application Data\Titanium\modules\commonjs\ti.cloud\3.2.11\example\iphone\Default-Portrait@2x.png => C:\Users\Josh\.titanium\vsbuild\deviceTest\Assets\node_modules\ti.cloud\example\iphone\Default-Portrait@2x.png
[DEBUG] Copying C:\ProgramData\Application Data\Titanium\modules\commonjs\ti.cloud\3.2.11\example\iphone\Default.png => C:\Users\Josh\.titanium\vsbuild\deviceTest\Assets\node_modules\ti.cloud\example\iphone\Default.png
[DEBUG] Copying C:\ProgramData\Application Data\Titanium\modules\commonjs\ti.cloud\3.2.11\example\iphone\Default@2x.png => C:\Users\Josh\.titanium\vsbuild\deviceTest\Assets\node_modules\ti.cloud\example\iphone\Default@2x.png
[DEBUG] Copying C:\ProgramData\Application Data\Titanium\modules\commonjs\ti.cloud\3.2.11\example\themes\common.css => C:\Users\Josh\.titanium\vsbuild\deviceTest\Assets\node_modules\ti.cloud\example\themes\common.css
[DEBUG] Copying C:\ProgramData\Application Data\Titanium\modules\commonjs\ti.cloud\3.2.11\example\themes\titanium\UI\TableViewRow\check.png => C:\Users\Josh\.titanium\vsbuild\deviceTest\Assets\node_modules\ti.cloud\example\themes\titanium\UI\TableViewRow\check.png
[DEBUG] Copying C:\ProgramData\Application Data\Titanium\modules\commonjs\ti.cloud\3.2.11\example\themes\titanium\UI\TableViewRow\child.png => C:\Users\Josh\.titanium\vsbuild\deviceTest\Assets\node_modules\ti.cloud\example\themes\titanium\UI\TableViewRow\child.png
[DEBUG] Copying C:\ProgramData\Application Data\Titanium\modules\commonjs\ti.cloud\3.2.11\example\themes\titanium\UI\TableViewRow\detail.png => C:\Users\Josh\.titanium\vsbuild\deviceTest\Assets\node_modules\ti.cloud\example\themes\titanium\UI\TableViewRow\detail.png
[DEBUG] Copying C:\ProgramData\Application Data\Titanium\modules\commonjs\ti.cloud\3.2.11\example\views\accessControlLists\checkUser.js => C:\Users\Josh\.titanium\vsbuild\deviceTest\Assets\node_modules\ti.cloud\example\views\accessControlLists\checkUser.js
[DEBUG] Copying C:\ProgramData\Application Data\Titanium\modules\commonjs\ti.cloud\3.2.11\example\views\accessControlLists\create.js => C:\Users\Josh\.titanium\vsbuild\deviceTest\Assets\node_modules\ti.cloud\example\views\accessControlLists\create.js
[DEBUG] Copying C:\ProgramData\Application Data\Titanium\modules\commonjs\ti.cloud\3.2.11\example\views\accessControlLists\selectUsers.js => C:\Users\Josh\.titanium\vsbuild\deviceTest\Assets\node_modules\ti.cloud\example\views\accessControlLists\selectUsers.js
[DEBUG] Copying C:\ProgramData\Application Data\Titanium\modules\commonjs\ti.cloud\3.2.11\example\views\accessControlLists\show.js => C:\Users\Josh\.titanium\vsbuild\deviceTest\Assets\node_modules\ti.cloud\example\views\accessControlLists\show.js
[DEBUG] Copying C:\ProgramData\Application Data\Titanium\modules\commonjs\ti.cloud\3.2.11\example\views\accessControlLists\table.js => C:\Users\Josh\.titanium\vsbuild\deviceTest\Assets\node_modules\ti.cloud\example\views\accessControlLists\table.js
[DEBUG] Copying C:\ProgramData\Application Data\Titanium\modules\commonjs\ti.cloud\3.2.11\example\views\accessControlLists\updateUsers.js => C:\Users\Josh\.titanium\vsbuild\deviceTest\Assets\node_modules\ti.cloud\example\views\accessControlLists\updateUsers.js
[DEBUG] Copying C:\ProgramData\Application Data\Titanium\modules\commonjs\ti.cloud\3.2.11\example\views\chats\query.js => C:\Users\Josh\.titanium\vsbuild\deviceTest\Assets\node_modules\ti.cloud\example\views\chats\query.js
[DEBUG] Copying C:\ProgramData\Application Data\Titanium\modules\commonjs\ti.cloud\3.2.11\example\views\chats\selectUsersForGroup.js => C:\Users\Josh\.titanium\vsbuild\deviceTest\Assets\node_modules\ti.cloud\example\views\chats\selectUsersForGroup.js
[DEBUG] Copying C:\ProgramData\Application Data\Titanium\modules\commonjs\ti.cloud\3.2.11\example\views\chats\showChatGroup.js => C:\Users\Josh\.titanium\vsbuild\deviceTest\Assets\node_modules\ti.cloud\example\views\chats\showChatGroup.js
[DEBUG] Copying C:\ProgramData\Application Data\Titanium\modules\commonjs\ti.cloud\3.2.11\example\views\chats\table.js => C:\Users\Josh\.titanium\vsbuild\deviceTest\Assets\node_modules\ti.cloud\example\views\chats\table.js
[DEBUG] Copying C:\ProgramData\Application Data\Titanium\modules\commonjs\ti.cloud\3.2.11\example\views\checkins\create.js => C:\Users\Josh\.titanium\vsbuild\deviceTest\Assets\node_modules\ti.cloud\example\views\checkins\create.js
[DEBUG] Copying C:\ProgramData\Application Data\Titanium\modules\commonjs\ti.cloud\3.2.11\example\views\checkins\query.js => C:\Users\Josh\.titanium\vsbuild\deviceTest\Assets\node_modules\ti.cloud\example\views\checkins\query.js
[DEBUG] Copying C:\ProgramData\Application Data\Titanium\modules\commonjs\ti.cloud\3.2.11\example\views\checkins\remove.js => C:\Users\Josh\.titanium\vsbuild\deviceTest\Assets\node_modules\ti.cloud\example\views\checkins\remove.js
[DEBUG] Copying C:\ProgramData\Application Data\Titanium\modules\commonjs\ti.cloud\3.2.11\example\views\checkins\show.js => C:\Users\Josh\.titanium\vsbuild\deviceTest\Assets\node_modules\ti.cloud\example\views\checkins\show.js
[DEBUG] Copying C:\ProgramData\Application Data\Titanium\modules\commonjs\ti.cloud\3.2.11\example\views\checkins\table.js => C:\Users\Josh\.titanium\vsbuild\deviceTest\Assets\node_modules\ti.cloud\example\views\checkins\table.js
[DEBUG] Copying C:\ProgramData\Application Data\Titanium\modules\commonjs\ti.cloud\3.2.11\example\views\clients\geolocateMe.js => C:\Users\Josh\.titanium\vsbuild\deviceTest\Assets\node_modules\ti.cloud\example\views\clients\geolocateMe.js
[DEBUG] Copying C:\ProgramData\Application Data\Titanium\modules\commonjs\ti.cloud\3.2.11\example\views\clients\geolocateParticular.js => C:\Users\Josh\.titanium\vsbuild\deviceTest\Assets\node_modules\ti.cloud\example\views\clients\geolocateParticular.js
[DEBUG] Copying C:\ProgramData\Application Data\Titanium\modules\commonjs\ti.cloud\3.2.11\example\views\clients\table.js => C:\Users\Josh\.titanium\vsbuild\deviceTest\Assets\node_modules\ti.cloud\example\views\clients\table.js
[DEBUG] Copying C:\ProgramData\Application Data\Titanium\modules\commonjs\ti.cloud\3.2.11\example\views\customObjects\create.js => C:\Users\Josh\.titanium\vsbuild\deviceTest\Assets\node_modules\ti.cloud\example\views\customObjects\create.js
[DEBUG] Copying C:\ProgramData\Application Data\Titanium\modules\commonjs\ti.cloud\3.2.11\example\views\customObjects\query.js => C:\Users\Josh\.titanium\vsbuild\deviceTest\Assets\node_modules\ti.cloud\example\views\customObjects\query.js
[DEBUG] Copying C:\ProgramData\Application Data\Titanium\modules\commonjs\ti.cloud\3.2.11\example\views\customObjects\remove.js => C:\Users\Josh\.titanium\vsbuild\deviceTest\Assets\node_modules\ti.cloud\example\views\customObjects\remove.js
[DEBUG] Copying C:\ProgramData\Application Data\Titanium\modules\commonjs\ti.cloud\3.2.11\example\views\customObjects\table.js => C:\Users\Josh\.titanium\vsbuild\deviceTest\Assets\node_modules\ti.cloud\example\views\customObjects\table.js
[DEBUG] Copying C:\ProgramData\Application Data\Titanium\modules\commonjs\ti.cloud\3.2.11\example\views\customObjects\update.js => C:\Users\Josh\.titanium\vsbuild\deviceTest\Assets\node_modules\ti.cloud\example\views\customObjects\update.js
[DEBUG] Copying C:\ProgramData\Application Data\Titanium\modules\commonjs\ti.cloud\3.2.11\example\views\emails\table.js => C:\Users\Josh\.titanium\vsbuild\deviceTest\Assets\node_modules\ti.cloud\example\views\emails\table.js
[DEBUG] Copying C:\ProgramData\Application Data\Titanium\modules\commonjs\ti.cloud\3.2.11\example\views\events\create.js => C:\Users\Josh\.titanium\vsbuild\deviceTest\Assets\node_modules\ti.cloud\example\views\events\create.js
[DEBUG] Copying C:\ProgramData\Application Data\Titanium\modules\commonjs\ti.cloud\3.2.11\example\views\events\query.js => C:\Users\Josh\.titanium\vsbuild\deviceTest\Assets\node_modules\ti.cloud\example\views\events\query.js
[DEBUG] Copying C:\ProgramData\Application Data\Titanium\modules\commonjs\ti.cloud\3.2.11\example\views\events\queryOccurrences.js => C:\Users\Josh\.titanium\vsbuild\deviceTest\Assets\node_modules\ti.cloud\example\views\events\queryOccurrences.js
[DEBUG] Copying C:\ProgramData\Application Data\Titanium\modules\commonjs\ti.cloud\3.2.11\example\views\events\remove.js => C:\Users\Josh\.titanium\vsbuild\deviceTest\Assets\node_modules\ti.cloud\example\views\events\remove.js
[DEBUG] Copying C:\ProgramData\Application Data\Titanium\modules\commonjs\ti.cloud\3.2.11\example\views\events\show.js => C:\Users\Josh\.titanium\vsbuild\deviceTest\Assets\node_modules\ti.cloud\example\views\events\show.js
[DEBUG] Copying C:\ProgramData\Application Data\Titanium\modules\commonjs\ti.cloud\3.2.11\example\views\events\showOccurrences.js => C:\Users\Josh\.titanium\vsbuild\deviceTest\Assets\node_modules\ti.cloud\example\views\events\showOccurrences.js
[DEBUG] Copying C:\ProgramData\Application Data\Titanium\modules\commonjs\ti.cloud\3.2.11\example\views\events\table.js => C:\Users\Josh\.titanium\vsbuild\deviceTest\Assets\node_modules\ti.cloud\example\views\events\table.js
[DEBUG] Copying C:\ProgramData\Application Data\Titanium\modules\commonjs\ti.cloud\3.2.11\example\views\events\update.js => C:\Users\Josh\.titanium\vsbuild\deviceTest\Assets\node_modules\ti.cloud\example\views\events\update.js
[DEBUG] Copying C:\ProgramData\Application Data\Titanium\modules\commonjs\ti.cloud\3.2.11\example\views\files\create.js => C:\Users\Josh\.titanium\vsbuild\deviceTest\Assets\node_modules\ti.cloud\example\views\files\create.js
[DEBUG] Copying C:\ProgramData\Application Data\Titanium\modules\commonjs\ti.cloud\3.2.11\example\views\files\query.js => C:\Users\Josh\.titanium\vsbuild\deviceTest\Assets\node_modules\ti.cloud\example\views\files\query.js
[DEBUG] Copying C:\ProgramData\Application Data\Titanium\modules\commonjs\ti.cloud\3.2.11\example\views\files\remove.js => C:\Users\Josh\.titanium\vsbuild\deviceTest\Assets\node_modules\ti.cloud\example\views\files\remove.js
[DEBUG] Copying C:\ProgramData\Application Data\Titanium\modules\commonjs\ti.cloud\3.2.11\example\views\files\sampleFile.txt => C:\Users\Josh\.titanium\vsbuild\deviceTest\Assets\node_modules\ti.cloud\example\views\files\sampleFile.txt
[DEBUG] Copying C:\ProgramData\Application Data\Titanium\modules\commonjs\ti.cloud\3.2.11\example\views\files\show.js => C:\Users\Josh\.titanium\vsbuild\deviceTest\Assets\node_modules\ti.cloud\example\views\files\show.js
[DEBUG] Copying C:\ProgramData\Application Data\Titanium\modules\commonjs\ti.cloud\3.2.11\example\views\files\table.js => C:\Users\Josh\.titanium\vsbuild\deviceTest\Assets\node_modules\ti.cloud\example\views\files\table.js
[DEBUG] Copying C:\ProgramData\Application Data\Titanium\modules\commonjs\ti.cloud\3.2.11\example\views\files\update.js => C:\Users\Josh\.titanium\vsbuild\deviceTest\Assets\node_modules\ti.cloud\example\views\files\update.js
[DEBUG] Copying C:\ProgramData\Application Data\Titanium\modules\commonjs\ti.cloud\3.2.11\example\views\friends\add.js => C:\Users\Josh\.titanium\vsbuild\deviceTest\Assets\node_modules\ti.cloud\example\views\friends\add.js
[DEBUG] Copying C:\ProgramData\Application Data\Titanium\modules\commonjs\ti.cloud\3.2.11\example\views\friends\approve.js => C:\Users\Josh\.titanium\vsbuild\deviceTest\Assets\node_modules\ti.cloud\example\views\friends\approve.js
[DEBUG] Copying C:\ProgramData\Application Data\Titanium\modules\commonjs\ti.cloud\3.2.11\example\views\friends\remove.js => C:\Users\Josh\.titanium\vsbuild\deviceTest\Assets\node_modules\ti.cloud\example\views\friends\remove.js
[DEBUG] Copying C:\ProgramData\Application Data\Titanium\modules\commonjs\ti.cloud\3.2.11\example\views\friends\search.js => C:\Users\Josh\.titanium\vsbuild\deviceTest\Assets\node_modules\ti.cloud\example\views\friends\search.js
[DEBUG] Copying C:\ProgramData\Application Data\Titanium\modules\commonjs\ti.cloud\3.2.11\example\views\friends\searchUsers.js => C:\Users\Josh\.titanium\vsbuild\deviceTest\Assets\node_modules\ti.cloud\example\views\friends\searchUsers.js
[DEBUG] Copying C:\ProgramData\Application Data\Titanium\modules\commonjs\ti.cloud\3.2.11\example\views\friends\table.js => C:\Users\Josh\.titanium\vsbuild\deviceTest\Assets\node_modules\ti.cloud\example\views\friends\table.js
[DEBUG] Copying C:\ProgramData\Application Data\Titanium\modules\commonjs\ti.cloud\3.2.11\example\views\genericSendRequest.js => C:\Users\Josh\.titanium\vsbuild\deviceTest\Assets\node_modules\ti.cloud\example\views\genericSendRequest.js
[DEBUG] Copying C:\ProgramData\Application Data\Titanium\modules\commonjs\ti.cloud\3.2.11\example\views\geoFences\create.js => C:\Users\Josh\.titanium\vsbuild\deviceTest\Assets\node_modules\ti.cloud\example\views\geoFences\create.js
[DEBUG] Copying C:\ProgramData\Application Data\Titanium\modules\commonjs\ti.cloud\3.2.11\example\views\geoFences\query.js => C:\Users\Josh\.titanium\vsbuild\deviceTest\Assets\node_modules\ti.cloud\example\views\geoFences\query.js
[DEBUG] Copying C:\ProgramData\Application Data\Titanium\modules\commonjs\ti.cloud\3.2.11\example\views\geoFences\remove.js => C:\Users\Josh\.titanium\vsbuild\deviceTest\Assets\node_modules\ti.cloud\example\views\geoFences\remove.js
[DEBUG] Copying C:\ProgramData\Application Data\Titanium\modules\commonjs\ti.cloud\3.2.11\example\views\geoFences\table.js => C:\Users\Josh\.titanium\vsbuild\deviceTest\Assets\node_modules\ti.cloud\example\views\geoFences\table.js
[DEBUG] Copying C:\ProgramData\Application Data\Titanium\modules\commonjs\ti.cloud\3.2.11\example\views\geoFences\update.js => C:\Users\Josh\.titanium\vsbuild\deviceTest\Assets\node_modules\ti.cloud\example\views\geoFences\update.js
[DEBUG] Copying C:\ProgramData\Application Data\Titanium\modules\commonjs\ti.cloud\3.2.11\example\views\keyValues\table.js => C:\Users\Josh\.titanium\vsbuild\deviceTest\Assets\node_modules\ti.cloud\example\views\keyValues\table.js
[DEBUG] Copying C:\ProgramData\Application Data\Titanium\modules\commonjs\ti.cloud\3.2.11\example\views\likes\create.js => C:\Users\Josh\.titanium\vsbuild\deviceTest\Assets\node_modules\ti.cloud\example\views\likes\create.js
[DEBUG] Copying C:\ProgramData\Application Data\Titanium\modules\commonjs\ti.cloud\3.2.11\example\views\likes\remove.js => C:\Users\Josh\.titanium\vsbuild\deviceTest\Assets\node_modules\ti.cloud\example\views\likes\remove.js
[DEBUG] Copying C:\ProgramData\Application Data\Titanium\modules\commonjs\ti.cloud\3.2.11\example\views\likes\table.js => C:\Users\Josh\.titanium\vsbuild\deviceTest\Assets\node_modules\ti.cloud\example\views\likes\table.js
[DEBUG] Copying C:\ProgramData\Application Data\Titanium\modules\commonjs\ti.cloud\3.2.11\example\views\messages\create.js => C:\Users\Josh\.titanium\vsbuild\deviceTest\Assets\node_modules\ti.cloud\example\views\messages\create.js
[DEBUG] Copying C:\ProgramData\Application Data\Titanium\modules\commonjs\ti.cloud\3.2.11\example\views\messages\remove.js => C:\Users\Josh\.titanium\vsbuild\deviceTest\Assets\node_modules\ti.cloud\example\views\messages\remove.js
[DEBUG] Copying C:\ProgramData\Application Data\Titanium\modules\commonjs\ti.cloud\3.2.11\example\views\messages\removeThread.js => C:\Users\Josh\.titanium\vsbuild\deviceTest\Assets\node_modules\ti.cloud\example\views\messages\removeThread.js
[DEBUG] Copying C:\ProgramData\Application Data\Titanium\modules\commonjs\ti.cloud\3.2.11\example\views\messages\reply.js => C:\Users\Josh\.titanium\vsbuild\deviceTest\Assets\node_modules\ti.cloud\example\views\messages\reply.js
[DEBUG] Copying C:\ProgramData\Application Data\Titanium\modules\commonjs\ti.cloud\3.2.11\example\views\messages\selectUsers.js => C:\Users\Josh\.titanium\vsbuild\deviceTest\Assets\node_modules\ti.cloud\example\views\messages\selectUsers.js
[DEBUG] Copying C:\ProgramData\Application Data\Titanium\modules\commonjs\ti.cloud\3.2.11\example\views\messages\show.js => C:\Users\Josh\.titanium\vsbuild\deviceTest\Assets\node_modules\ti.cloud\example\views\messages\show.js
[DEBUG] Copying C:\ProgramData\Application Data\Titanium\modules\commonjs\ti.cloud\3.2.11\example\views\messages\showInbox.js => C:\Users\Josh\.titanium\vsbuild\deviceTest\Assets\node_modules\ti.cloud\example\views\messages\showInbox.js
[DEBUG] Copying C:\ProgramData\Application Data\Titanium\modules\commonjs\ti.cloud\3.2.11\example\views\messages\showSent.js => C:\Users\Josh\.titanium\vsbuild\deviceTest\Assets\node_modules\ti.cloud\example\views\messages\showSent.js
[DEBUG] Copying C:\ProgramData\Application Data\Titanium\modules\commonjs\ti.cloud\3.2.11\example\views\messages\showThreadMessages.js => C:\Users\Josh\.titanium\vsbuild\deviceTest\Assets\node_modules\ti.cloud\example\views\messages\showThreadMessages.js
[DEBUG] Copying C:\ProgramData\Application Data\Titanium\modules\commonjs\ti.cloud\3.2.11\example\views\messages\showThreads.js => C:\Users\Josh\.titanium\vsbuild\deviceTest\Assets\node_modules\ti.cloud\example\views\messages\showThreads.js
[DEBUG] Copying C:\ProgramData\Application Data\Titanium\modules\commonjs\ti.cloud\3.2.11\example\views\messages\table.js => C:\Users\Josh\.titanium\vsbuild\deviceTest\Assets\node_modules\ti.cloud\example\views\messages\table.js
[DEBUG] Copying C:\ProgramData\Application Data\Titanium\modules\commonjs\ti.cloud\3.2.11\example\views\photoCollections\create.js => C:\Users\Josh\.titanium\vsbuild\deviceTest\Assets\node_modules\ti.cloud\example\views\photoCollections\create.js
[DEBUG] Copying C:\ProgramData\Application Data\Titanium\modules\commonjs\ti.cloud\3.2.11\example\views\photoCollections\remove.js => C:\Users\Josh\.titanium\vsbuild\deviceTest\Assets\node_modules\ti.cloud\example\views\photoCollections\remove.js
[DEBUG] Copying C:\ProgramData\Application Data\Titanium\modules\commonjs\ti.cloud\3.2.11\example\views\photoCollections\search.js => C:\Users\Josh\.titanium\vsbuild\deviceTest\Assets\node_modules\ti.cloud\example\views\photoCollections\search.js
[DEBUG] Copying C:\ProgramData\Application Data\Titanium\modules\commonjs\ti.cloud\3.2.11\example\views\photoCollections\show.js => C:\Users\Josh\.titanium\vsbuild\deviceTest\Assets\node_modules\ti.cloud\example\views\photoCollections\show.js
[DEBUG] Copying C:\ProgramData\Application Data\Titanium\modules\commonjs\ti.cloud\3.2.11\example\views\photoCollections\showPhotos.js => C:\Users\Josh\.titanium\vsbuild\deviceTest\Assets\node_modules\ti.cloud\example\views\photoCollections\showPhotos.js
[DEBUG] Copying C:\ProgramData\Application Data\Titanium\modules\commonjs\ti.cloud\3.2.11\example\views\photoCollections\showSubcollections.js => C:\Users\Josh\.titanium\vsbuild\deviceTest\Assets\node_modules\ti.cloud\example\views\photoCollections\showSubcollections.js
[DEBUG] Copying C:\ProgramData\Application Data\Titanium\modules\commonjs\ti.cloud\3.2.11\example\views\photoCollections\table.js => C:\Users\Josh\.titanium\vsbuild\deviceTest\Assets\node_modules\ti.cloud\example\views\photoCollections\table.js
[DEBUG] Copying C:\ProgramData\Application Data\Titanium\modules\commonjs\ti.cloud\3.2.11\example\views\photoCollections\update.js => C:\Users\Josh\.titanium\vsbuild\deviceTest\Assets\node_modules\ti.cloud\example\views\photoCollections\update.js
[DEBUG] Copying C:\ProgramData\Application Data\Titanium\modules\commonjs\ti.cloud\3.2.11\example\views\photos\create.js => C:\Users\Josh\.titanium\vsbuild\deviceTest\Assets\node_modules\ti.cloud\example\views\photos\create.js
[DEBUG] Copying C:\ProgramData\Application Data\Titanium\modules\commonjs\ti.cloud\3.2.11\example\views\photos\query.js => C:\Users\Josh\.titanium\vsbuild\deviceTest\Assets\node_modules\ti.cloud\example\views\photos\query.js
[DEBUG] Copying C:\ProgramData\Application Data\Titanium\modules\commonjs\ti.cloud\3.2.11\example\views\photos\remove.js => C:\Users\Josh\.titanium\vsbuild\deviceTest\Assets\node_modules\ti.cloud\example\views\photos\remove.js
[DEBUG] Copying C:\ProgramData\Application Data\Titanium\modules\commonjs\ti.cloud\3.2.11\example\views\photos\search.js => C:\Users\Josh\.titanium\vsbuild\deviceTest\Assets\node_modules\ti.cloud\example\views\photos\search.js
[DEBUG] Copying C:\ProgramData\Application Data\Titanium\modules\commonjs\ti.cloud\3.2.11\example\views\photos\show.js => C:\Users\Josh\.titanium\vsbuild\deviceTest\Assets\node_modules\ti.cloud\example\views\photos\show.js
[DEBUG] Copying C:\ProgramData\Application Data\Titanium\modules\commonjs\ti.cloud\3.2.11\example\views\photos\table.js => C:\Users\Josh\.titanium\vsbuild\deviceTest\Assets\node_modules\ti.cloud\example\views\photos\table.js
[DEBUG] Copying C:\ProgramData\Application Data\Titanium\modules\commonjs\ti.cloud\3.2.11\example\views\photos\update.js => C:\Users\Josh\.titanium\vsbuild\deviceTest\Assets\node_modules\ti.cloud\example\views\photos\update.js
[DEBUG] Copying C:\ProgramData\Application Data\Titanium\modules\commonjs\ti.cloud\3.2.11\example\views\places\create.js => C:\Users\Josh\.titanium\vsbuild\deviceTest\Assets\node_modules\ti.cloud\example\views\places\create.js
[DEBUG] Copying C:\ProgramData\Application Data\Titanium\modules\commonjs\ti.cloud\3.2.11\example\views\places\query.js => C:\Users\Josh\.titanium\vsbuild\deviceTest\Assets\node_modules\ti.cloud\example\views\places\query.js
[DEBUG] Copying C:\ProgramData\Application Data\Titanium\modules\commonjs\ti.cloud\3.2.11\example\views\places\remove.js => C:\Users\Josh\.titanium\vsbuild\deviceTest\Assets\node_modules\ti.cloud\example\views\places\remove.js
[DEBUG] Copying C:\ProgramData\Application Data\Titanium\modules\commonjs\ti.cloud\3.2.11\example\views\places\search.js => C:\Users\Josh\.titanium\vsbuild\deviceTest\Assets\node_modules\ti.cloud\example\views\places\search.js
[DEBUG] Copying C:\ProgramData\Application Data\Titanium\modules\commonjs\ti.cloud\3.2.11\example\views\places\show.js => C:\Users\Josh\.titanium\vsbuild\deviceTest\Assets\node_modules\ti.cloud\example\views\places\show.js
[DEBUG] Copying C:\ProgramData\Application Data\Titanium\modules\commonjs\ti.cloud\3.2.11\example\views\places\table.js => C:\Users\Josh\.titanium\vsbuild\deviceTest\Assets\node_modules\ti.cloud\example\views\places\table.js
[DEBUG] Copying C:\ProgramData\Application Data\Titanium\modules\commonjs\ti.cloud\3.2.11\example\views\places\update.js => C:\Users\Josh\.titanium\vsbuild\deviceTest\Assets\node_modules\ti.cloud\example\views\places\update.js
[DEBUG] Copying C:\ProgramData\Application Data\Titanium\modules\commonjs\ti.cloud\3.2.11\example\views\posts\create.js => C:\Users\Josh\.titanium\vsbuild\deviceTest\Assets\node_modules\ti.cloud\example\views\posts\create.js
[DEBUG] Copying C:\ProgramData\Application Data\Titanium\modules\commonjs\ti.cloud\3.2.11\example\views\posts\query.js => C:\Users\Josh\.titanium\vsbuild\deviceTest\Assets\node_modules\ti.cloud\example\views\posts\query.js
[DEBUG] Copying C:\ProgramData\Application Data\Titanium\modules\commonjs\ti.cloud\3.2.11\example\views\posts\remove.js => C:\Users\Josh\.titanium\vsbuild\deviceTest\Assets\node_modules\ti.cloud\example\views\posts\remove.js
[DEBUG] Copying C:\ProgramData\Application Data\Titanium\modules\commonjs\ti.cloud\3.2.11\example\views\posts\show.js => C:\Users\Josh\.titanium\vsbuild\deviceTest\Assets\node_modules\ti.cloud\example\views\posts\show.js
[DEBUG] Copying C:\ProgramData\Application Data\Titanium\modules\commonjs\ti.cloud\3.2.11\example\views\posts\table.js => C:\Users\Josh\.titanium\vsbuild\deviceTest\Assets\node_modules\ti.cloud\example\views\posts\table.js
[DEBUG] Copying C:\ProgramData\Application Data\Titanium\modules\commonjs\ti.cloud\3.2.11\example\views\posts\update.js => C:\Users\Josh\.titanium\vsbuild\deviceTest\Assets\node_modules\ti.cloud\example\views\posts\update.js
[DEBUG] Copying C:\ProgramData\Application Data\Titanium\modules\commonjs\ti.cloud\3.2.11\example\views\pushNotifications\notify.js => C:\Users\Josh\.titanium\vsbuild\deviceTest\Assets\node_modules\ti.cloud\example\views\pushNotifications\notify.js
[DEBUG] Copying C:\ProgramData\Application Data\Titanium\modules\commonjs\ti.cloud\3.2.11\example\views\pushNotifications\notifyTokens.js => C:\Users\Josh\.titanium\vsbuild\deviceTest\Assets\node_modules\ti.cloud\example\views\pushNotifications\notifyTokens.js
[DEBUG] Copying C:\ProgramData\Application Data\Titanium\modules\commonjs\ti.cloud\3.2.11\example\views\pushNotifications\pushManager.js => C:\Users\Josh\.titanium\vsbuild\deviceTest\Assets\node_modules\ti.cloud\example\views\pushNotifications\pushManager.js
[DEBUG] Copying C:\ProgramData\Application Data\Titanium\modules\commonjs\ti.cloud\3.2.11\example\views\pushNotifications\query.js => C:\Users\Josh\.titanium\vsbuild\deviceTest\Assets\node_modules\ti.cloud\example\views\pushNotifications\query.js
[DEBUG] Copying C:\ProgramData\Application Data\Titanium\modules\commonjs\ti.cloud\3.2.11\example\views\pushNotifications\queryChannels.js => C:\Users\Josh\.titanium\vsbuild\deviceTest\Assets\node_modules\ti.cloud\example\views\pushNotifications\queryChannels.js
[DEBUG] Copying C:\ProgramData\Application Data\Titanium\modules\commonjs\ti.cloud\3.2.11\example\views\pushNotifications\resetBadge.js => C:\Users\Josh\.titanium\vsbuild\deviceTest\Assets\node_modules\ti.cloud\example\views\pushNotifications\resetBadge.js
[DEBUG] Copying C:\ProgramData\Application Data\Titanium\modules\commonjs\ti.cloud\3.2.11\example\views\pushNotifications\setBadge.js => C:\Users\Josh\.titanium\vsbuild\deviceTest\Assets\node_modules\ti.cloud\example\views\pushNotifications\setBadge.js
[DEBUG] Copying C:\ProgramData\Application Data\Titanium\modules\commonjs\ti.cloud\3.2.11\example\views\pushNotifications\settings.js => C:\Users\Josh\.titanium\vsbuild\deviceTest\Assets\node_modules\ti.cloud\example\views\pushNotifications\settings.js
[DEBUG] Copying C:\ProgramData\Application Data\Titanium\modules\commonjs\ti.cloud\3.2.11\example\views\pushNotifications\showChannels.js => C:\Users\Josh\.titanium\vsbuild\deviceTest\Assets\node_modules\ti.cloud\example\views\pushNotifications\showChannels.js
[DEBUG] Copying C:\ProgramData\Application Data\Titanium\modules\commonjs\ti.cloud\3.2.11\example\views\pushNotifications\subscribe.js => C:\Users\Josh\.titanium\vsbuild\deviceTest\Assets\node_modules\ti.cloud\example\views\pushNotifications\subscribe.js
[DEBUG] Copying C:\ProgramData\Application Data\Titanium\modules\commonjs\ti.cloud\3.2.11\example\views\pushNotifications\subscribeToken.js => C:\Users\Josh\.titanium\vsbuild\deviceTest\Assets\node_modules\ti.cloud\example\views\pushNotifications\subscribeToken.js
[DEBUG] Copying C:\ProgramData\Application Data\Titanium\modules\commonjs\ti.cloud\3.2.11\example\views\pushNotifications\table.js => C:\Users\Josh\.titanium\vsbuild\deviceTest\Assets\node_modules\ti.cloud\example\views\pushNotifications\table.js
[DEBUG] Copying C:\ProgramData\Application Data\Titanium\modules\commonjs\ti.cloud\3.2.11\example\views\pushNotifications\unsubscribe.js => C:\Users\Josh\.titanium\vsbuild\deviceTest\Assets\node_modules\ti.cloud\example\views\pushNotifications\unsubscribe.js
[DEBUG] Copying C:\ProgramData\Application Data\Titanium\modules\commonjs\ti.cloud\3.2.11\example\views\pushNotifications\unsubscribeToken.js => C:\Users\Josh\.titanium\vsbuild\deviceTest\Assets\node_modules\ti.cloud\example\views\pushNotifications\unsubscribeToken.js
[DEBUG] Copying C:\ProgramData\Application Data\Titanium\modules\commonjs\ti.cloud\3.2.11\example\views\pushNotifications\updateSubscription.js => C:\Users\Josh\.titanium\vsbuild\deviceTest\Assets\node_modules\ti.cloud\example\views\pushNotifications\updateSubscription.js
[DEBUG] Copying C:\ProgramData\Application Data\Titanium\modules\commonjs\ti.cloud\3.2.11\example\views\pushSchedules\create.js => C:\Users\Josh\.titanium\vsbuild\deviceTest\Assets\node_modules\ti.cloud\example\views\pushSchedules\create.js
[DEBUG] Copying C:\ProgramData\Application Data\Titanium\modules\commonjs\ti.cloud\3.2.11\example\views\pushSchedules\query.js => C:\Users\Josh\.titanium\vsbuild\deviceTest\Assets\node_modules\ti.cloud\example\views\pushSchedules\query.js
[DEBUG] Copying C:\ProgramData\Application Data\Titanium\modules\commonjs\ti.cloud\3.2.11\example\views\pushSchedules\remove.js => C:\Users\Josh\.titanium\vsbuild\deviceTest\Assets\node_modules\ti.cloud\example\views\pushSchedules\remove.js
[DEBUG] Copying C:\ProgramData\Application Data\Titanium\modules\commonjs\ti.cloud\3.2.11\example\views\pushSchedules\table.js => C:\Users\Josh\.titanium\vsbuild\deviceTest\Assets\node_modules\ti.cloud\example\views\pushSchedules\table.js
[DEBUG] Copying C:\ProgramData\Application Data\Titanium\modules\commonjs\ti.cloud\3.2.11\example\views\reviews\create.js => C:\Users\Josh\.titanium\vsbuild\deviceTest\Assets\node_modules\ti.cloud\example\views\reviews\create.js
[DEBUG] Copying C:\ProgramData\Application Data\Titanium\modules\commonjs\ti.cloud\3.2.11\example\views\reviews\query.js => C:\Users\Josh\.titanium\vsbuild\deviceTest\Assets\node_modules\ti.cloud\example\views\reviews\query.js
[DEBUG] Copying C:\ProgramData\Application Data\Titanium\modules\commonjs\ti.cloud\3.2.11\example\views\reviews\remove.js => C:\Users\Josh\.titanium\vsbuild\deviceTest\Assets\node_modules\ti.cloud\example\views\reviews\remove.js
[DEBUG] Copying C:\ProgramData\Application Data\Titanium\modules\commonjs\ti.cloud\3.2.11\example\views\reviews\show.js => C:\Users\Josh\.titanium\vsbuild\deviceTest\Assets\node_modules\ti.cloud\example\views\reviews\show.js
[DEBUG] Copying C:\ProgramData\Application Data\Titanium\modules\commonjs\ti.cloud\3.2.11\example\views\reviews\table.js => C:\Users\Josh\.titanium\vsbuild\deviceTest\Assets\node_modules\ti.cloud\example\views\reviews\table.js
[DEBUG] Copying C:\ProgramData\Application Data\Titanium\modules\commonjs\ti.cloud\3.2.11\example\views\reviews\update.js => C:\Users\Josh\.titanium\vsbuild\deviceTest\Assets\node_modules\ti.cloud\example\views\reviews\update.js
[DEBUG] Copying C:\ProgramData\Application Data\Titanium\modules\commonjs\ti.cloud\3.2.11\example\views\social\externalLink.js => C:\Users\Josh\.titanium\vsbuild\deviceTest\Assets\node_modules\ti.cloud\example\views\social\externalLink.js
[DEBUG] Copying C:\ProgramData\Application Data\Titanium\modules\commonjs\ti.cloud\3.2.11\example\views\social\externalLogin.js => C:\Users\Josh\.titanium\vsbuild\deviceTest\Assets\node_modules\ti.cloud\example\views\social\externalLogin.js
[DEBUG] Copying C:\ProgramData\Application Data\Titanium\modules\commonjs\ti.cloud\3.2.11\example\views\social\externalUnlink.js => C:\Users\Josh\.titanium\vsbuild\deviceTest\Assets\node_modules\ti.cloud\example\views\social\externalUnlink.js
[DEBUG] Copying C:\ProgramData\Application Data\Titanium\modules\commonjs\ti.cloud\3.2.11\example\views\social\searchFacebookFriends.js => C:\Users\Josh\.titanium\vsbuild\deviceTest\Assets\node_modules\ti.cloud\example\views\social\searchFacebookFriends.js
[DEBUG] Copying C:\ProgramData\Application Data\Titanium\modules\commonjs\ti.cloud\3.2.11\example\views\social\table.js => C:\Users\Josh\.titanium\vsbuild\deviceTest\Assets\node_modules\ti.cloud\example\views\social\table.js
[DEBUG] Copying C:\ProgramData\Application Data\Titanium\modules\commonjs\ti.cloud\3.2.11\example\views\status\create.js => C:\Users\Josh\.titanium\vsbuild\deviceTest\Assets\node_modules\ti.cloud\example\views\status\create.js
[DEBUG] Copying C:\ProgramData\Application Data\Titanium\modules\commonjs\ti.cloud\3.2.11\example\views\status\query.js => C:\Users\Josh\.titanium\vsbuild\deviceTest\Assets\node_modules\ti.cloud\example\views\status\query.js
[DEBUG] Copying C:\ProgramData\Application Data\Titanium\modules\commonjs\ti.cloud\3.2.11\example\views\status\remove.js => C:\Users\Josh\.titanium\vsbuild\deviceTest\Assets\node_modules\ti.cloud\example\views\status\remove.js
[DEBUG] Copying C:\ProgramData\Application Data\Titanium\modules\commonjs\ti.cloud\3.2.11\example\views\status\search.js => C:\Users\Josh\.titanium\vsbuild\deviceTest\Assets\node_modules\ti.cloud\example\views\status\search.js
[DEBUG] Copying C:\ProgramData\Application Data\Titanium\modules\commonjs\ti.cloud\3.2.11\example\views\status\show.js => C:\Users\Josh\.titanium\vsbuild\deviceTest\Assets\node_modules\ti.cloud\example\views\status\show.js
[DEBUG] Copying C:\ProgramData\Application Data\Titanium\modules\commonjs\ti.cloud\3.2.11\example\views\status\table.js => C:\Users\Josh\.titanium\vsbuild\deviceTest\Assets\node_modules\ti.cloud\example\views\status\table.js
[DEBUG] Copying C:\ProgramData\Application Data\Titanium\modules\commonjs\ti.cloud\3.2.11\example\views\status\update.js => C:\Users\Josh\.titanium\vsbuild\deviceTest\Assets\node_modules\ti.cloud\example\views\status\update.js
[DEBUG] Copying C:\ProgramData\Application Data\Titanium\modules\commonjs\ti.cloud\3.2.11\example\views\users\create.js => C:\Users\Josh\.titanium\vsbuild\deviceTest\Assets\node_modules\ti.cloud\example\views\users\create.js
[DEBUG] Copying C:\ProgramData\Application Data\Titanium\modules\commonjs\ti.cloud\3.2.11\example\views\users\login.js => C:\Users\Josh\.titanium\vsbuild\deviceTest\Assets\node_modules\ti.cloud\example\views\users\login.js
[DEBUG] Copying C:\ProgramData\Application Data\Titanium\modules\commonjs\ti.cloud\3.2.11\example\views\users\loginStatus.js => C:\Users\Josh\.titanium\vsbuild\deviceTest\Assets\node_modules\ti.cloud\example\views\users\loginStatus.js
[DEBUG] Copying C:\ProgramData\Application Data\Titanium\modules\commonjs\ti.cloud\3.2.11\example\views\users\logout.js => C:\Users\Josh\.titanium\vsbuild\deviceTest\Assets\node_modules\ti.cloud\example\views\users\logout.js
[DEBUG] Copying C:\ProgramData\Application Data\Titanium\modules\commonjs\ti.cloud\3.2.11\example\views\users\query.js => C:\Users\Josh\.titanium\vsbuild\deviceTest\Assets\node_modules\ti.cloud\example\views\users\query.js
[DEBUG] Copying C:\ProgramData\Application Data\Titanium\modules\commonjs\ti.cloud\3.2.11\example\views\users\remove.js => C:\Users\Josh\.titanium\vsbuild\deviceTest\Assets\node_modules\ti.cloud\example\views\users\remove.js
[DEBUG] Copying C:\ProgramData\Application Data\Titanium\modules\commonjs\ti.cloud\3.2.11\example\views\users\requestResetPassword.js => C:\Users\Josh\.titanium\vsbuild\deviceTest\Assets\node_modules\ti.cloud\example\views\users\requestResetPassword.js
[DEBUG] Copying C:\ProgramData\Application Data\Titanium\modules\commonjs\ti.cloud\3.2.11\example\views\users\resendConfirmation.js => C:\Users\Josh\.titanium\vsbuild\deviceTest\Assets\node_modules\ti.cloud\example\views\users\resendConfirmation.js
[DEBUG] Copying C:\ProgramData\Application Data\Titanium\modules\commonjs\ti.cloud\3.2.11\example\views\users\search.js => C:\Users\Josh\.titanium\vsbuild\deviceTest\Assets\node_modules\ti.cloud\example\views\users\search.js
[DEBUG] Copying C:\ProgramData\Application Data\Titanium\modules\commonjs\ti.cloud\3.2.11\example\views\users\show.js => C:\Users\Josh\.titanium\vsbuild\deviceTest\Assets\node_modules\ti.cloud\example\views\users\show.js
[DEBUG] Copying C:\ProgramData\Application Data\Titanium\modules\commonjs\ti.cloud\3.2.11\example\views\users\showMe.js => C:\Users\Josh\.titanium\vsbuild\deviceTest\Assets\node_modules\ti.cloud\example\views\users\showMe.js
[DEBUG] Copying C:\ProgramData\Application Data\Titanium\modules\commonjs\ti.cloud\3.2.11\example\views\users\table.js => C:\Users\Josh\.titanium\vsbuild\deviceTest\Assets\node_modules\ti.cloud\example\views\users\table.js
[DEBUG] Copying C:\ProgramData\Application Data\Titanium\modules\commonjs\ti.cloud\3.2.11\example\views\users\update.js => C:\Users\Josh\.titanium\vsbuild\deviceTest\Assets\node_modules\ti.cloud\example\views\users\update.js
[DEBUG] Copying C:\ProgramData\Application Data\Titanium\modules\commonjs\ti.cloud\3.2.11\LICENSE => C:\Users\Josh\.titanium\vsbuild\deviceTest\Assets\node_modules\ti.cloud\LICENSE
[DEBUG] Copying C:\ProgramData\Application Data\Titanium\modules\commonjs\ti.cloud\3.2.11\manifest => C:\Users\Josh\.titanium\vsbuild\deviceTest\Assets\node_modules\ti.cloud\manifest
[DEBUG] Copying C:\ProgramData\Application Data\Titanium\modules\commonjs\ti.cloud\3.2.11\package.json => C:\Users\Josh\.titanium\vsbuild\deviceTest\Assets\node_modules\ti.cloud\package.json
[DEBUG] Copying C:\ProgramData\Application Data\Titanium\modules\commonjs\ti.cloud\3.2.11\ti.cloud.js => C:\Users\Josh\.titanium\vsbuild\deviceTest\Assets\node_modules\ti.cloud\ti.cloud.js
[DEBUG] Copying C:\Users\Josh\appc\deviceTest\platform\windows\alloy_generated => C:\Users\Josh\.titanium\vsbuild\deviceTest\alloy_generated
[INFO] Processing JavaScript files
[DEBUG] Copying C:\Users\Josh\appc\deviceTest\Resources\alloy\CFG.js => C:\Users\Josh\.titanium\vsbuild\deviceTest\Assets\alloy\CFG.js
[DEBUG] Copying C:\Users\Josh\appc\deviceTest\Resources\windows\app.js => C:\Users\Josh\.titanium\vsbuild\deviceTest\Assets\app.js
[DEBUG] Copying C:\Users\Josh\appc\deviceTest\Resources\windows\alloy\backbone.js => C:\Users\Josh\.titanium\vsbuild\deviceTest\Assets\alloy\backbone.js
[DEBUG] Copying C:\Users\Josh\appc\deviceTest\Resources\windows\alloy\constants.js => C:\Users\Josh\.titanium\vsbuild\deviceTest\Assets\alloy\constants.js
[DEBUG] Copying C:\Users\Josh\appc\deviceTest\Resources\windows\alloy\controllers\BaseController.js => C:\Users\Josh\.titanium\vsbuild\deviceTest\Assets\alloy\controllers\BaseController.js
[DEBUG] Copying C:\Users\Josh\appc\deviceTest\Resources\windows\alloy\controllers\index.js => C:\Users\Josh\.titanium\vsbuild\deviceTest\Assets\alloy\controllers\index.js
[DEBUG] Copying C:\Users\Josh\appc\deviceTest\Resources\windows\alloy\styles\index.js => C:\Users\Josh\.titanium\vsbuild\deviceTest\Assets\alloy\styles\index.js
[DEBUG] Copying C:\Users\Josh\appc\deviceTest\Resources\windows\alloy\sync\localStorage.js => C:\Users\Josh\.titanium\vsbuild\deviceTest\Assets\alloy\sync\localStorage.js
[DEBUG] Copying C:\Users\Josh\appc\deviceTest\Resources\windows\alloy\sync\properties.js => C:\Users\Josh\.titanium\vsbuild\deviceTest\Assets\alloy\sync\properties.js
[DEBUG] Copying C:\Users\Josh\appc\deviceTest\Resources\windows\alloy\sync\sql.js => C:\Users\Josh\.titanium\vsbuild\deviceTest\Assets\alloy\sync\sql.js
[DEBUG] Copying C:\Users\Josh\appc\deviceTest\Resources\windows\alloy\underscore.js => C:\Users\Josh\.titanium\vsbuild\deviceTest\Assets\alloy\underscore.js
[DEBUG] Copying C:\Users\Josh\appc\deviceTest\Resources\windows\alloy\widget.js => C:\Users\Josh\.titanium\vsbuild\deviceTest\Assets\alloy\widget.js
[DEBUG] Copying C:\Users\Josh\appc\deviceTest\Resources\windows\alloy.js => C:\Users\Josh\.titanium\vsbuild\deviceTest\Assets\alloy.js
[INFO] Encrypting JavaScript files: C:\ProgramData\Titanium\mobilesdk\win32\7.3.0.v20180618062809\windows\titanium_prep.win32.exe "com.appc.dev" "C:\Users\Josh\.titanium\vsbuild\deviceTest\Assets" "--file-listing" "C:\Users\Josh\.titanium\vsbuild\deviceTest\titanium_prep_listing.txt"
[DEBUG] 32-bit titanium prep failed, trying again using 64-bit
[INFO] Encrypting JavaScript files: C:\ProgramData\Titanium\mobilesdk\win32\7.3.0.v20180618062809\windows\titanium_prep.win64.exe "com.appc.dev" "C:\Users\Josh\.titanium\vsbuild\deviceTest\Assets" "--file-listing" "C:\Users\Josh\.titanium\vsbuild\deviceTest\titanium_prep_listing.txt"
[INFO] Generating i18n files
[DEBUG] Compiling localization files
[DEBUG] Writing en strings => C:\Users\Josh\.titanium\vsbuild\deviceTest\Strings\en\Resources.resw
[INFO] Writing appxmanifest C:\Users\Josh\.titanium\vsbuild\deviceTest\Package.store.appxmanifest.in
[INFO] Writing appxmanifest C:\Users\Josh\.titanium\vsbuild\deviceTest\Package.phone.appxmanifest.in
[INFO] Writing appxmanifest C:\Users\Josh\.titanium\vsbuild\deviceTest\Package.win10.appxmanifest.in
[INFO] Generating Native Types
[DEBUG] targetPlatformSdkVersion: 10.0.15063.0
[DEBUG] targetPlatformSdkMinVersion: 10.0.10240.0
[INFO] Setting up native modules for CMakeLists.txt...
[TRACE] Adding native module listing to RequireHook.cpp...
[INFO] Writing CMakeLists.txt: C:\Users\Josh\.titanium\vsbuild\deviceTest\CMakeLists.txt
[INFO] Running cmake at C:\ProgramData\Titanium\mobilesdk\win32\7.3.0.v20180618062809\windows\cli\vendor\cmake\bin\cmake.exe in directory C:\Users\Josh\.titanium\vsbuild\deviceTest\win10.ARM
[DEBUG] C:\ProgramData\Titanium\mobilesdk\win32\7.3.0.v20180618062809\windows\cli\vendor\cmake\bin\cmake.exe [
"-G",
"Visual Studio 15 2017 ARM",
"-DCMAKE_SYSTEM_NAME=WindowsStore",
"-DCMAKE_SYSTEM_VERSION=10.0.15063.0",
"-DHAL_RENAME_AXWAYHAL=ON",
"C:\\Users\\Josh\\.titanium\\vsbuild\\deviceTest"
]
[INFO] -- The C compiler identification is MSVC 19.14.26430.0
[INFO] -- The CXX compiler identification is MSVC 19.14.26430.0
[INFO] -- Check for working C compiler: C:/Program Files (x86)/Microsoft Visual Studio/2017/Community/VC/Tools/MSVC/14.14.26428/bin/Hostx86/arm/cl.exe
[INFO] -- Check for working C compiler: C:/Program Files (x86)/Microsoft Visual Studio/2017/Community/VC/Tools/MSVC/14.14.26428/bin/Hostx86/arm/cl.exe -- works
[INFO] -- Detecting C compiler ABI info
[INFO] -- Detecting C compiler ABI info - done
[INFO] -- Check for working CXX compiler: C:/Program Files (x86)/Microsoft Visual Studio/2017/Community/VC/Tools/MSVC/14.14.26428/bin/Hostx86/arm/cl.exe
[INFO] -- Check for working CXX compiler: C:/Program Files (x86)/Microsoft Visual Studio/2017/Community/VC/Tools/MSVC/14.14.26428/bin/Hostx86/arm/cl.exe -- works
[INFO] -- Detecting CXX compiler ABI info
[INFO] -- Detecting CXX compiler ABI info - done
[INFO] -- Detecting CXX compile features
[INFO] -- Detecting CXX compile features - done
[INFO] -- Could NOT find GTest (missing: GTEST_LIBRARY GTEST_INCLUDE_DIR GTEST_MAIN_LIBRARY)
[INFO] -- Found PythonInterp: C:/Python27/python.exe (found version "2.7.14")
[INFO] -- Performing Test COMPILER_HAS_DEPRECATED_ATTR
[INFO] -- Performing Test COMPILER_HAS_DEPRECATED_ATTR - Failed
[INFO] -- Performing Test COMPILER_HAS_DEPRECATED
[INFO] -- Performing Test COMPILER_HAS_DEPRECATED - Failed
[INFO] -- Configuring done
[INFO] -- Generating done
[INFO] -- Build files have been written to: C:/Users/Josh/.titanium/vsbuild/deviceTest/win10.ARM
[TRACE] MSBuild auto-detection: using msbuild version '15.7.179.6572' from 'C:\Program Files (x86)\Microsoft Visual Studio\2017\Community\MSBuild\15.0\bin'.
[DEBUG] Nothing to do. None of the projects in this solution specify any packages for NuGet to restore.
[INFO] Targeting Windows SDK: 10.0.15063.0
[INFO] Running MSBuild on solution: C:\Users\Josh\.titanium\vsbuild\deviceTest\win10.ARM\DeviceTest.sln
[DEBUG] **********************************************************************
[DEBUG] ** Visual Studio 2017 Developer Command Prompt v15.7.3
** Copyright (c) 2017 Microsoft Corporation
**********************************************************************
[DEBUG] Microsoft (R) Build Engine version 15.7.179.6572 for .NET Framework
Copyright (C) Microsoft Corporation. All rights reserved.
[DEBUG] Building the projects in this solution one at a time. To enable parallel build, please add the "/m" switch.
[DEBUG] Build started 19-Jun-18 3:04:48 PM.
[TRACE] Project "C:\Users\Josh\.titanium\vsbuild\deviceTest\win10.ARM\DeviceTest.sln" on node 1 (default targets).
[DEBUG] ValidateSolutionConfiguration:
Building solution configuration "Debug|ARM".
[DEBUG] ValidateProjects:
The project "ALL_BUILD" is not selected for building in solution configuration "Debug|ARM".
[TRACE] Project "C:\Users\Josh\.titanium\vsbuild\deviceTest\win10.ARM\DeviceTest.sln" (1) is building "C:\Users\Josh\.titanium\vsbuild\deviceTest\win10.ARM\DeviceTest.vcxproj.metaproj" (2) on node 1 (default targets).
Project "C:\Users\Josh\.titanium\vsbuild\deviceTest\win10.ARM\DeviceTest.vcxproj.metaproj" (2) is building "C:\Users\Josh\.titanium\vsbuild\deviceTest\win10.ARM\Native\TitaniumWindows_Native.vcxproj.metaproj" (3) on node 1 (default targets).
[ERROR] Project "C:\Users\Josh\.titanium\vsbuild\deviceTest\win10.ARM\Native\TitaniumWindows_Native.vcxproj.metaproj" (3) is building "C:\Users\Josh\.titanium\vsbuild\deviceTest\win10.ARM\ZERO_CHECK.vcxproj" (4) on node 1 (default targets).
C:\Program Files (x86)\Microsoft Visual Studio\2017\Community\Common7\IDE\VC\VCTargets\Microsoft.Cpp.WindowsSDK.targets(55,5): error : Warning: Full debug symbol generation from partial PDBs is not supported for static libraries. [C:\Users\Josh\.titanium\vsbuild\deviceTest\win10.ARM\ZERO_CHECK.vcxproj]
Done Building Project "C:\Users\Josh\.titanium\vsbuild\deviceTest\win10.ARM\ZERO_CHECK.vcxproj" (default targets) -- FAILED.
[TRACE] Done Building Project "C:\Users\Josh\.titanium\vsbuild\deviceTest\win10.ARM\Native\TitaniumWindows_Native.vcxproj.metaproj" (default targets) -- FAILED.
[TRACE] Done Building Project "C:\Users\Josh\.titanium\vsbuild\deviceTest\win10.ARM\DeviceTest.vcxproj.metaproj" (default targets) -- FAILED.
[TRACE] Done Building Project "C:\Users\Josh\.titanium\vsbuild\deviceTest\win10.ARM\DeviceTest.sln" (default targets) -- FAILED.
[DEBUG] Build FAILED.
[DEBUG]
[TRACE] "C:\Users\Josh\.titanium\vsbuild\deviceTest\win10.ARM\DeviceTest.sln" (default target) (1) ->
"C:\Users\Josh\.titanium\vsbuild\deviceTest\win10.ARM\DeviceTest.vcxproj.metaproj" (default target) (2) ->
"C:\Users\Josh\.titanium\vsbuild\deviceTest\win10.ARM\Native\TitaniumWindows_Native.vcxproj.metaproj" (default target) (3) ->
[ERROR] "C:\Users\Josh\.titanium\vsbuild\deviceTest\win10.ARM\ZERO_CHECK.vcxproj" (default target) (4) ->
(_CheckWindowsSDKInstalled target) ->
C:\Program Files (x86)\Microsoft Visual Studio\2017\Community\Common7\IDE\VC\VCTargets\Microsoft.Cpp.WindowsSDK.targets(55,5): error : Warning: Full debug symbol generation from partial PDBs is not supported for static libraries. [C:\Users\Josh\.titanium\vsbuild\deviceTest\win10.ARM\ZERO_CHECK.vcxproj]
0 Warning(s)
1 Error(s)
Time Elapsed 00:00:00.19
C:\Users\Josh\appc\deviceTest>
Sign up for free to join this conversation on GitHub. Already have an account? Sign in to comment
You can’t perform that action at this time.