Skip to content

Instantly share code, notes, and snippets.

Embed
What would you like to do?
12:31:10.2031260 *** Executing monotouchtest/iOS on device 'XQAiPodTouch5f' ***
12:31:10.2097510 /Users/mandel/Xamarin/xamarin-macios/master/xamarin-macios/_ios-build/Library/Frameworks/Xamarin.iOS.framework/Versions/Current/bin/mlaunch --list-crash-reports=/var/folders/q_/0bkgg2v13s7b35rtg3n2d8xm0000gn/T/tmp7a682b58.tmp --devname XQAiPodTouch5f
12:31:10.4918450 Using Xcode 11.4 found in /Applications/Xcode114.app/Contents/Developer
12:31:12.3079460 Starting test run
12:31:12.3091180 Starting tcp tunnel between mac port: 52999 and devie port 52999.
12:31:12.3096990 The tcp tunnel output is 12:31:12.3095870 /Users/mandel/Xamarin/xamarin-macios/master/xamarin-macios/_ios-build/Library/Frameworks/Xamarin.iOS.framework/Versions/Current/bin/mlaunch --tcp-tunnel=52999:52999 -v --devname XQAiPodTouch5f
12:31:12.5846900 The tcp tunnel output is 12:31:12.5845000 Using Xcode 11.4 found in /Applications/Xcode114.app/Contents/Developer
12:31:18.8206660 The tcp tunnel output is 12:31:18.8206500 Please connect the device 'Tcp tunnel started on device port 52999 to host port 52999 for device XQAiPodTouch5f'...
12:31:18.8206880 Tcp tunnel created on port 5299912:31:18.8215370 12:31:18.8214320 /Users/mandel/Xamarin/xamarin-macios/master/xamarin-macios/_ios-build/Library/Frameworks/Xamarin.iOS.framework/Versions/Current/bin/mlaunch -v -argument=-connection-mode -argument=none -argument=-app-arg:-autostart -setenv=NUNIT_AUTOSTART=true -argument=-app-arg:-autoexit -setenv=NUNIT_AUTOEXIT=true -argument=-app-arg:-enablenetwork -setenv=NUNIT_ENABLE_NETWORK=true -argument=-app-arg:-hostname:10.0.1.12,10.10.64.232,fe80::8e0:af06:e05f:1b58,fe80::2c22:3bff:fe4c:5ff8,fe80::2c22:3bff:fe4c:5ff8,fe80::a10b:aa55:7aeb:42b4,fe80::4601:ea30:f7d5:e2d3,fe80::50:41ff:fe00:101,2001:4898:2808:101:8000:0:8:8894 -setenv=NUNIT_HOSTNAME=10.0.1.12,10.10.64.232,fe80::8e0:af06:e05f:1b58,fe80::2c22:3bff:fe4c:5ff8,fe80::2c22:3bff:fe4c:5ff8,fe80::a10b:aa55:7aeb:42b4,fe80::4601:ea30:f7d5:e2d3,fe80::50:41ff:fe00:101,2001:4898:2808:101:8000:0:8:8894 -argument=-app-arg:-transport:Tcp -setenv=NUNIT_TRANSPORT=TCP -argument=-app-arg:-hostport:52999 -setenv=NUNIT_HOSTPORT=52999 -setenv=USE_TCP_TUNNEL=true --launchdev /Users/mandel/Xamarin/xamarin-macios/master/xamarin-macios/tests/xharness/tmp-test-dir/monotouch-test180/bin/iPhone/Debug32-unified/monotouchtest.app --disable-memory-limits --wait-for-exit --devname XQAiPodTouch5f
12:31:19.1030700 12:31:19.1030380 Using Xcode 11.4 found in /Applications/Xcode114.app/Contents/Developer
12:31:19.1045800 12:31:19.1045720 Xamarin.Hosting: Xamarin.Hosting
12:31:19.1046550 12:31:19.1046440 Xamarin.Hosting: Version: 5dbf6f4c5f (master)
12:31:19.1046890 12:31:19.1046840 Xamarin.Hosting: Xcode: /Applications/Xcode114.app
12:31:19.1063550 12:31:19.1063470 Xamarin.Hosting: Xcode Version: 11.4
12:31:19.1068860 12:31:19.1068770 Xamarin.Hosting: Verbosity: 11
12:31:19.1168710 12:31:19.1168550 Xamarin.Hosting: Loaded /Applications/Xcode114.app/Contents/SharedFrameworks/DVTFoundation.framework/Versions/A/DVTFoundation
12:31:19.1208870 12:31:19.1208780 Xamarin.Hosting: Loaded /Applications/Xcode114.app/Contents/SharedFrameworks/DVTiPhoneSimulatorRemoteClient.framework/DVTiPhoneSimulatorRemoteClient
12:31:19.1209770 12:31:19.1209640 Xamarin.Hosting: Loaded /Library/Developer/PrivateFrameworks/CoreSimulator.framework/CoreSimulator
12:31:19.1210930 12:31:19.1210850 Xamarin.Hosting: Loaded /Applications/Xcode114.app/Contents/SharedFrameworks/DTDeviceKitBase.framework/DTDeviceKitBase
12:31:19.1337060 12:31:19.1336870 Xamarin.Hosting: Loaded /Applications/Xcode114.app/Contents/SharedFrameworks/DVTKit.framework/DVTKit
12:31:19.1341860 12:31:19.1341800 Xamarin.Hosting: Loaded /Applications/Xcode114.app/Contents/SharedFrameworks/DTDeviceKit.framework/DTDeviceKit
12:31:19.1342840 12:31:19.1342790 Xamarin.Hosting: Loaded /Applications/Xcode114.app/Contents/SharedFrameworks/DTXConnectionServices.framework/DTXConnectionServices
12:31:19.1351310 12:31:19.1351240 Xamarin.Hosting: Loaded /Applications/Xcode114.app/Contents/SharedFrameworks/DVTSourceControl.framework/DVTSourceControl
12:31:19.1352470 12:31:19.1352420 Xamarin.Hosting: Loaded /Applications/Xcode114.app/Contents/SharedFrameworks/DVTServices.framework/DVTServices
12:31:19.1353550 12:31:19.1353510 Xamarin.Hosting: Loaded /Applications/Xcode114.app/Contents/SharedFrameworks/DVTPortal.framework/DVTPortal
12:31:19.1882680 12:31:19.1882470 Xamarin.Hosting: Loaded /Applications/Xcode114.app/Contents/SharedFrameworks/DVTDocumentation.framework/DVTDocumentation
12:31:19.1890140 12:31:19.1890050 Xamarin.Hosting: Loaded /Applications/Xcode114.app/Contents/SharedFrameworks/DVTAnalyticsClient.framework/DVTAnalyticsClient
12:31:19.1900490 12:31:19.1900380 Xamarin.Hosting: Loaded /Applications/Xcode114.app/Contents/SharedFrameworks/DVTAnalytics.framework/DVTAnalytics
12:31:19.1921360 12:31:19.1921270 Xamarin.Hosting: Loaded /Applications/Xcode114.app/Contents/SharedFrameworks/SourceKit.framework/SourceKit
12:31:19.2128700 12:31:19.2128500 Xamarin.Hosting: Loaded /Applications/Xcode114.app/Contents/Frameworks/IDEFoundation.framework/IDEFoundation
12:31:19.2138780 12:31:19.2138690 Xamarin.Hosting: Loaded /Applications/Xcode114.app/Contents/SharedFrameworks/IDEProducts.framework/IDEProducts
12:31:19.2435330 12:31:19.2435150 Xamarin.Hosting: Loaded /Applications/Xcode114.app/Contents/SharedFrameworks/DTGraphKit.framework/DTGraphKit
12:31:19.2438430 12:31:19.2438280 Xamarin.Hosting: Loaded /Applications/Xcode114.app/Contents/SharedFrameworks/DVTDeveloperModeHelper.framework/DVTDeveloperModeHelper
12:31:19.2555680 12:31:19.2555490 Xamarin.Hosting: Loaded /Applications/Xcode114.app/Contents/Frameworks/IDEKit.framework/IDEKit
12:31:19.2585390 12:31:19.2585290 Xamarin.Hosting: Loaded /Applications/Xcode114.app/Contents/Frameworks/IBFoundation.framework/IBFoundation
12:31:19.2593170 12:31:19.2593090 Xamarin.Hosting: Loaded /Applications/Xcode114.app/Contents/Frameworks/IBAutolayoutFoundation.framework/IBAutolayoutFoundation
12:31:19.2598500 12:31:19.2598410 Xamarin.Hosting: Loaded /Applications/Xcode114.app/Contents/SharedFrameworks/DebugHierarchyFoundation.framework/DebugHierarchyFoundation
12:31:19.2604220 12:31:19.2604110 Xamarin.Hosting: Loaded /Applications/Xcode114.app/Contents/SharedFrameworks/DebugHierarchyKit.framework/DebugHierarchyKit
12:31:19.4920590 12:31:19.4920390 Xamarin.Hosting: Loaded Xcode plugins successfully.
12:31:19.4971270 12:31:19.4971090 Xamarin.Hosting: Device discovery started
12:31:20.1163960 12:31:20.1163770 Xamarin.Hosting: Device discovery event: Connected (bd3fd054136767445ff47819f65b74867a48e591)
12:31:20.1336130 12:31:20.1335940 Xamarin.Hosting: Device discovery event: GizmoPaired (00008006-0002058626A2002E)
12:31:20.1336510 12:31:20.1336460 Xamarin.Hosting: Device discovery event: GizmoPaired (0d116083a6e3e133a9519776f5e495809e8c928a)
12:31:20.1522180 12:31:20.1521990 Xamarin.Hosting: Connected to iPhone (bd3fd054136767445ff47819f65b74867a48e591) in 00:00:00.0217570
12:31:20.3079880 12:31:20.3079690 Xamarin.Hosting: Device discovery event: Connected (28dc7b6d60dd27cf1ef5967d51c07546de0a4187)
12:31:20.3121880 12:31:20.3121770 Xamarin.Hosting: Connected to XQAiPodTouch5f (28dc7b6d60dd27cf1ef5967d51c07546de0a4187) in 00:00:00.0021671
12:31:20.4538310 12:31:20.4538130 Xamarin.Hosting: Failed to get value 'EnableWifiDebugging' from the device bd3fd054136767445ff47819f65b74867a48e591: Missing Value Error (error: 0xe8000015)
12:31:20.4540400 12:31:20.4540320 Xamarin.Hosting: Wifi debugging is disabled for the device 'iPhone'. Please enable wireless debugging in Xcode in order to use this device wirelessly.
12:31:20.4700900 12:31:20.4700800 Xamarin.Hosting: Ignoring wireless connection to iPhone because wireless debugging is disabled for this device.
12:31:21.2498690 12:31:21.2498500 Xamarin.Hosting: Connecting to 'XQAiPodTouch5f', token is 0x7fdd255aa070
12:31:21.5035110 12:31:21.5034930 Xamarin.Hosting: Connected to 'XQAiPodTouch5f'
12:31:21.5037580 12:31:21.5037490 Xamarin.Hosting: Mounting developer image on 'XQAiPodTouch5f'
12:31:21.5040370 12:31:21.5040290 Xamarin.Hosting: Mounted developer image on 'XQAiPodTouch5f'
12:31:23.9249970 12:31:23.9249870 Xamarin.Hosting: Launched com.xamarin.monotouch-test with PID: 423
12:31:23.9253450 12:31:23.9253370 Launched application 'com.xamarin.monotouch-test' on 'XQAiPodTouch5f' with pid 423
12:31:24.4170980 12:31:24.4170800 2020-03-29 12:31:20.606 monotouchtest[423:244692] Xamarin.iOS: Not connecting to the IDE, debug has been disabled
12:31:36.3660070 12:31:36.3659890 2020-03-29 12:31:32.557 monotouchtest[423:244692] Unknown transport 'Tcp': switching to default (TCP)
12:31:36.3738010 12:31:36.3737830 2020-03-29 12:31:32.565 monotouchtest[423:244692] [3/29/2020 12:31:32 PM] Sending 'Run Everything' results to 52999 over a tcp tunnel
12:31:36.6861930 Test log server listening on: 0.0.0.0:52999
12:31:36.6874260 Connection from 127.0.0.1:52999 saving logs to /Users/mandel/Xamarin/xamarin-macios/master/xamarin-macios/jenkins-results/tests/20200329_122859/monotouch-test/357/test-ios-20200329_123110.log
12:31:36.6879930 Test run started
12:31:38.1514170 12:31:38.1513930 2020-03-29 12:31:34.343 monotouchtest[423:244692] System.Net.Http.HttpClientHandler
12:31:38.1556310 12:31:38.1556130 2020-03-29 12:31:34.346 monotouchtest[423:244692] System.Net.Http.CFNetworkHandler
12:31:38.1564660 12:31:38.1564580 2020-03-29 12:31:34.347 monotouchtest[423:244692] System.Net.Http.NSUrlSessionHandler
12:31:38.5960670 12:31:38.5960470 2020-03-29 12:31:34.787 monotouchtest[423:244692] System.Net.Http.HttpClientHandler
12:31:38.5960980 12:31:38.5960940 2020-03-29 12:31:34.788 monotouchtest[423:244692] System.Net.Http.CFNetworkHandler
12:31:38.5961100 12:31:38.5961040 2020-03-29 12:31:34.789 monotouchtest[423:244692] System.Net.Http.NSUrlSessionHandler
12:31:38.8372610 12:31:38.8372370 2020-03-29 12:31:35.028 monotouchtest[423:244692] System.Net.Http.HttpClientHandler
12:31:38.8372940 12:31:38.8372890 2020-03-29 12:31:35.029 monotouchtest[423:244692] System.Net.Http.CFNetworkHandler
12:31:38.8373050 12:31:38.8373010 2020-03-29 12:31:35.030 monotouchtest[423:244692] System.Net.Http.NSUrlSessionHandler
12:31:41.9243460 12:31:41.9243240 2020-03-29 12:31:38.107 monotouchtest[423:244692] |AXSpeechAssetDownloader|error| ASAssetQuery error fetching results (for com.apple.MobileAsset.MacinTalkVoiceAssets) Error Domain=ASError Code=21 "Unable to copy asset information" UserInfo={NSDescription=Unable to copy asset information}
12:31:42.1729380 12:31:42.1729200 AB: Could not compile statement for query (ABCCopyArrayOfAllInstancesOfClassInSourceMatchingPredicates):
12:31:42.1729610 12:31:42.1729560 SELECT ROWID, Name, ExternalIdentifier, Type, ConstraintsPath, ExternalModificationTag, ExternalSyncTag, AccountID, Enabled, SyncData, MeIdentifier, Capabilities FROM ABStore WHERE Enabled = ?;
12:31:42.1729720 12:31:42.1729680 AB: Could not compile statement for query (ABCCopyArrayOfAllInstancesOfClassInSourceMatchingPredicates):
12:31:42.1729810 12:31:42.1729770 SELECT ROWID, Name, ExternalIdentifier, Type, ConstraintsPath, ExternalModificationTag, ExternalSyncTag, AccountID, Enabled, SyncData, MeIdentifier, Capabilities FROM ABStore WHERE Enabled = ?;
12:31:46.2319950 12:31:46.2319820 2020-03-29 12:31:42.421 monotouchtest[423:244692] True
12:31:46.2328680 12:31:46.2328590 2020-03-29 12:31:42.425 monotouchtest[423:244692] True
12:31:46.2817760 12:31:46.2817630 2020-03-29 12:31:42.469 monotouchtest[423:244692] True
12:31:46.2825780 12:31:46.2825690 2020-03-29 12:31:42.472 monotouchtest[423:244692] True
12:31:48.1560520 12:31:48.1560420 2020-03-29 12:31:44.335 monotouchtest[423:244875] Microphone permission granted
12:31:48.1929480 12:31:48.1929390 2020-03-29 12:31:44.383 monotouchtest[423:244870] Microphone permission granted
12:31:50.5732130 12:31:50.5731940 2020-03-29 12:31:46.747 monotouchtest[423:245062] Camera permission granted
12:31:50.6242840 12:31:50.6242720 2020-03-29 12:31:46.800 monotouchtest[423:245064] Microphone permission granted
12:31:50.7096380 12:31:50.7096250 2020-03-29 12:31:46.898 monotouchtest[423:245063] Microphone permission granted
12:31:52.5930770 12:31:52.5930580 2020-03-29 12:31:48.763 monotouchtest[423:244832] Contacts permission granted (error: )
12:31:52.5931300 12:31:52.5931250 2020-03-29 12:31:48.770 monotouchtest[423:244779] Contacts permission granted (error: )
12:31:52.5931400 12:31:52.5931370 2020-03-29 12:31:48.771 monotouchtest[423:244874] Contacts permission granted (error: )
12:31:56.1421240 12:31:56.1421050 2020-03-29 12:31:52.333 monotouchtest[423:245063] Inside dispatch
12:32:01.9582170 12:32:01.9581980 2020-03-29 12:31:58.151 monotouchtest[423:245099] Serving /var/containers/Bundle/Application/74B2CF62-6B2E-405D-A75D-5C67D6273E66/monotouchtest.app/example.pac
12:32:02.3192860 12:32:02.3192610 Mar 29 12:31:58 monotouchtest[423] <Error>: CGBitmapContextCreate: unsupported parameter combination: set CGBITMAP_CONTEXT_LOG_ERRORS environmental variable to see the details
12:32:02.3310990 12:32:02.3310800 Mar 29 12:31:58 monotouchtest[423] <Error>: CGBitmapContextCreate: unsupported parameter combination: set CGBITMAP_CONTEXT_LOG_ERRORS environmental variable to see the details
12:32:02.3311330 12:32:02.3311290 Mar 29 12:31:58 monotouchtest[423] <Error>: CGBitmapContextCreate: unsupported parameter combination: set CGBITMAP_CONTEXT_LOG_ERRORS environmental variable to see the details
12:32:02.3311440 12:32:02.3311400 Mar 29 12:31:58 monotouchtest[423] <Error>: CGBitmapContextCreate: unsupported parameter combination: set CGBITMAP_CONTEXT_LOG_ERRORS environmental variable to see the details
12:32:02.3311540 12:32:02.3311490 Mar 29 12:31:58 monotouchtest[423] <Error>: CGBitmapContextCreate: unsupported parameter combination: set CGBITMAP_CONTEXT_LOG_ERRORS environmental variable to see the details
12:32:02.3318870 12:32:02.3318780 Mar 29 12:31:58 monotouchtest[423] <Error>: CGBitmapContextCreate: unsupported parameter combination: set CGBITMAP_CONTEXT_LOG_ERRORS environmental variable to see the details
12:32:02.3353500 12:32:02.3353390 Mar 29 12:31:58 monotouchtest[423] <Error>: CGBitmapContextCreate: unsupported parameter combination: set CGBITMAP_CONTEXT_LOG_ERRORS environmental variable to see the details
12:32:02.3353680 12:32:02.3353640 Mar 29 12:31:58 monotouchtest[423] <Error>: CGBitmapContextCreate: unsupported parameter combination: set CGBITMAP_CONTEXT_LOG_ERRORS environmental variable to see the details
12:32:02.3365160 12:32:02.3365080 Mar 29 12:31:58 monotouchtest[423] <Error>: CGBitmapContextCreate: unsupported parameter combination: set CGBITMAP_CONTEXT_LOG_ERRORS environmental variable to see the details
12:32:02.3389760 12:32:02.3389690 Mar 29 12:31:58 monotouchtest[423] <Error>: CGBitmapContextCreateImage: invalid context 0x0. If you want to see the backtrace, please set CG_CONTEXT_SHOW_BACKTRACE environmental variable.
12:32:02.7694590 12:32:02.7694410 deflateEnd: error -3: (null).
12:32:02.8028200 12:32:02.8028080 deflateEnd: error -3: (null).
12:32:02.8083820 12:32:02.8083730 Mar 29 12:31:58 monotouchtest[423] <Error>: CGPDFContextCreate: failed to create PDF context delegate.
12:32:02.8099950 12:32:02.8099860 deflateEnd: error -3: (null).
12:32:02.8111260 12:32:02.8111060 Mar 29 12:31:59 monotouchtest[423] <Error>: CGPDFContextCreate: failed to create PDF context delegate.
12:32:02.8121010 12:32:02.8120950 deflateEnd: error -3: (null).
12:32:02.8129780 12:32:02.8129720 Mar 29 12:31:59 monotouchtest[423] <Error>: CGPDFContextCreate: failed to create PDF context delegate.
12:32:02.8138550 12:32:02.8138490 deflateEnd: error -3: (null).
12:32:02.8191860 12:32:02.8191770 deflateEnd: error -3: (null).
12:32:02.8192050 12:32:02.8192010 Mar 29 12:31:59 monotouchtest[423] <Error>: CGPDFContextCreate: failed to create PDF context delegate.
12:32:02.8192150 12:32:02.8192120 deflateEnd: error -3: (null).
12:32:02.8288320 12:32:02.8288230 deflateEnd: error -3: (null).
12:32:02.8296810 12:32:02.8296720 Mar 29 12:31:59 monotouchtest[423] <Error>: CGPDFContextCreate: failed to create PDF context delegate.
12:32:02.8306580 12:32:02.8306510 deflateEnd: error -3: (null).
12:32:02.8316260 12:32:02.8316200 Mar 29 12:31:59 monotouchtest[423] <Error>: CGPDFContextCreate: failed to create PDF context delegate.
12:32:02.8327920 12:32:02.8327860 deflateEnd: error -3: (null).
12:32:02.8337660 12:32:02.8337590 Mar 29 12:31:59 monotouchtest[423] <Error>: CGPDFContextCreate: failed to create PDF context delegate.
12:32:02.8347730 12:32:02.8347680 deflateEnd: error -3: (null).
12:32:02.8375200 12:32:02.8375140 deflateEnd: error -3: (null).
12:32:02.8375350 12:32:02.8375310 Mar 29 12:31:59 monotouchtest[423] <Error>: CGPDFContextCreate: failed to create PDF context delegate.
12:32:02.8717670 12:32:02.8717480 Mar 29 12:31:59 monotouchtest[423] <Error>: CGDataConsumer(url_close): write failed.
12:32:02.8824430 12:32:02.8824230 Mar 29 12:31:59 monotouchtest[423] <Error>: CGDataConsumer(url_close): write failed.
12:32:02.8867560 12:32:02.8867380 Mar 29 12:31:59 monotouchtest[423] <Error>: invalid encryption key length: 123.
12:32:02.9041950 12:32:02.9041760 Mar 29 12:31:59 monotouchtest[423] <Error>: CGDataConsumer(url_close): write failed.
12:32:02.9371950 12:32:02.9371760 Mar 29 12:31:59 monotouchtest[423] <Error>: CGDataConsumerCreateWithFilename: failed to open `/private/var/containers/Bundle/Application/74B2CF62-6B2E-405D-A75D-5C67D6273E66/monotouchtest.app/file' for writing: Operation not permitted.
12:32:02.9372310 12:32:02.9372260 Mar 29 12:31:59 monotouchtest[423] <Error>: invalid encryption key length: 123.
12:32:02.9372410 12:32:02.9372380 deflateEnd: error -3: (null).
12:32:02.9439160 12:32:02.9438820 deflateEnd: error -3: (null).
12:32:02.9448500 12:32:02.9448400 Mar 29 12:31:59 monotouchtest[423] <Error>: CGPDFContextCreate: failed to create PDF context delegate.
12:32:04.2609170 12:32:04.2609060 2020-03-29 12:32:00.453 monotouchtest[423:244692] Unknown CIDetectorMinFeatureSize specified. Ignoring.
12:32:31.5563260 12:32:31.5563000 Xamarin.Hosting: Device discovery event: GizmoUnpaired (00008006-0002058626A2002E)
12:32:31.5564590 12:32:31.5564370 Xamarin.Hosting: Device discovery event: GizmoUnpaired (0d116083a6e3e133a9519776f5e495809e8c928a)
12:32:31.5565010 12:32:31.5564940 Xamarin.Hosting: Device discovery event: Disconnected (bd3fd054136767445ff47819f65b74867a48e591)
12:32:34.9206810 12:32:34.9206620 2020-03-29 12:32:31.111 monotouchtest[423:244692] {X=Infinity,Y=Infinity,Width=0,Height=0}
12:32:41.5759660 12:32:41.5759550 2020-03-29 12:32:37.766 monotouchtest[423:244692] BTM: attaching to BTServer
12:32:42.4923120 12:32:42.4922980 2020-03-29 12:32:38.683 monotouchtest[423:245192] NSFileCoordinator only handles URLs that use the file: scheme. This one does not:
12:32:42.4923390 12:32:42.4923350 /var/mobile/Containers/Data/Application/C2108351-C481-4C8A-9EF9-7C89C944EAFC/Documents/FileCoordinatorTest.txt
12:32:42.4923520 12:32:42.4923480 2020-03-29 12:32:38.684 monotouchtest[423:245192] NSFileCoordinator only handles URLs that use the file: scheme. This one does not:
12:32:42.4923640 12:32:42.4923610 /var/mobile/Containers/Data/Application/C2108351-C481-4C8A-9EF9-7C89C944EAFC/Documents/FileCoordinatorTest.txt
12:32:42.5636430 12:32:42.5636240 2020-03-29 12:32:38.755 monotouchtest[423:244692] NSDateComponentsFormatter does not implement parsing.
12:32:42.7798630 12:32:42.7798450 2020-03-29 12:32:38.972 monotouchtest[423:244692] Trying to allocate 2147483649 bytes, this may cause malloc errors
12:32:43.1287910 12:32:43.1287710 2020-03-29 12:32:39.320 monotouchtest[423:244692] 1
12:32:46.4759580 12:32:46.4759460 2020-03-29 12:32:42.668 monotouchtest[423:244692] +backgroundSessionConfiguration: is deprecated. Please use +backgroundSessionConfigurationWithIdentifier: instead
12:32:47.7940060 12:32:47.7939960 2020-03-29 12:32:43.939 monotouchtest[423:244692] ImageIO.CGMutableImageMetadata
12:32:48.2745080 12:32:48.2744940 2020-03-29 12:32:44.468 monotouchtest[423:244692] NSUbiquitousKeyValueStore error: com.xamarin.monotouch-test has no valid com.apple.developer.ubiquity-kvstore-identifier entitlement
12:32:59.1457040 12:32:59.1456840 2020-03-29 12:32:55.338 monotouchtest[423:245063] Media library permission: Authorized
12:32:59.7371100 12:32:59.7371000 2020-03-29 12:32:55.926 monotouchtest[423:244692] {X=123, Y=345}
12:32:59.7539150 12:32:59.7539050 2020-03-29 12:32:55.936 monotouchtest[423:244692] ptr: 0x41e1cef0 = 0x0
12:32:59.7539430 12:32:59.7539350 2020-03-29 12:32:55.936 monotouchtest[423:244692] ptr: 0x0
12:32:59.7545740 12:32:59.7545650 2020-03-29 12:32:55.940 monotouchtest[423:244692] ptr: 0x41b034c0 = 0x0
12:32:59.7545920 12:32:59.7545880 2020-03-29 12:32:55.941 monotouchtest[423:244692] ptr: 0x0
12:33:12.4896750 12:33:12.4896560 2020-03-29 12:33:08.682 monotouchtest[423:244692] Skipping 'setProperty1:', it's expected to throw a 'Selector not found exception', but on device it seems to crash instead
12:33:12.4961430 12:33:12.4961210 2020-03-29 12:33:08.686 monotouchtest[423:244692] Skipping 'setProperty4:', it's expected to throw a 'Selector not found exception', but on device it seems to crash instead
12:33:12.4961610 12:33:12.4961570 2020-03-29 12:33:08.687 monotouchtest[423:244692] Skipping 'setProperty5:', it's expected to throw a 'Selector not found exception', but on device it seems to crash instead
12:33:12.4961720 12:33:12.4961680 2020-03-29 12:33:08.689 monotouchtest[423:244692] Skipping 'setProperty6:', it's expected to throw a 'Selector not found exception', but on device it seems to crash instead
12:33:12.5135450 12:33:12.5135360 2020-03-29 12:33:08.706 monotouchtest[423:244692] Skipping 'setStaticProperty1:', it's expected to throw a 'Selector not found exception', but on device it seems to crash instead
12:33:12.5148120 12:33:12.5148030 2020-03-29 12:33:08.708 monotouchtest[423:244692] Skipping 'StaticProperty3', it's expected to throw a 'Selector not found exception', but on device it seems to crash instead
12:33:12.5173470 12:33:12.5173380 2020-03-29 12:33:08.710 monotouchtest[423:244692] Skipping 'setStaticProperty4:', it's expected to throw a 'Selector not found exception', but on device it seems to crash instead
12:33:12.5186370 12:33:12.5186290 2020-03-29 12:33:08.712 monotouchtest[423:244692] Skipping 'setStaticProperty5:', it's expected to throw a 'Selector not found exception', but on device it seems to crash instead
12:33:12.5205860 12:33:12.5205780 2020-03-29 12:33:08.713 monotouchtest[423:244692] Skipping 'setStaticProperty6:', it's expected to throw a 'Selector not found exception', but on device it seems to crash instead
12:33:15.3681230 12:33:15.3681040 2020-03-29 12:33:11.559 monotouchtest[423:244692] Tested!
12:33:27.1950320 12:33:27.1950170 2020-03-29 12:33:23.388 monotouchtest[423:244692] 3/29/2020 12:33:23 PM Notified
12:33:28.6466160 12:33:28.6465980 2020-03-29 12:33:24.827 monotouchtest[423:244692] Cannot create a Reading List item. URLs must begin with http or https.
12:33:36.6369380 12:33:36.6369260 [SCNKit ERROR] can't add an abstract animation to <SCNNode: 0x424104c0 | no child>
12:33:36.6369690 12:33:36.6369650 [SCNKit ERROR] can't add an abstract animation to <SCNNode: 0x424104c0 | no child>
12:33:36.6369830 12:33:36.6369790 [SCNKit ERROR] can't add an abstract animation to <SCNNode: 0x424104c0 | no child>
12:33:36.6369960 12:33:36.6369920 [SCNKit ERROR] can't add an abstract animation to <SCNNode: 0x424104c0 | no child>
12:33:40.3375490 12:33:40.3375380 2020-03-29 12:33:36.530 monotouchtest[423:244692] Attempting to load the view of a view controller while it is deallocating is not allowed and may result in undefined behavior (<UIAlertController: 0x42b01c00>)
12:33:40.6504900 12:33:40.6504750 2020-03-29 12:33:36.844 monotouchtest[423:244692] Only VoIP apps can set KeepAliveTimeout
12:33:43.3136300 12:33:43.3135990 2020-03-29 12:33:39.504 monotouchtest[423:244692] Warning: Attempt to present <UINavigationController: 0x414f9800> on <UIViewController: 0x439c6960> whose view is not in the window hierarchy!
12:33:43.3136590 12:33:43.3136550 2020-03-29 12:33:39.506 monotouchtest[423:244692] Warning: Attempt to present <UINavigationController: 0x414fdc00> on <UIViewController: 0x439c6d40> whose view is not in the window hierarchy!
12:33:43.3194940 12:33:43.3194850 2020-03-29 12:33:39.511 monotouchtest[423:244692] Warning: Attempt to present <UIViewController: 0x4386ef40> on <UIViewController: 0x4386f130> whose view is not in the window hierarchy!
12:33:43.3195400 12:33:43.3195350 2020-03-29 12:33:39.512 monotouchtest[423:244692] Warning: Attempt to present <UIViewController: 0x4386eb10> on <UIViewController: 0x4386ef40> whose view is not in the window hierarchy!
12:33:43.3439550 12:33:43.3439270 2020-03-29 12:33:39.537 monotouchtest[423:244692] Warning: Attempt to present <UIViewController: 0x4386cbf0> on <UIViewController: 0x4386cf30> whose view is not in the window hierarchy!
12:33:43.3612880 12:33:43.3612720 2020-03-29 12:33:39.554 monotouchtest[423:244692] Warning: Attempt to present <UINavigationController: 0x414fee00> on <UIViewController: 0x439ce7d0> whose view is not in the window hierarchy!
12:33:43.3613100 12:33:43.3613050 2020-03-29 12:33:39.555 monotouchtest[423:244692] Warning: Attempt to present <UINavigationController: 0x42b8b400> on <UIViewController: 0x439ceb00> whose view is not in the window hierarchy!
12:33:45.8321570 12:33:45.8321380 monotouchtest(423,0x43b01000) malloc: *** mach_vm_map(size=106496) failed (error code=3)
12:33:45.8321910 12:33:45.8321870 *** error: can't allocate region
12:33:45.8322010 12:33:45.8321970 *** set a breakpoint in malloc_error_break to debug
12:33:45.8421150 12:33:45.8421050 libc++abi.dylib: terminating with uncaught exception of type std::bad_alloc: std::bad_alloc
12:33:45.8440530 12:33:45.8440320
12:33:45.8440730 12:33:45.8440690 =================================================================
12:33:45.8440820 12:33:45.8440790 Native Crash Reporting
12:33:45.8440910 12:33:45.8440880 =================================================================
12:33:45.8441000 12:33:45.8440960 Got a abrt while executing native code. This usually indicates
12:33:45.8441090 12:33:45.8441060 a fatal error in the mono runtime or one of the native libraries
12:33:45.8441170 12:33:45.8441140 used by your application.
12:33:45.8441260 12:33:45.8441230 =================================================================
12:33:45.8441350 12:33:45.8441320
12:33:45.8441430 12:33:45.8441400 =================================================================
12:33:45.8447840 12:33:45.8447760 Native stacktrace:
12:33:45.8448150 12:33:45.8447980 =================================================================
12:33:45.9354050 12:33:45.9353930 0x1ec4d8b - /var/containers/Bundle/Application/74B2CF62-6B2E-405D-A75D-5C67D6273E66/monotouchtest.app/monotouchtest : mono_dump_native_crash_info
12:33:45.9922160 12:33:45.9922070 0x1ebd7c1 - /var/containers/Bundle/Application/74B2CF62-6B2E-405D-A75D-5C67D6273E66/monotouchtest.app/monotouchtest : mono_handle_native_crash
12:33:46.0492790 12:33:46.0492680 0x1ec443f - /var/containers/Bundle/Application/74B2CF62-6B2E-405D-A75D-5C67D6273E66/monotouchtest.app/monotouchtest : sigabrt_signal_handler
12:33:46.0516380 12:33:46.0516170 0x20dee077 - /usr/lib/system/libsystem_platform.dylib : _sigtramp
12:33:46.0532480 12:33:46.0532260 0x20df4733 - /usr/lib/system/libsystem_pthread.dylib : pthread_kill
12:33:46.0583710 12:33:46.0583630 0x20cdf0ad - /usr/lib/system/libsystem_c.dylib : abort
12:33:46.0595630 12:33:46.0595540 0x20836ae5 - /usr/lib/libc++abi.dylib : __cxa_bad_cast
12:33:46.0595820 12:33:46.0595780 0x2084f669 - /usr/lib/libc++abi.dylib : <redacted>
12:33:46.0595930 12:33:46.0595890 0x2085b0d5 - /usr/lib/libobjc.A.dylib : <redacted>
12:33:46.0596020 12:33:46.0595990 0x2084ce17 - /usr/lib/libc++abi.dylib : <redacted>
12:33:46.0596120 12:33:46.0596080 0x2084c5f5 - /usr/lib/libc++abi.dylib : <redacted>
12:33:46.0609830 12:33:46.0609740 0x2084d0a1 - /usr/lib/libc++abi.dylib : _ZnwmRKSt9nothrow_t
12:33:46.0629310 12:33:46.0629090 0x25522ce1 - /System/Library/PrivateFrameworks/PhysicsKit.framework/PhysicsKit : <redacted>
12:33:46.0629490 12:33:46.0629450 0x25522ed1 - /System/Library/PrivateFrameworks/PhysicsKit.framework/PhysicsKit : <redacted>
12:33:46.0701040 12:33:46.0700950 0x2d362ba9 - /System/Library/Frameworks/SpriteKit.framework/SpriteKit : <redacted>
12:33:46.0706920 12:33:46.0706840 0x2d362a59 - /System/Library/Frameworks/SpriteKit.framework/SpriteKit : <redacted>
12:33:46.1276220 12:33:46.1276120 0xfbe400 - /var/containers/Bundle/Application/74B2CF62-6B2E-405D-A75D-5C67D6273E66/monotouchtest.app/monotouchtest : wrapper_managed_to_native_ObjCRuntime_Messaging_IntPtr_objc_msgSendSuper_intptr_intptr
12:33:46.1846490 12:33:46.1846390 0xe5443c - /var/containers/Bundle/Application/74B2CF62-6B2E-405D-A75D-5C67D6273E66/monotouchtest.app/monotouchtest : SpriteKit_SKScene__ctor
12:33:46.2376460 12:33:46.2376370 0x1f9f04 - /var/containers/Bundle/Application/74B2CF62-6B2E-405D-A75D-5C67D6273E66/monotouchtest.app/monotouchtest : MonoTouchFixtures_MyParentView__ctor_bool
12:33:46.2907110 12:33:46.2907020 0x1f8cdc - /var/containers/Bundle/Application/74B2CF62-6B2E-405D-A75D-5C67D6273E66/monotouchtest.app/monotouchtest : MonoTouchFixtures_WeakReferenceTest__c__NoRetainCyclesExpectedTestb__4_0
12:33:46.3459630 12:33:46.3459530 0xa1a890 - /var/containers/Bundle/Application/74B2CF62-6B2E-405D-A75D-5C67D6273E66/monotouchtest.app/monotouchtest : System_Threading_ThreadHelper_ThreadStart_Context_object
12:33:46.3988160 12:33:46.3988050 0xa18488 - /var/containers/Bundle/Application/74B2CF62-6B2E-405D-A75D-5C67D6273E66/monotouchtest.app/monotouchtest : System_Threading_ExecutionContext_RunInternal_System_Threading_ExecutionContext_System_Threading_ContextCallback_object_bool
12:33:46.4514880 12:33:46.4514780 0xa18244 - /var/containers/Bundle/Application/74B2CF62-6B2E-405D-A75D-5C67D6273E66/monotouchtest.app/monotouchtest : System_Threading_ExecutionContext_Run_System_Threading_ExecutionContext_System_Threading_ContextCallback_object_bool
12:33:46.5051540 12:33:46.5051440 0xa181cc - /var/containers/Bundle/Application/74B2CF62-6B2E-405D-A75D-5C67D6273E66/monotouchtest.app/monotouchtest : System_Threading_ExecutionContext_Run_System_Threading_ExecutionContext_System_Threading_ContextCallback_object
12:33:46.5577930 12:33:46.5577820 0xa1aa10 - /var/containers/Bundle/Application/74B2CF62-6B2E-405D-A75D-5C67D6273E66/monotouchtest.app/monotouchtest : System_Threading_ThreadHelper_ThreadStart
12:33:46.6145830 12:33:46.6145620 0xc97d48 - /var/containers/Bundle/Application/74B2CF62-6B2E-405D-A75D-5C67D6273E66/monotouchtest.app/monotouchtest : wrapper_runtime_invoke_object_runtime_invoke_dynamic_intptr_intptr_intptr_intptr
12:33:46.6674800 12:33:46.6674610 0x1ecafcd - /var/containers/Bundle/Application/74B2CF62-6B2E-405D-A75D-5C67D6273E66/monotouchtest.app/monotouchtest : mono_jit_runtime_invoke
12:33:46.7208300 12:33:46.7208120 0x1f41d9f - /var/containers/Bundle/Application/74B2CF62-6B2E-405D-A75D-5C67D6273E66/monotouchtest.app/monotouchtest : mono_runtime_invoke_checked
12:33:46.7741810 12:33:46.7741600 0x1f4570f - /var/containers/Bundle/Application/74B2CF62-6B2E-405D-A75D-5C67D6273E66/monotouchtest.app/monotouchtest : mono_runtime_delegate_try_invoke
12:33:46.8276970 12:33:46.8276780 0x1f6c0f7 - /var/containers/Bundle/Application/74B2CF62-6B2E-405D-A75D-5C67D6273E66/monotouchtest.app/monotouchtest : start_wrapper_internal
12:33:46.8817260 12:33:46.8817020 0x1f6bec9 - /var/containers/Bundle/Application/74B2CF62-6B2E-405D-A75D-5C67D6273E66/monotouchtest.app/monotouchtest : start_wrapper
12:33:46.8817670 12:33:46.8817610 0x20df385b - /usr/lib/system/libsystem_pthread.dylib : <redacted>
12:33:46.8818150 12:33:46.8817740 0x20df37cf - /usr/lib/system/libsystem_pthread.dylib : _pthread_start
12:33:46.8840670 12:33:46.8840560 0x20df1724 - /usr/lib/system/libsystem_pthread.dylib : thread_start
12:33:46.8840880 12:33:46.8840840
12:33:46.8840980 12:33:46.8840950 =================================================================
12:33:46.8841120 12:33:46.8841040 Basic Fault Address Reporting
12:33:46.8841230 12:33:46.8841200 =================================================================
12:33:46.8856610 12:33:46.8856520 Memory around native instruction pointer (0x20d4ac5c):0x20d4ac4c 1c ff 2f e1 1e ff 2f e1 52 cf a0 e3 80 00 00 ef ../.../.R.......
12:33:46.8856810 12:33:46.8856760 0x20d4ac5c 04 00 00 3a 04 c0 9f e5 0c c0 9f e7 00 00 00 ea ...:............
12:33:46.8857090 12:33:46.8857050 0x20d4ac6c b8 93 f5 13 1c ff 2f e1 1e ff 2f e1 53 cf a0 e3 ....../.../.S...
12:33:46.8875120 12:33:46.8875040 0x20d4ac7c 80 00 00 ef 04 00 00 3a 04 c0 9f e5 0c c0 9f e7 .......:........
12:33:46.8875270 12:33:46.8875240
12:33:46.8875370 12:33:46.8875340 =================================================================
12:33:46.8875460 12:33:46.8875420 Managed Stacktrace:
12:33:46.8875550 12:33:46.8875510 =================================================================
12:33:46.8888100 12:33:46.8888020 at <unknown> <0xffffffff>
12:33:46.8888280 12:33:46.8888250 at ObjCRuntime.Messaging:IntPtr_objc_msgSendSuper <0x00043>
12:33:46.8896570 12:33:46.8896500 at SpriteKit.SKScene:.ctor <0x0009f>
12:33:46.8896730 12:33:46.8896690 at MonoTouchFixtures.MyParentView:.ctor <0x00077>
12:33:46.8896820 12:33:46.8896790 at <>c:<NoRetainCyclesExpectedTest>b__4_0 <0x0010b>
12:33:46.8938400 12:33:46.8938220 at System.Threading.ThreadHelper:ThreadStart_Context <0x000cb>
12:33:46.8955150 12:33:46.8954990 at System.Threading.ExecutionContext:RunInternal <0x001fb>
12:33:46.8955430 12:33:46.8955390 at System.Threading.ExecutionContext:Run <0x00033>
12:33:46.8965970 12:33:46.8965840 at System.Threading.ExecutionContext:Run <0x0005b>
12:33:46.8966250 12:33:46.8966200 at System.Threading.ThreadHelper:ThreadStart <0x0003f>
12:33:46.8966360 12:33:46.8966310 at System.Object:runtime_invoke_dynamic <0x000fb>
12:33:46.8966450 12:33:46.8966420 =================================================================
12:33:47.2458350 12:33:47.2458170 Xamarin.Hosting: Process '423' exited.
12:33:47.2461100 12:33:47.2461000 Application 'com.xamarin.monotouch-test' terminated.
12:33:47.3531210 Test run completed
12:33:52.3882660 A capture of the device log is: /Users/mandel/Xamarin/xamarin-macios/master/xamarin-macios/jenkins-results/tests/20200329_122859/monotouch-test/357/device-XQAiPodTouch5f-20200329_123110.log
12:33:53.3911620 The tcp tunnel output is 12:33:53.3911510 Execution of 16889 was cancelled.
12:33:53.3915150 Tests have finished executing
12:33:53.4282330 Test run crashed
12:33:53.4305060 /Users/mandel/Xamarin/xamarin-macios/master/xamarin-macios/_ios-build/Library/Frameworks/Xamarin.iOS.framework/Versions/Current/bin/mlaunch --list-crash-reports=/var/folders/q_/0bkgg2v13s7b35rtg3n2d8xm0000gn/T/tmp7ed189a0.tmp --devname XQAiPodTouch5f
12:33:53.7317140 Using Xcode 11.4 found in /Applications/Xcode114.app/Contents/Developer
12:33:55.2227900 No crash reports, waiting a second to see if the crash report service just didn't complete in time (28)
12:33:56.2238970 /Users/mandel/Xamarin/xamarin-macios/master/xamarin-macios/_ios-build/Library/Frameworks/Xamarin.iOS.framework/Versions/Current/bin/mlaunch --list-crash-reports=/var/folders/q_/0bkgg2v13s7b35rtg3n2d8xm0000gn/T/tmp3ce19d11.tmp --devname XQAiPodTouch5f
12:33:56.5108460 Using Xcode 11.4 found in /Applications/Xcode114.app/Contents/Developer
12:33:57.6305490 No crash reports, waiting a second to see if the crash report service just didn't complete in time (25)
12:33:58.6324460 /Users/mandel/Xamarin/xamarin-macios/master/xamarin-macios/_ios-build/Library/Frameworks/Xamarin.iOS.framework/Versions/Current/bin/mlaunch --list-crash-reports=/var/folders/q_/0bkgg2v13s7b35rtg3n2d8xm0000gn/T/tmp1f49f7e7.tmp --devname XQAiPodTouch5f
12:33:58.9087750 Using Xcode 11.4 found in /Applications/Xcode114.app/Contents/Developer
12:34:00.0248420 No crash reports, waiting a second to see if the crash report service just didn't complete in time (23)
12:34:01.0261570 /Users/mandel/Xamarin/xamarin-macios/master/xamarin-macios/_ios-build/Library/Frameworks/Xamarin.iOS.framework/Versions/Current/bin/mlaunch --list-crash-reports=/var/folders/q_/0bkgg2v13s7b35rtg3n2d8xm0000gn/T/tmp36a83c10.tmp --devname XQAiPodTouch5f
12:34:01.3164130 Using Xcode 11.4 found in /Applications/Xcode114.app/Contents/Developer
12:34:02.4354870 No crash reports, waiting a second to see if the crash report service just didn't complete in time (20)
12:34:03.4375270 /Users/mandel/Xamarin/xamarin-macios/master/xamarin-macios/_ios-build/Library/Frameworks/Xamarin.iOS.framework/Versions/Current/bin/mlaunch --list-crash-reports=/var/folders/q_/0bkgg2v13s7b35rtg3n2d8xm0000gn/T/tmp29be7d67.tmp --devname XQAiPodTouch5f
12:34:03.7343120 Using Xcode 11.4 found in /Applications/Xcode114.app/Contents/Developer
12:34:04.8547430 No crash reports, waiting a second to see if the crash report service just didn't complete in time (18)
12:34:05.8561820 /Users/mandel/Xamarin/xamarin-macios/master/xamarin-macios/_ios-build/Library/Frameworks/Xamarin.iOS.framework/Versions/Current/bin/mlaunch --list-crash-reports=/var/folders/q_/0bkgg2v13s7b35rtg3n2d8xm0000gn/T/tmp6ff77729.tmp --devname XQAiPodTouch5f
12:34:06.1465730 Using Xcode 11.4 found in /Applications/Xcode114.app/Contents/Developer
12:34:07.2643590 No crash reports, waiting a second to see if the crash report service just didn't complete in time (16)
12:34:08.2653170 /Users/mandel/Xamarin/xamarin-macios/master/xamarin-macios/_ios-build/Library/Frameworks/Xamarin.iOS.framework/Versions/Current/bin/mlaunch --list-crash-reports=/var/folders/q_/0bkgg2v13s7b35rtg3n2d8xm0000gn/T/tmp6f8ffa9c.tmp --devname XQAiPodTouch5f
12:34:08.5543530 Using Xcode 11.4 found in /Applications/Xcode114.app/Contents/Developer
12:34:09.5690040 No crash reports, waiting a second to see if the crash report service just didn't complete in time (13)
12:34:10.5708840 /Users/mandel/Xamarin/xamarin-macios/master/xamarin-macios/_ios-build/Library/Frameworks/Xamarin.iOS.framework/Versions/Current/bin/mlaunch --list-crash-reports=/var/folders/q_/0bkgg2v13s7b35rtg3n2d8xm0000gn/T/tmpcc8ae17.tmp --devname XQAiPodTouch5f
12:34:10.8605040 Using Xcode 11.4 found in /Applications/Xcode114.app/Contents/Developer
12:34:11.9808480 No crash reports, waiting a second to see if the crash report service just didn't complete in time (11)
12:34:12.9826670 /Users/mandel/Xamarin/xamarin-macios/master/xamarin-macios/_ios-build/Library/Frameworks/Xamarin.iOS.framework/Versions/Current/bin/mlaunch --list-crash-reports=/var/folders/q_/0bkgg2v13s7b35rtg3n2d8xm0000gn/T/tmp5574516c.tmp --devname XQAiPodTouch5f
12:34:13.2550580 Using Xcode 11.4 found in /Applications/Xcode114.app/Contents/Developer
12:34:14.3712490 No crash reports, waiting a second to see if the crash report service just didn't complete in time (9)
12:34:15.3720030 /Users/mandel/Xamarin/xamarin-macios/master/xamarin-macios/_ios-build/Library/Frameworks/Xamarin.iOS.framework/Versions/Current/bin/mlaunch --list-crash-reports=/var/folders/q_/0bkgg2v13s7b35rtg3n2d8xm0000gn/T/tmp463776a0.tmp --devname XQAiPodTouch5f
12:34:15.6488250 Using Xcode 11.4 found in /Applications/Xcode114.app/Contents/Developer
12:34:16.7698100 No crash reports, waiting a second to see if the crash report service just didn't complete in time (6)
12:34:17.7713510 /Users/mandel/Xamarin/xamarin-macios/master/xamarin-macios/_ios-build/Library/Frameworks/Xamarin.iOS.framework/Versions/Current/bin/mlaunch --list-crash-reports=/var/folders/q_/0bkgg2v13s7b35rtg3n2d8xm0000gn/T/tmpb02bc65.tmp --devname XQAiPodTouch5f
12:34:18.0505510 Using Xcode 11.4 found in /Applications/Xcode114.app/Contents/Developer
12:34:19.0674630 No crash reports, waiting a second to see if the crash report service just didn't complete in time (4)
12:34:20.0687240 /Users/mandel/Xamarin/xamarin-macios/master/xamarin-macios/_ios-build/Library/Frameworks/Xamarin.iOS.framework/Versions/Current/bin/mlaunch --list-crash-reports=/var/folders/q_/0bkgg2v13s7b35rtg3n2d8xm0000gn/T/tmp26624d28.tmp --devname XQAiPodTouch5f
12:34:20.3528720 Using Xcode 11.4 found in /Applications/Xcode114.app/Contents/Developer
12:34:21.4739370 No crash reports, waiting a second to see if the crash report service just didn't complete in time (1)
12:34:22.4747020 /Users/mandel/Xamarin/xamarin-macios/master/xamarin-macios/_ios-build/Library/Frameworks/Xamarin.iOS.framework/Versions/Current/bin/mlaunch --list-crash-reports=/var/folders/q_/0bkgg2v13s7b35rtg3n2d8xm0000gn/T/tmp2b4f66cf.tmp --devname XQAiPodTouch5f
12:34:22.7648500 Using Xcode 11.4 found in /Applications/Xcode114.app/Contents/Developer
Sign up for free to join this conversation on GitHub. Already have an account? Sign in to comment