Skip to content

Instantly share code, notes, and snippets.

Embed
What would you like to do?
Failed travis log #62870.1
travis_fold:start:worker_info
Worker information
hostname: 8178300b-eeeb-4ca7-9deb-de62eb27610b@1.production-1-worker-org-a-5-gce
version: v3.8.0 https://github.com/travis-ci/worker/tree/cccff7c89da7ba0cf47a90e5615266a45b372e30
instance: travis-job-4c088c18-8443-40fa-8e06-c9dc4353d13b travis-ci-garnet-trusty-1512502259-986baf0 (via amqp)
startup: 27.728081381s
travis_fold:end:worker_info
travis_fold:start:system_info
Build system information
Build language: cpp
Build group: stable
Build dist: trusty
Build id: 394414855
Job id: 394414856
Runtime kernel version: 4.4.0-101-generic
travis-build version: 08cf49fbd
Build image provisioning date and time
Tue Dec 5 19:58:13 UTC 2017
Operating System Details
Distributor ID: Ubuntu
Description: Ubuntu 14.04.5 LTS
Release: 14.04
Codename: trusty
Cookbooks Version
7c2c6a6 https://github.com/travis-ci/travis-cookbooks/tree/7c2c6a6
git version
git version 2.15.1
bash version
GNU bash, version 4.3.11(1)-release (x86_64-pc-linux-gnu)
gcc version
gcc (Ubuntu 4.8.4-2ubuntu1~14.04.3) 4.8.4
Copyright (C) 2013 Free Software Foundation, Inc.
This is free software; see the source for copying conditions. There is NO
warranty; not even for MERCHANTABILITY or FITNESS FOR A PARTICULAR PURPOSE.
docker version
Client:
Version: 17.09.0-ce
API version: 1.32
Go version: go1.8.3
Git commit: afdb6d4
Built: Tue Sep 26 22:42:38 2017
OS/Arch: linux/amd64
Server:
Version: 17.09.0-ce
API version: 1.32 (minimum version 1.12)
Go version: go1.8.3
Git commit: afdb6d4
Built: Tue Sep 26 22:41:20 2017
OS/Arch: linux/amd64
Experimental: false
clang version
clang version 5.0.0 (tags/RELEASE_500/final)
Target: x86_64-unknown-linux-gnu
Thread model: posix
InstalledDir: /usr/local/clang-5.0.0/bin
jq version
jq-1.5
bats version
Bats 0.4.0
shellcheck version
0.4.6
shfmt version
v2.0.0
ccache version
ccache version 3.1.9
Copyright (C) 2002-2007 Andrew Tridgell
Copyright (C) 2009-2011 Joel Rosdahl
This program is free software; you can redistribute it and/or modify it under
the terms of the GNU General Public License as published by the Free Software
Foundation; either version 3 of the License, or (at your option) any later
version.
cmake version
cmake version 3.9.2
CMake suite maintained and supported by Kitware (kitware.com/cmake).
heroku version
heroku-cli/6.14.39-addc925 (linux-x64) node-v9.2.0
imagemagick version
Version: ImageMagick 6.7.7-10 2017-07-31 Q16 http://www.imagemagick.org
md5deep version
4.2
mercurial version
Mercurial Distributed SCM (version 4.2.2)
(see https://mercurial-scm.org for more information)
Copyright (C) 2005-2017 Matt Mackall and others
This is free software; see the source for copying conditions. There is NO
warranty; not even for MERCHANTABILITY or FITNESS FOR A PARTICULAR PURPOSE.
mysql version
mysql Ver 14.14 Distrib 5.6.33, for debian-linux-gnu (x86_64) using EditLine wrapper
openssl version
OpenSSL 1.0.1f 6 Jan 2014
packer version
Packer v1.0.2
Your version of Packer is out of date! The latest version
is 1.1.2. You can update by downloading from www.packer.io
postgresql client version
psql (PostgreSQL) 9.6.6
ragel version
Ragel State Machine Compiler version 6.8 Feb 2013
Copyright (c) 2001-2009 by Adrian Thurston
subversion version
svn, version 1.8.8 (r1568071)
compiled Aug 10 2017, 17:20:39 on x86_64-pc-linux-gnu
Copyright (C) 2013 The Apache Software Foundation.
This software consists of contributions made by many people;
see the NOTICE file for more information.
Subversion is open source software, see http://subversion.apache.org/
The following repository access (RA) modules are available:
* ra_svn : Module for accessing a repository using the svn network protocol.
- with Cyrus SASL authentication
- handles 'svn' scheme
* ra_local : Module for accessing a repository on local disk.
- handles 'file' scheme
* ra_serf : Module for accessing a repository via WebDAV protocol using serf.
- using serf 1.3.3
- handles 'http' scheme
- handles 'https' scheme
sudo version
Sudo version 1.8.9p5
Configure options: --prefix=/usr -v --with-all-insults --with-pam --with-fqdn --with-logging=syslog --with-logfac=authpriv --with-env-editor --with-editor=/usr/bin/editor --with-timeout=15 --with-password-timeout=0 --with-passprompt=[sudo] password for %p: --without-lecture --with-tty-tickets --disable-root-mailer --enable-admin-flag --with-sendmail=/usr/sbin/sendmail --with-timedir=/var/lib/sudo --mandir=/usr/share/man --libexecdir=/usr/lib/sudo --with-sssd --with-sssd-lib=/usr/lib/x86_64-linux-gnu --with-selinux
Sudoers policy plugin version 1.8.9p5
Sudoers file grammar version 43
Sudoers path: /etc/sudoers
Authentication methods: 'pam'
Syslog facility if syslog is being used for logging: authpriv
Syslog priority to use when user authenticates successfully: notice
Syslog priority to use when user authenticates unsuccessfully: alert
Send mail if the user is not in sudoers
Use a separate timestamp for each user/tty combo
Lecture user the first time they run sudo
Root may run sudo
Allow some information gathering to give useful error messages
Require fully-qualified hostnames in the sudoers file
Visudo will honor the EDITOR environment variable
Set the LOGNAME and USER environment variables
Length at which to wrap log file lines (0 for no wrap): 80
Authentication timestamp timeout: 15.0 minutes
Password prompt timeout: 0.0 minutes
Number of tries to enter a password: 3
Umask to use or 0777 to use user's: 022
Path to mail program: /usr/sbin/sendmail
Flags for mail program: -t
Address to send mail to: root
Subject line for mail messages: *** SECURITY information for %h ***
Incorrect password message: Sorry, try again.
Path to authentication timestamp dir: /var/lib/sudo
Default password prompt: [sudo] password for %p:
Default user to run commands as: root
Value to override user's $PATH with: /usr/local/sbin:/usr/local/bin:/usr/sbin:/usr/bin:/sbin:/bin:/snap/bin
Path to the editor for use by visudo: /usr/bin/editor
When to require a password for 'list' pseudocommand: any
When to require a password for 'verify' pseudocommand: all
File descriptors >= 3 will be closed before executing a command
Environment variables to check for sanity:
TZ
TERM
LINGUAS
LC_*
LANGUAGE
LANG
COLORTERM
Environment variables to remove:
RUBYOPT
RUBYLIB
PYTHONUSERBASE
PYTHONINSPECT
PYTHONPATH
PYTHONHOME
TMPPREFIX
ZDOTDIR
READNULLCMD
NULLCMD
FPATH
PERL5DB
PERL5OPT
PERL5LIB
PERLLIB
PERLIO_DEBUG
JAVA_TOOL_OPTIONS
SHELLOPTS
GLOBIGNORE
PS4
BASH_ENV
ENV
TERMCAP
TERMPATH
TERMINFO_DIRS
TERMINFO
_RLD*
LD_*
PATH_LOCALE
NLSPATH
HOSTALIASES
RES_OPTIONS
LOCALDOMAIN
CDPATH
IFS
Environment variables to preserve:
JAVA_HOME
TRAVIS
CI
DEBIAN_FRONTEND
XAUTHORIZATION
XAUTHORITY
PS2
PS1
PATH
LS_COLORS
KRB5CCNAME
HOSTNAME
HOME
DISPLAY
COLORS
Locale to use while parsing sudoers: C
Directory in which to store input/output logs: /var/log/sudo-io
File in which to store the input/output log: %{seq}
Add an entry to the utmp/utmpx file when allocating a pty
PAM service name to use
PAM service name to use for login shells
Create a new PAM session for the command to run in
Maximum I/O log sequence number: 0
Local IP address and netmask pairs:
10.240.0.28/255.255.255.255
172.17.0.1/255.255.0.0
Sudoers I/O plugin version 1.8.9p5
gzip version
gzip 1.6
Copyright (C) 2007, 2010, 2011 Free Software Foundation, Inc.
Copyright (C) 1993 Jean-loup Gailly.
This is free software. You may redistribute copies of it under the terms of
the GNU General Public License <http://www.gnu.org/licenses/gpl.html>.
There is NO WARRANTY, to the extent permitted by law.
Written by Jean-loup Gailly.
zip version
Copyright (c) 1990-2008 Info-ZIP - Type 'zip "-L"' for software license.
This is Zip 3.0 (July 5th 2008), by Info-ZIP.
Currently maintained by E. Gordon. Please send bug reports to
the authors using the web page at www.info-zip.org; see README for details.
Latest sources and executables are at ftp://ftp.info-zip.org/pub/infozip,
as of above date; see http://www.info-zip.org/ for other sites.
Compiled with gcc 4.8.2 for Unix (Linux ELF) on Oct 21 2013.
Zip special compilation options:
USE_EF_UT_TIME (store Universal Time)
BZIP2_SUPPORT (bzip2 library version 1.0.6, 6-Sept-2010)
bzip2 code and library copyright (c) Julian R Seward
(See the bzip2 license for terms of use)
SYMLINK_SUPPORT (symbolic links supported)
LARGE_FILE_SUPPORT (can read and write large files on file system)
ZIP64_SUPPORT (use Zip64 to store large files in archives)
UNICODE_SUPPORT (store and read UTF-8 Unicode paths)
STORE_UNIX_UIDs_GIDs (store UID/GID sizes/values using new extra field)
UIDGID_NOT_16BIT (old Unix 16-bit UID/GID extra field not used)
[encryption, version 2.91 of 05 Jan 2007] (modified for Zip 3)
Encryption notice:
The encryption code of this program is not copyrighted and is
put in the public domain. It was originally written in Europe
and, to the best of our knowledge, can be freely distributed
in both source and object forms from any country, including
the USA under License Exception TSU of the U.S. Export
Administration Regulations (section 740.13(e)) of 6 June 2002.
Zip environment options:
ZIP: [none]
ZIPOPT: [none]
vim version
VIM - Vi IMproved 7.4 (2013 Aug 10, compiled Nov 24 2016 16:43:18)
Included patches: 1-52
Extra patches: 8.0.0056
Modified by pkg-vim-maintainers@lists.alioth.debian.org
Compiled by buildd@
Huge version without GUI. Features included (+) or not (-):
+acl +farsi +mouse_netterm +syntax
+arabic +file_in_path +mouse_sgr +tag_binary
+autocmd +find_in_path -mouse_sysmouse +tag_old_static
-balloon_eval +float +mouse_urxvt -tag_any_white
-browse +folding +mouse_xterm -tcl
++builtin_terms -footer +multi_byte +terminfo
+byte_offset +fork() +multi_lang +termresponse
+cindent +gettext -mzscheme +textobjects
-clientserver -hangul_input +netbeans_intg +title
-clipboard +iconv +path_extra -toolbar
+cmdline_compl +insert_expand -perl +user_commands
+cmdline_hist +jumplist +persistent_undo +vertsplit
+cmdline_info +keymap +postscript +virtualedit
+comments +langmap +printer +visual
+conceal +libcall +profile +visualextra
+cryptv +linebreak +python +viminfo
+cscope +lispindent -python3 +vreplace
+cursorbind +listcmds +quickfix +wildignore
+cursorshape +localmap +reltime +wildmenu
+dialog_con -lua +rightleft +windows
+diff +menu -ruby +writebackup
+digraphs +mksession +scrollbind -X11
-dnd +modify_fname +signs -xfontset
-ebcdic +mouse +smartindent -xim
+emacs_tags -mouseshape -sniff -xsmp
+eval +mouse_dec +startuptime -xterm_clipboard
+ex_extra +mouse_gpm +statusline -xterm_save
+extra_search -mouse_jsbterm -sun_workshop -xpm
system vimrc file: "$VIM/vimrc"
user vimrc file: "$HOME/.vimrc"
2nd user vimrc file: "~/.vim/vimrc"
user exrc file: "$HOME/.exrc"
fall-back for $VIM: "/usr/share/vim"
Compilation: gcc -c -I. -Iproto -DHAVE_CONFIG_H -g -O2 -fstack-protector --param=ssp-buffer-size=4 -Wformat -Werror=format-security -U_FORTIFY_SOURCE -D_FORTIFY_SOURCE=1
Linking: gcc -Wl,-Bsymbolic-functions -Wl,-z,relro -Wl,--as-needed -o vim -lm -ltinfo -lnsl -lselinux -lacl -lattr -lgpm -ldl -L/usr/lib/python2.7/config-x86_64-linux-gnu -lpython2.7 -lpthread -ldl -lutil -lm -Xlinker -export-dynamic -Wl,-O1 -Wl,-Bsymbolic-functions
iptables version
iptables v1.4.21
curl version
curl 7.35.0 (x86_64-pc-linux-gnu) libcurl/7.35.0 OpenSSL/1.0.1f zlib/1.2.8 libidn/1.28 librtmp/2.3
wget version
GNU Wget 1.15 built on linux-gnu.
rsync version
rsync version 3.1.0 protocol version 31
gimme version
v1.2.0
nvm version
0.33.6
perlbrew version
/home/travis/perl5/perlbrew/bin/perlbrew - App::perlbrew/0.80
phpenv version
rbenv 1.1.1-25-g6aa70b6
rvm version
rvm 1.29.3 (latest) by Michal Papis, Piotr Kuczynski, Wayne E. Seguin [https://rvm.io]
default ruby version
ruby 2.4.1p111 (2017-03-22 revision 58053) [x86_64-linux]
CouchDB version
couchdb 1.6.1
ElasticSearch version
5.5.0
Installed Firefox version
firefox 56.0.2
MongoDB version
MongoDB 3.4.10
PhantomJS version
2.1.1
Pre-installed PostgreSQL versions
9.2.24
9.3.20
9.4.15
9.5.10
9.6.6
RabbitMQ Version
3.6.14
Redis version
redis-server 4.0.6
riak version
2.2.3
Pre-installed Go versions
1.7.4
ant version
Apache Ant(TM) version 1.9.3 compiled on April 8 2014
mvn version
Apache Maven 3.5.2 (138edd61fd100ec658bfa2d307c43b76940a5d7d; 2017-10-18T07:58:13Z)
Maven home: /usr/local/maven-3.5.2
Java version: 1.8.0_151, vendor: Oracle Corporation
Java home: /usr/lib/jvm/java-8-oracle/jre
Default locale: en_US, platform encoding: UTF-8
OS name: "linux", version: "4.4.0-98-generic", arch: "amd64", family: "unix"
gradle version
------------------------------------------------------------
Gradle 4.0.1
------------------------------------------------------------
Build time: 2017-07-07 14:02:41 UTC
Revision: 38e5dc0f772daecca1d2681885d3d85414eb6826
Groovy: 2.4.11
Ant: Apache Ant(TM) version 1.9.6 compiled on June 29 2015
JVM: 1.8.0_151 (Oracle Corporation 25.151-b12)
OS: Linux 4.4.0-98-generic amd64
lein version
Leiningen 2.8.1 on Java 1.8.0_151 Java HotSpot(TM) 64-Bit Server VM
Pre-installed Node.js versions
v4.8.6
v6.12.0
v6.12.1
v8.9
v8.9.1
phpenv versions
system
5.6
* 5.6.32 (set by /home/travis/.phpenv/version)
7.0
7.0.25
7.1
7.1.11
hhvm
hhvm-stable
composer --version
Composer version 1.5.2 2017-09-11 16:59:25
Pre-installed Ruby versions
ruby-2.2.7
ruby-2.3.4
ruby-2.4.1
travis_fold:end:system_info

Network availability confirmed.
travis_fold:start:apt
Adding APT Sources (BETA)
$ export DEBIAN_FRONTEND=noninteractive
travis_time:start:23ce2ff0
$ sudo -E apt-add-repository -y "ppa:ubuntu-toolchain-r/test"
gpg: keyring `/tmp/tmpy5bw2qg9/secring.gpg' created
gpg: keyring `/tmp/tmpy5bw2qg9/pubring.gpg' created
gpg: requesting key BA9EF27F from hkp server keyserver.ubuntu.com
gpg: /tmp/tmpy5bw2qg9/trustdb.gpg: trustdb created
gpg: key BA9EF27F: public key "Launchpad Toolchain builds" imported
gpg: Total number processed: 1
gpg: imported: 1 (RSA: 1)
OK
travis_time:end:23ce2ff0:start=1529482128964775068,finish=1529482130653957592,duration=1689182524
Installing APT Packages (BETA)
$ export DEBIAN_FRONTEND=noninteractive
travis_time:start:10db05fc
$ sudo -E apt-get -yq update &>> ~/apt-get-update.log
travis_time:end:10db05fc:start=1529482130659573613,finish=1529482138862586322,duration=8203012709
travis_time:start:07d839bf
$ sudo -E apt-get -yq --no-install-suggests --no-install-recommends --force-yes install ccache libssl1.0.0 bar time binutils gcc-5 g++-5 gcc-5-multilib g++-5-multilib make:i386 libssl-dev:i386 gfortran-5 gfortran-5-multilib
Reading package lists...
Building dependency tree...
Reading state information...
ccache is already the newest version (3.1.9-1).
time is already the newest version (1.7-24).
binutils is already the newest version (2.24-5ubuntu14.2).
binutils set to manually installed.
The following additional packages will be installed:
cpp-5 gcc-5-base gcc-6-base gcc-7-base gcc-8-base gcc-8-base:i386 lib32asan2
lib32atomic1 lib32cilkrts5 lib32gcc-5-dev lib32gcc1 lib32gfortran-5-dev
lib32gfortran3 lib32gomp1 lib32itm1 lib32mpx0 lib32quadmath0
lib32stdc++-5-dev lib32stdc++6 lib32ubsan0 libasan2 libatomic1 libc-dev-bin
libc6 libc6:i386 libc6-dev libc6-dev:i386 libc6-dev-i386 libc6-dev-x32
libc6-i386 libc6-x32 libcc1-0 libcilkrts5 libgcc-5-dev libgcc1 libgcc1:i386
libgfortran-5-dev libgfortran3 libgomp1 libisl15 libitm1 liblsan0 libmpfr4
libmpx0 libquadmath0 libssl-dev libssl1.0.0:i386 libstdc++-5-dev libstdc++6
libtsan0 libubsan0 libx32asan2 libx32atomic1 libx32cilkrts5 libx32gcc-5-dev
libx32gcc1 libx32gfortran-5-dev libx32gfortran3 libx32gomp1 libx32itm1
libx32quadmath0 libx32stdc++-5-dev libx32stdc++6 libx32ubsan0 linux-libc-dev
linux-libc-dev:i386 zlib1g zlib1g:i386 zlib1g-dev zlib1g-dev:i386
Suggested packages:
gcc-5-locales gcc-5-doc libstdc++6-5-dbg lib32stdc++6-5-dbg
libx32stdc++6-5-dbg libgcc1-dbg libgomp1-dbg libitm1-dbg libatomic1-dbg
libasan2-dbg liblsan0-dbg libtsan0-dbg libubsan0-dbg libcilkrts5-dbg
libmpx0-dbg libquadmath0-dbg gfortran-5-doc libgfortran3-dbg glibc-doc
glibc-doc:i386 locales:i386 manpages-dev manpages-dev:i386 libstdc++-5-doc
make-doc:i386
Recommended packages:
manpages-dev gcc:i386 | c-compiler:i386 gcc-multilib libssl-doc
libssl-doc:i386
The following packages will be REMOVED:
make
The following NEW packages will be installed:
bar cpp-5 g++-5 g++-5-multilib gcc-5 gcc-5-base gcc-5-multilib gcc-6-base
gcc-7-base gcc-8-base gcc-8-base:i386 gfortran-5 gfortran-5-multilib
lib32asan2 lib32atomic1 lib32cilkrts5 lib32gcc-5-dev lib32gcc1
lib32gfortran-5-dev lib32gfortran3 lib32gomp1 lib32itm1 lib32mpx0
lib32quadmath0 lib32stdc++-5-dev lib32stdc++6 lib32ubsan0 libasan2
libc6:i386 libc6-dev:i386 libc6-dev-i386 libc6-dev-x32 libc6-i386 libc6-x32
libcc1-0 libcilkrts5 libgcc-5-dev libgcc1:i386 libgfortran-5-dev
libgfortran3 libisl15 liblsan0 libmpx0 libssl-dev:i386 libssl1.0.0:i386
libstdc++-5-dev libubsan0 libx32asan2 libx32atomic1 libx32cilkrts5
libx32gcc-5-dev libx32gcc1 libx32gfortran-5-dev libx32gfortran3 libx32gomp1
libx32itm1 libx32quadmath0 libx32stdc++-5-dev libx32stdc++6 libx32ubsan0
linux-libc-dev:i386 make:i386 zlib1g:i386 zlib1g-dev:i386
The following packages will be upgraded:
libatomic1 libc-dev-bin libc6 libc6-dev libgcc1 libgomp1 libitm1 libmpfr4
libquadmath0 libssl-dev libssl1.0.0 libstdc++6 libtsan0 linux-libc-dev
zlib1g zlib1g-dev
16 upgraded, 64 newly installed, 1 to remove and 200 not upgraded.
Need to get 64.7 MB of archives.
After this operation, 227 MB of additional disk space will be used.
Get:1 http://us-central1.gce.archive.ubuntu.com/ubuntu trusty-updates/main amd64 libc-dev-bin amd64 2.19-0ubuntu6.14 [69.0 kB]
Get:2 http://us-central1.gce.archive.ubuntu.com/ubuntu trusty-updates/main amd64 libc6-dev amd64 2.19-0ubuntu6.14 [1,913 kB]
Get:3 http://us-central1.gce.archive.ubuntu.com/ubuntu trusty-updates/main amd64 libc6 amd64 2.19-0ubuntu6.14 [4,753 kB]
Get:4 http://us-central1.gce.archive.ubuntu.com/ubuntu trusty-updates/main amd64 linux-libc-dev amd64 3.13.0-151.201 [774 kB]
Get:5 http://us-central1.gce.archive.ubuntu.com/ubuntu trusty-updates/main i386 libc6 i386 2.19-0ubuntu6.14 [4,015 kB]
Get:6 http://ppa.launchpad.net/ubuntu-toolchain-r/test/ubuntu trusty/main amd64 gcc-8-base amd64 8.1.0-5ubuntu1~14.04 [18.3 kB]
Get:7 http://us-central1.gce.archive.ubuntu.com/ubuntu trusty/main i386 make i386 3.81-8.2ubuntu3 [115 kB]
Get:8 http://us-central1.gce.archive.ubuntu.com/ubuntu trusty-updates/main amd64 libssl-dev amd64 1.0.1f-1ubuntu2.25 [1,072 kB]
Get:9 http://us-central1.gce.archive.ubuntu.com/ubuntu trusty-updates/main amd64 libssl1.0.0 amd64 1.0.1f-1ubuntu2.25 [831 kB]
Get:10 http://us-central1.gce.archive.ubuntu.com/ubuntu trusty-updates/main i386 libssl1.0.0 i386 1.0.1f-1ubuntu2.25 [784 kB]
Get:11 http://us-central1.gce.archive.ubuntu.com/ubuntu trusty/universe amd64 bar amd64 1.11.1-2 [41.7 kB]
Get:12 http://us-central1.gce.archive.ubuntu.com/ubuntu trusty-updates/main amd64 libc6-i386 amd64 2.19-0ubuntu6.14 [2,208 kB]
Get:13 http://us-central1.gce.archive.ubuntu.com/ubuntu trusty-updates/main amd64 libc6-dev-i386 amd64 2.19-0ubuntu6.14 [1,152 kB]
Get:14 http://us-central1.gce.archive.ubuntu.com/ubuntu trusty-updates/main amd64 libc6-x32 amd64 2.19-0ubuntu6.14 [2,435 kB]
Get:15 http://us-central1.gce.archive.ubuntu.com/ubuntu trusty-updates/main amd64 libc6-dev-x32 amd64 2.19-0ubuntu6.14 [1,413 kB]
Get:16 http://us-central1.gce.archive.ubuntu.com/ubuntu trusty-updates/main i386 linux-libc-dev i386 3.13.0-151.201 [773 kB]
Get:17 http://us-central1.gce.archive.ubuntu.com/ubuntu trusty-updates/main i386 libc6-dev i386 2.19-0ubuntu6.14 [1,557 kB]
Get:18 http://us-central1.gce.archive.ubuntu.com/ubuntu trusty-updates/main i386 libssl-dev i386 1.0.1f-1ubuntu2.25 [991 kB]
Get:19 http://ppa.launchpad.net/ubuntu-toolchain-r/test/ubuntu trusty/main amd64 libgcc1 amd64 1:8.1.0-5ubuntu1~14.04 [40.7 kB]
Get:20 http://ppa.launchpad.net/ubuntu-toolchain-r/test/ubuntu trusty/main i386 gcc-8-base i386 8.1.0-5ubuntu1~14.04 [18.3 kB]
Get:21 http://ppa.launchpad.net/ubuntu-toolchain-r/test/ubuntu trusty/main i386 libgcc1 i386 1:8.1.0-5ubuntu1~14.04 [48.1 kB]
Get:22 http://ppa.launchpad.net/ubuntu-toolchain-r/test/ubuntu trusty/main amd64 zlib1g-dev amd64 1:1.2.8.dfsg-1ubuntu1.0 [166 kB]
Get:23 http://ppa.launchpad.net/ubuntu-toolchain-r/test/ubuntu trusty/main amd64 zlib1g amd64 1:1.2.8.dfsg-1ubuntu1.0 [49.8 kB]
Get:24 http://ppa.launchpad.net/ubuntu-toolchain-r/test/ubuntu trusty/main amd64 libstdc++6 amd64 8.1.0-5ubuntu1~14.04 [310 kB]
Get:25 http://ppa.launchpad.net/ubuntu-toolchain-r/test/ubuntu trusty/main i386 zlib1g i386 1:1.2.8.dfsg-1ubuntu1.0 [50.5 kB]
Get:26 http://ppa.launchpad.net/ubuntu-toolchain-r/test/ubuntu trusty/main amd64 gcc-5-base amd64 5.5.0-12ubuntu1~14.04 [16.6 kB]
Get:27 http://ppa.launchpad.net/ubuntu-toolchain-r/test/ubuntu trusty/main amd64 libasan2 amd64 5.5.0-12ubuntu1~14.04 [261 kB]
Get:28 http://ppa.launchpad.net/ubuntu-toolchain-r/test/ubuntu trusty/main amd64 libatomic1 amd64 8.1.0-5ubuntu1~14.04 [9,082 B]
Get:29 http://ppa.launchpad.net/ubuntu-toolchain-r/test/ubuntu trusty/main amd64 libcc1-0 amd64 8.1.0-5ubuntu1~14.04 [38.4 kB]
Get:30 http://ppa.launchpad.net/ubuntu-toolchain-r/test/ubuntu trusty/main amd64 gcc-7-base amd64 7.3.0-21ubuntu1~14.04 [18.4 kB]
Get:31 http://ppa.launchpad.net/ubuntu-toolchain-r/test/ubuntu trusty/main amd64 libcilkrts5 amd64 7.3.0-21ubuntu1~14.04 [42.4 kB]
Get:32 http://ppa.launchpad.net/ubuntu-toolchain-r/test/ubuntu trusty/main amd64 gcc-6-base amd64 6.4.0-17ubuntu1~14.04 [16.7 kB]
Get:33 http://ppa.launchpad.net/ubuntu-toolchain-r/test/ubuntu trusty/main amd64 libquadmath0 amd64 8.1.0-5ubuntu1~14.04 [133 kB]
Get:34 http://ppa.launchpad.net/ubuntu-toolchain-r/test/ubuntu trusty/main amd64 libgfortran3 amd64 6.4.0-17ubuntu1~14.04 [266 kB]
Get:35 http://ppa.launchpad.net/ubuntu-toolchain-r/test/ubuntu trusty/main amd64 libgomp1 amd64 8.1.0-5ubuntu1~14.04 [75.9 kB]
Get:36 http://ppa.launchpad.net/ubuntu-toolchain-r/test/ubuntu trusty/main amd64 libisl15 amd64 0.15-3~14.04 [507 kB]
Get:37 http://ppa.launchpad.net/ubuntu-toolchain-r/test/ubuntu trusty/main amd64 libitm1 amd64 8.1.0-5ubuntu1~14.04 [27.9 kB]
Get:38 http://ppa.launchpad.net/ubuntu-toolchain-r/test/ubuntu trusty/main amd64 liblsan0 amd64 8.1.0-5ubuntu1~14.04 [131 kB]
Get:39 http://ppa.launchpad.net/ubuntu-toolchain-r/test/ubuntu trusty/main amd64 libmpfr4 amd64 3.1.3-1~14.04 [178 kB]
Get:40 http://ppa.launchpad.net/ubuntu-toolchain-r/test/ubuntu trusty/main amd64 libmpx0 amd64 5.5.0-12ubuntu1~14.04 [9,878 B]
Get:41 http://ppa.launchpad.net/ubuntu-toolchain-r/test/ubuntu trusty/main amd64 libtsan0 amd64 8.1.0-5ubuntu1~14.04 [284 kB]
Get:42 http://ppa.launchpad.net/ubuntu-toolchain-r/test/ubuntu trusty/main amd64 libubsan0 amd64 7.3.0-21ubuntu1~14.04 [124 kB]
Get:43 http://ppa.launchpad.net/ubuntu-toolchain-r/test/ubuntu trusty/main amd64 cpp-5 amd64 5.5.0-12ubuntu1~14.04 [5,847 kB]
Get:44 http://ppa.launchpad.net/ubuntu-toolchain-r/test/ubuntu trusty/main amd64 libgcc-5-dev amd64 5.5.0-12ubuntu1~14.04 [2,216 kB]
Get:45 http://ppa.launchpad.net/ubuntu-toolchain-r/test/ubuntu trusty/main amd64 gcc-5 amd64 5.5.0-12ubuntu1~14.04 [6,652 kB]
Get:46 http://ppa.launchpad.net/ubuntu-toolchain-r/test/ubuntu trusty/main amd64 libstdc++-5-dev amd64 5.5.0-12ubuntu1~14.04 [1,245 kB]
Get:47 http://ppa.launchpad.net/ubuntu-toolchain-r/test/ubuntu trusty/main amd64 g++-5 amd64 5.5.0-12ubuntu1~14.04 [6,291 kB]
Get:48 http://ppa.launchpad.net/ubuntu-toolchain-r/test/ubuntu trusty/main amd64 lib32gcc1 amd64 1:8.1.0-5ubuntu1~14.04 [47.9 kB]
Get:49 http://ppa.launchpad.net/ubuntu-toolchain-r/test/ubuntu trusty/main amd64 libx32gcc1 amd64 1:8.1.0-5ubuntu1~14.04 [40.6 kB]
Get:50 http://ppa.launchpad.net/ubuntu-toolchain-r/test/ubuntu trusty/main amd64 lib32gomp1 amd64 8.1.0-5ubuntu1~14.04 [83.0 kB]
Get:51 http://ppa.launchpad.net/ubuntu-toolchain-r/test/ubuntu trusty/main amd64 libx32gomp1 amd64 8.1.0-5ubuntu1~14.04 [77.4 kB]
Get:52 http://ppa.launchpad.net/ubuntu-toolchain-r/test/ubuntu trusty/main amd64 lib32itm1 amd64 8.1.0-5ubuntu1~14.04 [29.9 kB]
Get:53 http://ppa.launchpad.net/ubuntu-toolchain-r/test/ubuntu trusty/main amd64 libx32itm1 amd64 8.1.0-5ubuntu1~14.04 [28.1 kB]
Get:54 http://ppa.launchpad.net/ubuntu-toolchain-r/test/ubuntu trusty/main amd64 lib32atomic1 amd64 8.1.0-5ubuntu1~14.04 [8,676 B]
Get:55 http://ppa.launchpad.net/ubuntu-toolchain-r/test/ubuntu trusty/main amd64 libx32atomic1 amd64 8.1.0-5ubuntu1~14.04 [9,098 B]
Get:56 http://ppa.launchpad.net/ubuntu-toolchain-r/test/ubuntu trusty/main amd64 lib32asan2 amd64 5.5.0-12ubuntu1~14.04 [255 kB]
Get:57 http://ppa.launchpad.net/ubuntu-toolchain-r/test/ubuntu trusty/main amd64 libx32asan2 amd64 5.5.0-12ubuntu1~14.04 [250 kB]
Get:58 http://ppa.launchpad.net/ubuntu-toolchain-r/test/ubuntu trusty/main amd64 lib32stdc++6 amd64 8.1.0-5ubuntu1~14.04 [318 kB]
Get:59 http://ppa.launchpad.net/ubuntu-toolchain-r/test/ubuntu trusty/main amd64 lib32ubsan0 amd64 7.3.0-21ubuntu1~14.04 [138 kB]
Get:60 http://ppa.launchpad.net/ubuntu-toolchain-r/test/ubuntu trusty/main amd64 libx32stdc++6 amd64 8.1.0-5ubuntu1~14.04 [297 kB]
Get:61 http://ppa.launchpad.net/ubuntu-toolchain-r/test/ubuntu trusty/main amd64 libx32ubsan0 amd64 7.3.0-21ubuntu1~14.04 [126 kB]
Get:62 http://ppa.launchpad.net/ubuntu-toolchain-r/test/ubuntu trusty/main amd64 lib32cilkrts5 amd64 7.3.0-21ubuntu1~14.04 [47.2 kB]
Get:63 http://ppa.launchpad.net/ubuntu-toolchain-r/test/ubuntu trusty/main amd64 libx32cilkrts5 amd64 7.3.0-21ubuntu1~14.04 [43.1 kB]
Get:64 http://ppa.launchpad.net/ubuntu-toolchain-r/test/ubuntu trusty/main amd64 lib32mpx0 amd64 5.5.0-12ubuntu1~14.04 [11.2 kB]
Get:65 http://ppa.launchpad.net/ubuntu-toolchain-r/test/ubuntu trusty/main amd64 lib32quadmath0 amd64 8.1.0-5ubuntu1~14.04 [205 kB]
Get:66 http://ppa.launchpad.net/ubuntu-toolchain-r/test/ubuntu trusty/main amd64 libx32quadmath0 amd64 8.1.0-5ubuntu1~14.04 [135 kB]
Get:67 http://ppa.launchpad.net/ubuntu-toolchain-r/test/ubuntu trusty/main amd64 lib32gcc-5-dev amd64 5.5.0-12ubuntu1~14.04 [2,046 kB]
Get:68 http://ppa.launchpad.net/ubuntu-toolchain-r/test/ubuntu trusty/main amd64 libx32gcc-5-dev amd64 5.5.0-12ubuntu1~14.04 [1,864 kB]
Get:69 http://ppa.launchpad.net/ubuntu-toolchain-r/test/ubuntu trusty/main amd64 gcc-5-multilib amd64 5.5.0-12ubuntu1~14.04 [962 B]
Get:70 http://ppa.launchpad.net/ubuntu-toolchain-r/test/ubuntu trusty/main amd64 lib32stdc++-5-dev amd64 5.5.0-12ubuntu1~14.04 [448 kB]
Get:71 http://ppa.launchpad.net/ubuntu-toolchain-r/test/ubuntu trusty/main amd64 libx32stdc++-5-dev amd64 5.5.0-12ubuntu1~14.04 [428 kB]
Get:72 http://ppa.launchpad.net/ubuntu-toolchain-r/test/ubuntu trusty/main amd64 g++-5-multilib amd64 5.5.0-12ubuntu1~14.04 [978 B]
Get:73 http://ppa.launchpad.net/ubuntu-toolchain-r/test/ubuntu trusty/main amd64 libgfortran-5-dev amd64 5.5.0-12ubuntu1~14.04 [290 kB]
Get:74 http://ppa.launchpad.net/ubuntu-toolchain-r/test/ubuntu trusty/main amd64 gfortran-5 amd64 5.5.0-12ubuntu1~14.04 [6,194 kB]
Get:75 http://ppa.launchpad.net/ubuntu-toolchain-r/test/ubuntu trusty/main amd64 lib32gfortran3 amd64 6.4.0-17ubuntu1~14.04 [260 kB]
Get:76 http://ppa.launchpad.net/ubuntu-toolchain-r/test/ubuntu trusty/main amd64 lib32gfortran-5-dev amd64 5.5.0-12ubuntu1~14.04 [276 kB]
Get:77 http://ppa.launchpad.net/ubuntu-toolchain-r/test/ubuntu trusty/main amd64 libx32gfortran3 amd64 6.4.0-17ubuntu1~14.04 [269 kB]
Get:78 http://ppa.launchpad.net/ubuntu-toolchain-r/test/ubuntu trusty/main amd64 libx32gfortran-5-dev amd64 5.5.0-12ubuntu1~14.04 [290 kB]
Get:79 http://ppa.launchpad.net/ubuntu-toolchain-r/test/ubuntu trusty/main amd64 gfortran-5-multilib amd64 5.5.0-12ubuntu1~14.04 [970 B]
Get:80 http://ppa.launchpad.net/ubuntu-toolchain-r/test/ubuntu trusty/main i386 zlib1g-dev i386 1:1.2.8.dfsg-1ubuntu1.0 [165 kB]
Extracting templates from packages: 37%
Extracting templates from packages: 75%
Extracting templates from packages: 100%
Preconfiguring packages ...
Fetched 64.7 MB in 1min 56s (555 kB/s)
Selecting previously unselected package gcc-8-base:amd64.
(Reading database ...
(Reading database ... 5%
(Reading database ... 10%
(Reading database ... 15%
(Reading database ... 20%
(Reading database ... 25%
(Reading database ... 30%
(Reading database ... 35%
(Reading database ... 40%
(Reading database ... 45%
(Reading database ... 50%
(Reading database ... 55%
(Reading database ... 60%
(Reading database ... 65%
(Reading database ... 70%
(Reading database ... 75%
(Reading database ... 80%
(Reading database ... 85%
(Reading database ... 90%
(Reading database ... 95%
(Reading database ... 100%
(Reading database ... 93696 files and directories currently installed.)
Preparing to unpack .../gcc-8-base_8.1.0-5ubuntu1~14.04_amd64.deb ...
Unpacking gcc-8-base:amd64 (8.1.0-5ubuntu1~14.04) ...
Selecting previously unselected package gcc-8-base:i386.
Preparing to unpack .../gcc-8-base_8.1.0-5ubuntu1~14.04_i386.deb ...
Unpacking gcc-8-base:i386 (8.1.0-5ubuntu1~14.04) ...
Processing triggers for ccache (3.1.9-1) ...
Updating symlinks in /usr/lib/ccache ...
Setting up gcc-8-base:amd64 (8.1.0-5ubuntu1~14.04) ...
Setting up gcc-8-base:i386 (8.1.0-5ubuntu1~14.04) ...
(Reading database ...
(Reading database ... 5%
(Reading database ... 10%
(Reading database ... 15%
(Reading database ... 20%
(Reading database ... 25%
(Reading database ... 30%
(Reading database ... 35%
(Reading database ... 40%
(Reading database ... 45%
(Reading database ... 50%
(Reading database ... 55%
(Reading database ... 60%
(Reading database ... 65%
(Reading database ... 70%
(Reading database ... 75%
(Reading database ... 80%
(Reading database ... 85%
(Reading database ... 90%
(Reading database ... 95%
(Reading database ... 100%
(Reading database ... 93705 files and directories currently installed.)
Preparing to unpack .../libgcc1_1%3a8.1.0-5ubuntu1~14.04_amd64.deb ...
Unpacking libgcc1:amd64 (1:8.1.0-5ubuntu1~14.04) over (1:4.9.3-0ubuntu4) ...
Selecting previously unselected package libgcc1:i386.
Preparing to unpack .../libgcc1_1%3a8.1.0-5ubuntu1~14.04_i386.deb ...
Unpacking libgcc1:i386 (1:8.1.0-5ubuntu1~14.04) ...
Setting up libgcc1:amd64 (1:8.1.0-5ubuntu1~14.04) ...
Processing triggers for libc-bin (2.19-0ubuntu6.13) ...
(Reading database ...
(Reading database ... 5%
(Reading database ... 10%
(Reading database ... 15%
(Reading database ... 20%
(Reading database ... 25%
(Reading database ... 30%
(Reading database ... 35%
(Reading database ... 40%
(Reading database ... 45%
(Reading database ... 50%
(Reading database ... 55%
(Reading database ... 60%
(Reading database ... 65%
(Reading database ... 70%
(Reading database ... 75%
(Reading database ... 80%
(Reading database ... 85%
(Reading database ... 90%
(Reading database ... 95%
(Reading database ... 100%
(Reading database ... 93707 files and directories currently installed.)
Preparing to unpack .../libc6_2.19-0ubuntu6.14_amd64.deb ...
Unpacking libc6:amd64 (2.19-0ubuntu6.14) over (2.19-0ubuntu6.13) ...
Selecting previously unselected package libc6:i386.
Preparing to unpack .../libc6_2.19-0ubuntu6.14_i386.deb ...
Unpacking libc6:i386 (2.19-0ubuntu6.14) ...
Setting up libc6:amd64 (2.19-0ubuntu6.14) ...
Setting up libc6:i386 (2.19-0ubuntu6.14) ...
Setting up libgcc1:i386 (1:8.1.0-5ubuntu1~14.04) ...
Processing triggers for libc-bin (2.19-0ubuntu6.13) ...
(Reading database ...
(Reading database ... 5%
(Reading database ... 10%
(Reading database ... 15%
(Reading database ... 20%
(Reading database ... 25%
(Reading database ... 30%
(Reading database ... 35%
(Reading database ... 40%
(Reading database ... 45%
(Reading database ... 50%
(Reading database ... 55%
(Reading database ... 60%
(Reading database ... 65%
(Reading database ... 70%
(Reading database ... 75%
(Reading database ... 80%
(Reading database ... 85%
(Reading database ... 90%
(Reading database ... 95%
(Reading database ... 100%
(Reading database ... 94011 files and directories currently installed.)
Preparing to unpack .../libc-dev-bin_2.19-0ubuntu6.14_amd64.deb ...
Unpacking libc-dev-bin (2.19-0ubuntu6.14) over (2.19-0ubuntu6.13) ...
Preparing to unpack .../libc6-dev_2.19-0ubuntu6.14_amd64.deb ...
Unpacking libc6-dev:amd64 (2.19-0ubuntu6.14) over (2.19-0ubuntu6.13) ...
Preparing to unpack .../linux-libc-dev_3.13.0-151.201_amd64.deb ...
Unpacking linux-libc-dev:amd64 (3.13.0-151.201) over (3.13.0-135.184) ...
Processing triggers for man-db (2.6.7.1-1ubuntu1) ...
dpkg: make: dependency problems, but removing anyway as you requested:
build-essential depends on make; however:
Package make is to be removed.
dpkg-dev depends on make.
(Reading database ...
(Reading database ... 5%
(Reading database ... 10%
(Reading database ... 15%
(Reading database ... 20%
(Reading database ... 25%
(Reading database ... 30%
(Reading database ... 35%
(Reading database ... 40%
(Reading database ... 45%
(Reading database ... 50%
(Reading database ... 55%
(Reading database ... 60%
(Reading database ... 65%
(Reading database ... 70%
(Reading database ... 75%
(Reading database ... 80%
(Reading database ... 85%
(Reading database ... 90%
(Reading database ... 95%
(Reading database ... 100%
(Reading database ... 94011 files and directories currently installed.)
Removing make (3.81-8.2ubuntu3) ...
Processing triggers for man-db (2.6.7.1-1ubuntu1) ...
Selecting previously unselected package make.
(Reading database ...
(Reading database ... 5%
(Reading database ... 10%
(Reading database ... 15%
(Reading database ... 20%
(Reading database ... 25%
(Reading database ... 30%
(Reading database ... 35%
(Reading database ... 40%
(Reading database ... 45%
(Reading database ... 50%
(Reading database ... 55%
(Reading database ... 60%
(Reading database ... 65%
(Reading database ... 70%
(Reading database ... 75%
(Reading database ... 80%
(Reading database ... 85%
(Reading database ... 90%
(Reading database ... 95%
(Reading database ... 100%
(Reading database ... 94001 files and directories currently installed.)
Preparing to unpack .../make_3.81-8.2ubuntu3_i386.deb ...
Unpacking make (3.81-8.2ubuntu3) ...
Preparing to unpack .../zlib1g-dev_1%3a1.2.8.dfsg-1ubuntu1.0_amd64.deb ...
Unpacking zlib1g-dev:amd64 (1:1.2.8.dfsg-1ubuntu1.0) over (1:1.2.8.dfsg-1ubuntu1) ...
Preparing to unpack .../zlib1g_1%3a1.2.8.dfsg-1ubuntu1.0_amd64.deb ...
Unpacking zlib1g:amd64 (1:1.2.8.dfsg-1ubuntu1.0) over (1:1.2.8.dfsg-1ubuntu1) ...
Selecting previously unselected package zlib1g:i386.
Preparing to unpack .../zlib1g_1%3a1.2.8.dfsg-1ubuntu1.0_i386.deb ...
Unpacking zlib1g:i386 (1:1.2.8.dfsg-1ubuntu1.0) ...
Processing triggers for man-db (2.6.7.1-1ubuntu1) ...
Setting up zlib1g:amd64 (1:1.2.8.dfsg-1ubuntu1.0) ...
Setting up zlib1g:i386 (1:1.2.8.dfsg-1ubuntu1.0) ...
Processing triggers for libc-bin (2.19-0ubuntu6.13) ...
(Reading database ...
(Reading database ... 5%
(Reading database ... 10%
(Reading database ... 15%
(Reading database ... 20%
(Reading database ... 25%
(Reading database ... 30%
(Reading database ... 35%
(Reading database ... 40%
(Reading database ... 45%
(Reading database ... 50%
(Reading database ... 55%
(Reading database ... 60%
(Reading database ... 65%
(Reading database ... 70%
(Reading database ... 75%
(Reading database ... 80%
(Reading database ... 85%
(Reading database ... 90%
(Reading database ... 95%
(Reading database ... 100%
(Reading database ... 94013 files and directories currently installed.)
Preparing to unpack .../libstdc++6_8.1.0-5ubuntu1~14.04_amd64.deb ...
Unpacking libstdc++6:amd64 (8.1.0-5ubuntu1~14.04) over (4.8.4-2ubuntu1~14.04.3) ...
Setting up libstdc++6:amd64 (8.1.0-5ubuntu1~14.04) ...
Processing triggers for libc-bin (2.19-0ubuntu6.13) ...
(Reading database ...
(Reading database ... 5%
(Reading database ... 10%
(Reading database ... 15%
(Reading database ... 20%
(Reading database ... 25%
(Reading database ... 30%
(Reading database ... 35%
(Reading database ... 40%
(Reading database ... 45%
(Reading database ... 50%
(Reading database ... 55%
(Reading database ... 60%
(Reading database ... 65%
(Reading database ... 70%
(Reading database ... 75%
(Reading database ... 80%
(Reading database ... 85%
(Reading database ... 90%
(Reading database ... 95%
(Reading database ... 100%
(Reading database ... 94014 files and directories currently installed.)
Preparing to unpack .../libssl-dev_1.0.1f-1ubuntu2.25_amd64.deb ...
Unpacking libssl-dev:amd64 (1.0.1f-1ubuntu2.25) over (1.0.1f-1ubuntu2.23) ...
Preparing to unpack .../libssl1.0.0_1.0.1f-1ubuntu2.25_amd64.deb ...
Unpacking libssl1.0.0:amd64 (1.0.1f-1ubuntu2.25) over (1.0.1f-1ubuntu2.23) ...
Selecting previously unselected package libssl1.0.0:i386.
Preparing to unpack .../libssl1.0.0_1.0.1f-1ubuntu2.25_i386.deb ...
Unpacking libssl1.0.0:i386 (1.0.1f-1ubuntu2.25) ...
Selecting previously unselected package gcc-5-base:amd64.
Preparing to unpack .../gcc-5-base_5.5.0-12ubuntu1~14.04_amd64.deb ...
Unpacking gcc-5-base:amd64 (5.5.0-12ubuntu1~14.04) ...
Selecting previously unselected package libasan2:amd64.
Preparing to unpack .../libasan2_5.5.0-12ubuntu1~14.04_amd64.deb ...
Unpacking libasan2:amd64 (5.5.0-12ubuntu1~14.04) ...
Preparing to unpack .../libatomic1_8.1.0-5ubuntu1~14.04_amd64.deb ...
Unpacking libatomic1:amd64 (8.1.0-5ubuntu1~14.04) over (4.8.4-2ubuntu1~14.04.3) ...
Selecting previously unselected package libcc1-0:amd64.
Preparing to unpack .../libcc1-0_8.1.0-5ubuntu1~14.04_amd64.deb ...
Unpacking libcc1-0:amd64 (8.1.0-5ubuntu1~14.04) ...
Selecting previously unselected package gcc-7-base:amd64.
Preparing to unpack .../gcc-7-base_7.3.0-21ubuntu1~14.04_amd64.deb ...
Unpacking gcc-7-base:amd64 (7.3.0-21ubuntu1~14.04) ...
Selecting previously unselected package libcilkrts5:amd64.
Preparing to unpack .../libcilkrts5_7.3.0-21ubuntu1~14.04_amd64.deb ...
Unpacking libcilkrts5:amd64 (7.3.0-21ubuntu1~14.04) ...
Selecting previously unselected package gcc-6-base:amd64.
Preparing to unpack .../gcc-6-base_6.4.0-17ubuntu1~14.04_amd64.deb ...
Unpacking gcc-6-base:amd64 (6.4.0-17ubuntu1~14.04) ...
Preparing to unpack .../libquadmath0_8.1.0-5ubuntu1~14.04_amd64.deb ...
Unpacking libquadmath0:amd64 (8.1.0-5ubuntu1~14.04) over (4.8.4-2ubuntu1~14.04.3) ...
Selecting previously unselected package libgfortran3:amd64.
Preparing to unpack .../libgfortran3_6.4.0-17ubuntu1~14.04_amd64.deb ...
Unpacking libgfortran3:amd64 (6.4.0-17ubuntu1~14.04) ...
Preparing to unpack .../libgomp1_8.1.0-5ubuntu1~14.04_amd64.deb ...
Unpacking libgomp1:amd64 (8.1.0-5ubuntu1~14.04) over (4.8.4-2ubuntu1~14.04.3) ...
Selecting previously unselected package libisl15:amd64.
Preparing to unpack .../libisl15_0.15-3~14.04_amd64.deb ...
Unpacking libisl15:amd64 (0.15-3~14.04) ...
Preparing to unpack .../libitm1_8.1.0-5ubuntu1~14.04_amd64.deb ...
Unpacking libitm1:amd64 (8.1.0-5ubuntu1~14.04) over (4.8.4-2ubuntu1~14.04.3) ...
Selecting previously unselected package liblsan0:amd64.
Preparing to unpack .../liblsan0_8.1.0-5ubuntu1~14.04_amd64.deb ...
Unpacking liblsan0:amd64 (8.1.0-5ubuntu1~14.04) ...
Preparing to unpack .../libmpfr4_3.1.3-1~14.04_amd64.deb ...
Unpacking libmpfr4:amd64 (3.1.3-1~14.04) over (3.1.2-1) ...
Selecting previously unselected package libmpx0:amd64.
Preparing to unpack .../libmpx0_5.5.0-12ubuntu1~14.04_amd64.deb ...
Unpacking libmpx0:amd64 (5.5.0-12ubuntu1~14.04) ...
Preparing to unpack .../libtsan0_8.1.0-5ubuntu1~14.04_amd64.deb ...
Unpacking libtsan0:amd64 (8.1.0-5ubuntu1~14.04) over (4.8.4-2ubuntu1~14.04.3) ...
Selecting previously unselected package libubsan0:amd64.
Preparing to unpack .../libubsan0_7.3.0-21ubuntu1~14.04_amd64.deb ...
Unpacking libubsan0:amd64 (7.3.0-21ubuntu1~14.04) ...
Selecting previously unselected package bar.
Preparing to unpack .../bar_1.11.1-2_amd64.deb ...
Unpacking bar (1.11.1-2) ...
Selecting previously unselected package cpp-5.
Preparing to unpack .../cpp-5_5.5.0-12ubuntu1~14.04_amd64.deb ...
Unpacking cpp-5 (5.5.0-12ubuntu1~14.04) ...
Selecting previously unselected package libgcc-5-dev:amd64.
Preparing to unpack .../libgcc-5-dev_5.5.0-12ubuntu1~14.04_amd64.deb ...
Unpacking libgcc-5-dev:amd64 (5.5.0-12ubuntu1~14.04) ...
Selecting previously unselected package gcc-5.
Preparing to unpack .../gcc-5_5.5.0-12ubuntu1~14.04_amd64.deb ...
Unpacking gcc-5 (5.5.0-12ubuntu1~14.04) ...
Selecting previously unselected package libstdc++-5-dev:amd64.
Preparing to unpack .../libstdc++-5-dev_5.5.0-12ubuntu1~14.04_amd64.deb ...
Unpacking libstdc++-5-dev:amd64 (5.5.0-12ubuntu1~14.04) ...
Selecting previously unselected package g++-5.
Preparing to unpack .../g++-5_5.5.0-12ubuntu1~14.04_amd64.deb ...
Unpacking g++-5 (5.5.0-12ubuntu1~14.04) ...
Selecting previously unselected package libc6-i386.
Preparing to unpack .../libc6-i386_2.19-0ubuntu6.14_amd64.deb ...
Unpacking libc6-i386 (2.19-0ubuntu6.14) ...
Replaced by files in installed package libc6:i386 (2.19-0ubuntu6.14) ...
Selecting previously unselected package libc6-dev-i386.
Preparing to unpack .../libc6-dev-i386_2.19-0ubuntu6.14_amd64.deb ...
Unpacking libc6-dev-i386 (2.19-0ubuntu6.14) ...
Selecting previously unselected package libc6-x32.
Preparing to unpack .../libc6-x32_2.19-0ubuntu6.14_amd64.deb ...
Unpacking libc6-x32 (2.19-0ubuntu6.14) ...
Selecting previously unselected package libc6-dev-x32.
Preparing to unpack .../libc6-dev-x32_2.19-0ubuntu6.14_amd64.deb ...
Unpacking libc6-dev-x32 (2.19-0ubuntu6.14) ...
Selecting previously unselected package lib32gcc1.
Preparing to unpack .../lib32gcc1_1%3a8.1.0-5ubuntu1~14.04_amd64.deb ...
Unpacking lib32gcc1 (1:8.1.0-5ubuntu1~14.04) ...
Selecting previously unselected package libx32gcc1.
Preparing to unpack .../libx32gcc1_1%3a8.1.0-5ubuntu1~14.04_amd64.deb ...
Unpacking libx32gcc1 (1:8.1.0-5ubuntu1~14.04) ...
Selecting previously unselected package lib32gomp1.
Preparing to unpack .../lib32gomp1_8.1.0-5ubuntu1~14.04_amd64.deb ...
Unpacking lib32gomp1 (8.1.0-5ubuntu1~14.04) ...
Selecting previously unselected package libx32gomp1.
Preparing to unpack .../libx32gomp1_8.1.0-5ubuntu1~14.04_amd64.deb ...
Unpacking libx32gomp1 (8.1.0-5ubuntu1~14.04) ...
Selecting previously unselected package lib32itm1.
Preparing to unpack .../lib32itm1_8.1.0-5ubuntu1~14.04_amd64.deb ...
Unpacking lib32itm1 (8.1.0-5ubuntu1~14.04) ...
Selecting previously unselected package libx32itm1.
Preparing to unpack .../libx32itm1_8.1.0-5ubuntu1~14.04_amd64.deb ...
Unpacking libx32itm1 (8.1.0-5ubuntu1~14.04) ...
Selecting previously unselected package lib32atomic1.
Preparing to unpack .../lib32atomic1_8.1.0-5ubuntu1~14.04_amd64.deb ...
Unpacking lib32atomic1 (8.1.0-5ubuntu1~14.04) ...
Selecting previously unselected package libx32atomic1.
Preparing to unpack .../libx32atomic1_8.1.0-5ubuntu1~14.04_amd64.deb ...
Unpacking libx32atomic1 (8.1.0-5ubuntu1~14.04) ...
Selecting previously unselected package lib32asan2.
Preparing to unpack .../lib32asan2_5.5.0-12ubuntu1~14.04_amd64.deb ...
Unpacking lib32asan2 (5.5.0-12ubuntu1~14.04) ...
Selecting previously unselected package libx32asan2.
Preparing to unpack .../libx32asan2_5.5.0-12ubuntu1~14.04_amd64.deb ...
Unpacking libx32asan2 (5.5.0-12ubuntu1~14.04) ...
Selecting previously unselected package lib32stdc++6.
Preparing to unpack .../lib32stdc++6_8.1.0-5ubuntu1~14.04_amd64.deb ...
Unpacking lib32stdc++6 (8.1.0-5ubuntu1~14.04) ...
Selecting previously unselected package lib32ubsan0.
Preparing to unpack .../lib32ubsan0_7.3.0-21ubuntu1~14.04_amd64.deb ...
Unpacking lib32ubsan0 (7.3.0-21ubuntu1~14.04) ...
Selecting previously unselected package libx32stdc++6.
Preparing to unpack .../libx32stdc++6_8.1.0-5ubuntu1~14.04_amd64.deb ...
Unpacking libx32stdc++6 (8.1.0-5ubuntu1~14.04) ...
Selecting previously unselected package libx32ubsan0.
Preparing to unpack .../libx32ubsan0_7.3.0-21ubuntu1~14.04_amd64.deb ...
Unpacking libx32ubsan0 (7.3.0-21ubuntu1~14.04) ...
Selecting previously unselected package lib32cilkrts5.
Preparing to unpack .../lib32cilkrts5_7.3.0-21ubuntu1~14.04_amd64.deb ...
Unpacking lib32cilkrts5 (7.3.0-21ubuntu1~14.04) ...
Selecting previously unselected package libx32cilkrts5.
Preparing to unpack .../libx32cilkrts5_7.3.0-21ubuntu1~14.04_amd64.deb ...
Unpacking libx32cilkrts5 (7.3.0-21ubuntu1~14.04) ...
Selecting previously unselected package lib32mpx0.
Preparing to unpack .../lib32mpx0_5.5.0-12ubuntu1~14.04_amd64.deb ...
Unpacking lib32mpx0 (5.5.0-12ubuntu1~14.04) ...
Selecting previously unselected package lib32quadmath0.
Preparing to unpack .../lib32quadmath0_8.1.0-5ubuntu1~14.04_amd64.deb ...
Unpacking lib32quadmath0 (8.1.0-5ubuntu1~14.04) ...
Selecting previously unselected package libx32quadmath0.
Preparing to unpack .../libx32quadmath0_8.1.0-5ubuntu1~14.04_amd64.deb ...
Unpacking libx32quadmath0 (8.1.0-5ubuntu1~14.04) ...
Selecting previously unselected package lib32gcc-5-dev.
Preparing to unpack .../lib32gcc-5-dev_5.5.0-12ubuntu1~14.04_amd64.deb ...
Unpacking lib32gcc-5-dev (5.5.0-12ubuntu1~14.04) ...
Selecting previously unselected package libx32gcc-5-dev.
Preparing to unpack .../libx32gcc-5-dev_5.5.0-12ubuntu1~14.04_amd64.deb ...
Unpacking libx32gcc-5-dev (5.5.0-12ubuntu1~14.04) ...
Selecting previously unselected package gcc-5-multilib.
Preparing to unpack .../gcc-5-multilib_5.5.0-12ubuntu1~14.04_amd64.deb ...
Unpacking gcc-5-multilib (5.5.0-12ubuntu1~14.04) ...
Selecting previously unselected package lib32stdc++-5-dev.
Preparing to unpack .../lib32stdc++-5-dev_5.5.0-12ubuntu1~14.04_amd64.deb ...
Unpacking lib32stdc++-5-dev (5.5.0-12ubuntu1~14.04) ...
Selecting previously unselected package libx32stdc++-5-dev.
Preparing to unpack .../libx32stdc++-5-dev_5.5.0-12ubuntu1~14.04_amd64.deb ...
Unpacking libx32stdc++-5-dev (5.5.0-12ubuntu1~14.04) ...
Selecting previously unselected package g++-5-multilib.
Preparing to unpack .../g++-5-multilib_5.5.0-12ubuntu1~14.04_amd64.deb ...
Unpacking g++-5-multilib (5.5.0-12ubuntu1~14.04) ...
Selecting previously unselected package libgfortran-5-dev:amd64.
Preparing to unpack .../libgfortran-5-dev_5.5.0-12ubuntu1~14.04_amd64.deb ...
Unpacking libgfortran-5-dev:amd64 (5.5.0-12ubuntu1~14.04) ...
Selecting previously unselected package gfortran-5.
Preparing to unpack .../gfortran-5_5.5.0-12ubuntu1~14.04_amd64.deb ...
Unpacking gfortran-5 (5.5.0-12ubuntu1~14.04) ...
Selecting previously unselected package lib32gfortran3.
Preparing to unpack .../lib32gfortran3_6.4.0-17ubuntu1~14.04_amd64.deb ...
Unpacking lib32gfortran3 (6.4.0-17ubuntu1~14.04) ...
Selecting previously unselected package lib32gfortran-5-dev.
Preparing to unpack .../lib32gfortran-5-dev_5.5.0-12ubuntu1~14.04_amd64.deb ...
Unpacking lib32gfortran-5-dev (5.5.0-12ubuntu1~14.04) ...
Selecting previously unselected package libx32gfortran3.
Preparing to unpack .../libx32gfortran3_6.4.0-17ubuntu1~14.04_amd64.deb ...
Unpacking libx32gfortran3 (6.4.0-17ubuntu1~14.04) ...
Selecting previously unselected package libx32gfortran-5-dev.
Preparing to unpack .../libx32gfortran-5-dev_5.5.0-12ubuntu1~14.04_amd64.deb ...
Unpacking libx32gfortran-5-dev (5.5.0-12ubuntu1~14.04) ...
Selecting previously unselected package gfortran-5-multilib.
Preparing to unpack .../gfortran-5-multilib_5.5.0-12ubuntu1~14.04_amd64.deb ...
Unpacking gfortran-5-multilib (5.5.0-12ubuntu1~14.04) ...
Selecting previously unselected package linux-libc-dev:i386.
Preparing to unpack .../linux-libc-dev_3.13.0-151.201_i386.deb ...
Unpacking linux-libc-dev:i386 (3.13.0-151.201) ...
Selecting previously unselected package libc6-dev:i386.
Preparing to unpack .../libc6-dev_2.19-0ubuntu6.14_i386.deb ...
Unpacking libc6-dev:i386 (2.19-0ubuntu6.14) ...
Selecting previously unselected package zlib1g-dev:i386.
Preparing to unpack .../zlib1g-dev_1%3a1.2.8.dfsg-1ubuntu1.0_i386.deb ...
Unpacking zlib1g-dev:i386 (1:1.2.8.dfsg-1ubuntu1.0) ...
Selecting previously unselected package libssl-dev:i386.
Preparing to unpack .../libssl-dev_1.0.1f-1ubuntu2.25_i386.deb ...
Unpacking libssl-dev:i386 (1.0.1f-1ubuntu2.25) ...
Processing triggers for ccache (3.1.9-1) ...
Updating symlinks in /usr/lib/ccache ...
Processing triggers for man-db (2.6.7.1-1ubuntu1) ...
Setting up libc-dev-bin (2.19-0ubuntu6.14) ...
Setting up linux-libc-dev:amd64 (3.13.0-151.201) ...
Setting up linux-libc-dev:i386 (3.13.0-151.201) ...
Setting up libc6-dev:amd64 (2.19-0ubuntu6.14) ...
Setting up libc6-dev:i386 (2.19-0ubuntu6.14) ...
Setting up make (3.81-8.2ubuntu3) ...
Setting up zlib1g-dev:amd64 (1:1.2.8.dfsg-1ubuntu1.0) ...
Setting up zlib1g-dev:i386 (1:1.2.8.dfsg-1ubuntu1.0) ...
Setting up libssl1.0.0:amd64 (1.0.1f-1ubuntu2.25) ...
Setting up libssl1.0.0:i386 (1.0.1f-1ubuntu2.25) ...
Setting up libssl-dev:amd64 (1.0.1f-1ubuntu2.25) ...
Setting up libssl-dev:i386 (1.0.1f-1ubuntu2.25) ...
Setting up gcc-5-base:amd64 (5.5.0-12ubuntu1~14.04) ...
Setting up libasan2:amd64 (5.5.0-12ubuntu1~14.04) ...
Setting up libatomic1:amd64 (8.1.0-5ubuntu1~14.04) ...
Setting up libcc1-0:amd64 (8.1.0-5ubuntu1~14.04) ...
Setting up gcc-7-base:amd64 (7.3.0-21ubuntu1~14.04) ...
Setting up libcilkrts5:amd64 (7.3.0-21ubuntu1~14.04) ...
Setting up gcc-6-base:amd64 (6.4.0-17ubuntu1~14.04) ...
Setting up libquadmath0:amd64 (8.1.0-5ubuntu1~14.04) ...
Setting up libgfortran3:amd64 (6.4.0-17ubuntu1~14.04) ...
Setting up libgomp1:amd64 (8.1.0-5ubuntu1~14.04) ...
Setting up libisl15:amd64 (0.15-3~14.04) ...
Setting up libitm1:amd64 (8.1.0-5ubuntu1~14.04) ...
Setting up liblsan0:amd64 (8.1.0-5ubuntu1~14.04) ...
Setting up libmpfr4:amd64 (3.1.3-1~14.04) ...
Setting up libmpx0:amd64 (5.5.0-12ubuntu1~14.04) ...
Setting up libtsan0:amd64 (8.1.0-5ubuntu1~14.04) ...
Setting up libubsan0:amd64 (7.3.0-21ubuntu1~14.04) ...
Setting up bar (1.11.1-2) ...
Setting up cpp-5 (5.5.0-12ubuntu1~14.04) ...
Setting up libgcc-5-dev:amd64 (5.5.0-12ubuntu1~14.04) ...
Setting up gcc-5 (5.5.0-12ubuntu1~14.04) ...
Setting up libstdc++-5-dev:amd64 (5.5.0-12ubuntu1~14.04) ...
Setting up g++-5 (5.5.0-12ubuntu1~14.04) ...
Setting up libc6-i386 (2.19-0ubuntu6.14) ...
Setting up libc6-dev-i386 (2.19-0ubuntu6.14) ...
Setting up libc6-x32 (2.19-0ubuntu6.14) ...
Setting up libc6-dev-x32 (2.19-0ubuntu6.14) ...
Setting up lib32gcc1 (1:8.1.0-5ubuntu1~14.04) ...
Setting up libx32gcc1 (1:8.1.0-5ubuntu1~14.04) ...
Setting up lib32gomp1 (8.1.0-5ubuntu1~14.04) ...
Setting up libx32gomp1 (8.1.0-5ubuntu1~14.04) ...
Setting up lib32itm1 (8.1.0-5ubuntu1~14.04) ...
Setting up libx32itm1 (8.1.0-5ubuntu1~14.04) ...
Setting up lib32atomic1 (8.1.0-5ubuntu1~14.04) ...
Setting up libx32atomic1 (8.1.0-5ubuntu1~14.04) ...
Setting up lib32asan2 (5.5.0-12ubuntu1~14.04) ...
Setting up libx32asan2 (5.5.0-12ubuntu1~14.04) ...
Setting up lib32stdc++6 (8.1.0-5ubuntu1~14.04) ...
Setting up lib32ubsan0 (7.3.0-21ubuntu1~14.04) ...
Setting up libx32stdc++6 (8.1.0-5ubuntu1~14.04) ...
Setting up libx32ubsan0 (7.3.0-21ubuntu1~14.04) ...
Setting up lib32cilkrts5 (7.3.0-21ubuntu1~14.04) ...
Setting up libx32cilkrts5 (7.3.0-21ubuntu1~14.04) ...
Setting up lib32mpx0 (5.5.0-12ubuntu1~14.04) ...
Setting up lib32quadmath0 (8.1.0-5ubuntu1~14.04) ...
Setting up libx32quadmath0 (8.1.0-5ubuntu1~14.04) ...
Setting up lib32gcc-5-dev (5.5.0-12ubuntu1~14.04) ...
Setting up libx32gcc-5-dev (5.5.0-12ubuntu1~14.04) ...
Setting up gcc-5-multilib (5.5.0-12ubuntu1~14.04) ...
Setting up lib32stdc++-5-dev (5.5.0-12ubuntu1~14.04) ...
Setting up libx32stdc++-5-dev (5.5.0-12ubuntu1~14.04) ...
Setting up g++-5-multilib (5.5.0-12ubuntu1~14.04) ...
Setting up libgfortran-5-dev:amd64 (5.5.0-12ubuntu1~14.04) ...
Setting up gfortran-5 (5.5.0-12ubuntu1~14.04) ...
Setting up lib32gfortran3 (6.4.0-17ubuntu1~14.04) ...
Setting up lib32gfortran-5-dev (5.5.0-12ubuntu1~14.04) ...
Setting up libx32gfortran3 (6.4.0-17ubuntu1~14.04) ...
Setting up libx32gfortran-5-dev (5.5.0-12ubuntu1~14.04) ...
Setting up gfortran-5-multilib (5.5.0-12ubuntu1~14.04) ...
Processing triggers for libc-bin (2.19-0ubuntu6.13) ...
W: --force-yes is deprecated, use one of the options starting with --allow instead.
travis_time:end:07d839bf:start=1529482138869162530,finish=1529482274250365913,duration=135381203383
travis_fold:end:apt

travis_fold:start:git.checkout
travis_time:start:127f1076
$ git clone --depth=50 https://github.com/JuliaLang/julia.git JuliaLang/julia
Cloning into 'JuliaLang/julia'...
travis_time:end:127f1076:start=1529482274257630137,finish=1529482277417274208,duration=3159644071
$ cd JuliaLang/julia
travis_time:start:0c0971de
$ git fetch origin +refs/pull/27417/merge:
From https://github.com/JuliaLang/julia
* branch refs/pull/27417/merge -> FETCH_HEAD
travis_time:end:0c0971de:start=1529482277423894933,finish=1529482278915519861,duration=1491624928
$ git checkout -qf FETCH_HEAD
travis_fold:end:git.checkout

Setting environment variables from repository settings
$ export DOCUMENTER_KEY=[secure]
$ export DOCUMENTER_DEBUG=true
Setting environment variables from .travis.yml
$ export ARCH="i686"
$ export CXX=g++
$ export CC=gcc
$ export PATH=/usr/lib/ccache:$PATH
travis_fold:start:cache.1
Setting up build cache
$ export CASHER_DIR=$HOME/.casher
travis_time:start:079639e3
$ Installing caching utilities
travis_time:end:079639e3:start=1529482283534665438,finish=1529482283687743343,duration=153077905
travis_time:start:099965d6

travis_time:end:099965d6:start=1529482283696413287,finish=1529482283702330408,duration=5917121
travis_time:start:187ad642
attempting to download cache archive
fetching PR.27417/cache-linux-trusty-d1f8e8c389023adf2674031c40577df6c1e5492bd1f9ff85c6adfdf7268c67e4--compiler-gpp-5-m32.tgz
found cache
travis_time:end:187ad642:start=1529482283709859596,finish=1529482290057853927,duration=6347994331
travis_fold:end:cache.1
travis_fold:start:cache.ccache

travis_time:start:21cb166f

travis_time:end:21cb166f:start=1529482290065448454,finish=1529482290071521253,duration=6072799
travis_time:start:01a0fa8e
adding /home/travis/.ccache to cache
travis_time:end:01a0fa8e:start=1529482290078978320,finish=1529482296396057443,duration=6317079123
travis_fold:end:cache.ccache
$ g++-5 -m32 --version
g++-5 (Ubuntu 5.5.0-12ubuntu1~14.04) 5.5.0 20171010
Copyright (C) 2015 Free Software Foundation, Inc.
This is free software; see the source for copying conditions. There is NO
warranty; not even for MERCHANTABILITY or FITNESS FOR A PARTICULAR PURPOSE.
travis_fold:start:before_install.1
travis_time:start:093c1c0c
$ make check-whitespace
travis_time:end:093c1c0c:start=1529482296414974146,finish=1529482296573861424,duration=158887278
travis_fold:end:before_install.1
travis_fold:start:before_install.2
travis_time:start:0c39c80c
$ if [ `uname` = "Linux" ]; then contrib/travis_fastfail.sh || exit 1; mkdir -p $HOME/bin; ln -s /usr/bin/gcc-5 $HOME/bin/gcc; ln -s /usr/bin/g++-5 $HOME/bin/g++; ln -s /usr/bin/gfortran-5 $HOME/bin/gfortran; ln -s /usr/bin/gcc-5 $HOME/bin/x86_64-linux-gnu-gcc; ln -s /usr/bin/g++-5 $HOME/bin/x86_64-linux-gnu-g++; gcc --version; BAR="bar -i 30"; BUILDOPTS="-j5 VERBOSE=1 FORCE_ASSERTIONS=1 LLVM_ASSERTIONS=1 USECCACHE=1"; echo "override ARCH=$ARCH" >> Make.user; sudo sh -c "echo 0 > /proc/sys/net/ipv6/conf/lo/disable_ipv6"; export JULIA_CPU_CORES=4; export JULIA_TEST_MAXRSS_MB=1200; TESTSTORUN="all"; elif [ `uname` = "Darwin" ]; then brew update; brew install -v jq pv ccache; export PATH="$(brew --prefix ccache)/libexec:$PATH"; BAR="pv -i 30"; contrib/travis_fastfail.sh || exit 1; brew tap staticfloat/julia > /dev/null; brew rm --force $(brew deps --HEAD julia); brew install -v gcc gmp mpfr pcre2 staticfloat/julia/openblas-julia staticfloat/julia/suite-sparse-julia staticfloat/juliadeps/libgfortran; BUILDOPTS="-j3 USECLANG=1 USECCACHE=1 BINARYBUILDER_TRIPLET=x86_64-apple-darwin14 BINARYBUILDER_LLVM_ASSERTS=1"; BUILDOPTS="$BUILDOPTS USE_BINARYBUILDER_LLVM=1 LLVM_CONFIG=$TRAVIS_BUILD_DIR/usr/tools/llvm-config LLVM_SIZE=$TRAVIS_BUILD_DIR/usr/tools/llvm-size"; BUILDOPTS="$BUILDOPTS VERBOSE=1 USE_BLAS64=0 SUITESPARSE_INC=-I$(brew --prefix suite-sparse-julia)/include FORCE_ASSERTIONS=1"; BUILDOPTS="$BUILDOPTS LIBBLAS=-lopenblas LIBBLASNAME=libopenblas LIBLAPACK=-lopenblas LIBLAPACKNAME=libopenblas"; for lib in SUITESPARSE BLAS LAPACK GMP MPFR PCRE LIBUNWIND; do BUILDOPTS="$BUILDOPTS USE_SYSTEM_$lib=1"; done; export LDFLAGS="-L$(brew --prefix openblas-julia)/lib -L$(brew --prefix suite-sparse-julia)/lib"; spawn_DYLD_FALLBACK_LIBRARY_PATH="/usr/local/lib:/lib:/usr/lib"; spawn_DYLD_FALLBACK_LIBRARY_PATH+=":$(brew --prefix openblas-julia)/lib"; spawn_DYLD_FALLBACK_LIBRARY_PATH+=":$(brew --prefix suite-sparse-julia)/lib"; export JULIA_MACOS_SPAWN="DYLD_FALLBACK_LIBRARY_PATH=\"$spawn_DYLD_FALLBACK_LIBRARY_PATH\" \$1"; export BUILDOPTS="$BUILDOPTS spawn=\$(JULIA_MACOS_SPAWN)"; make $BUILDOPTS -C contrib -f repackage_system_suitesparse4.make; export JULIA_CPU_CORES=2; export JULIA_TEST_MAXRSS_MB=600; TESTSTORUN="all --skip linalg/triangular subarray"; fi
% Total % Received % Xferd Average Speed Time Time Time Current
Dload Upload Total Spent Left Speed
0 0 0 0 0 0 0 0 --:--:-- --:--:-- --:--:-- 0
100 161k 100 161k 0 0 401k 0 --:--:-- --:--:-- --:--:-- 402k
gcc (Ubuntu 5.5.0-12ubuntu1~14.04) 5.5.0 20171010
Copyright (C) 2015 Free Software Foundation, Inc.
This is free software; see the source for copying conditions. There is NO
warranty; not even for MERCHANTABILITY or FITNESS FOR A PARTICULAR PURPOSE.
travis_time:end:0c39c80c:start=1529482296581793587,finish=1529482297017940892,duration=436147305
travis_fold:end:before_install.2
travis_fold:start:before_install.3
travis_time:start:02f1260e
$ echo "override JULIA_CPU_TARGET=generic;native" >> Make.user
travis_time:end:02f1260e:start=1529482297025055796,finish=1529482297030848250,duration=5792454
travis_fold:end:before_install.3
travis_fold:start:before_install.4
travis_time:start:0571a3c7
$ wget http://http.debian.net/debian/pool/main/m/moreutils/moreutils_0.62.orig.tar.xz
--2018-06-20 08:11:37-- http://http.debian.net/debian/pool/main/m/moreutils/moreutils_0.62.orig.tar.xz
Resolving http.debian.net (http.debian.net)... 128.31.0.62, 149.20.4.15, 130.89.148.14, ...
Connecting to http.debian.net (http.debian.net)|128.31.0.62|:80... connected.
HTTP request sent, awaiting response... 302 Found
Location: http://cdn-fastly.deb.debian.org/debian/pool/main/m/moreutils/moreutils_0.62.orig.tar.xz [following]
--2018-06-20 08:11:37-- http://cdn-fastly.deb.debian.org/debian/pool/main/m/moreutils/moreutils_0.62.orig.tar.xz
Resolving cdn-fastly.deb.debian.org (cdn-fastly.deb.debian.org)... 151.101.44.204, 2a04:4e42:b::204
Connecting to cdn-fastly.deb.debian.org (cdn-fastly.deb.debian.org)|151.101.44.204|:80... connected.
HTTP request sent, awaiting response... 200 OK
Length: 80364 (78K) [application/x-xz]
Saving to: ‘moreutils_0.62.orig.tar.xz’
0K .......... .......... .......... .......... .......... 63% 1.75M 0s
50K .......... .......... ........ 100% 7.05M=0.03s
2018-06-20 08:11:37 (2.41 MB/s) - ‘moreutils_0.62.orig.tar.xz’ saved [80364/80364]
travis_time:end:0571a3c7:start=1529482297038078704,finish=1529482297228086867,duration=190008163
travis_fold:end:before_install.4
travis_fold:start:before_install.5
travis_time:start:0518ddb8
$ tar -xJvf moreutils_0.62.orig.tar.xz && mv moreutils-0.62 moreutils
moreutils-0.62/
moreutils-0.62/.gitattributes
moreutils-0.62/COPYING
moreutils-0.62/Makefile
moreutils-0.62/README
moreutils-0.62/chronic
moreutils-0.62/combine
moreutils-0.62/debian/
moreutils-0.62/debian/changelog
moreutils-0.62/debian/compat
moreutils-0.62/debian/control
moreutils-0.62/debian/copyright
moreutils-0.62/debian/docs
moreutils-0.62/debian/rules
moreutils-0.62/errno.c
moreutils-0.62/errno.docbook
moreutils-0.62/ifdata.c
moreutils-0.62/ifdata.docbook
moreutils-0.62/ifne.c
moreutils-0.62/ifne.docbook
moreutils-0.62/is_utf8/
moreutils-0.62/is_utf8/Makefile
moreutils-0.62/is_utf8/README.md
moreutils-0.62/is_utf8/is_utf8.c
moreutils-0.62/is_utf8/is_utf8.h
moreutils-0.62/is_utf8/main.c
moreutils-0.62/is_utf8/test.sh
moreutils-0.62/isutf8.docbook
moreutils-0.62/lckdo.c
moreutils-0.62/lckdo.docbook
moreutils-0.62/mispipe.c
moreutils-0.62/mispipe.docbook
moreutils-0.62/parallel.c
moreutils-0.62/parallel.docbook
moreutils-0.62/pee.c
moreutils-0.62/pee.docbook
moreutils-0.62/physmem.c
moreutils-0.62/sponge.c
moreutils-0.62/sponge.docbook
moreutils-0.62/ts
moreutils-0.62/vidir
moreutils-0.62/vipe
moreutils-0.62/zrun
travis_time:end:0518ddb8:start=1529482297235104634,finish=1529482297255229175,duration=20124541
travis_fold:end:before_install.5
travis_time:start:0fcdfe00
$ echo BUILDOPTS=$BUILDOPTS
BUILDOPTS=-j5 VERBOSE=1 FORCE_ASSERTIONS=1 LLVM_ASSERTIONS=1 USECCACHE=1
travis_time:end:0fcdfe00:start=1529482297262000136,finish=1529482297267207997,duration=5207861

The command "echo BUILDOPTS=$BUILDOPTS" exited with 0.
travis_time:start:0c0a9324
$ export BUILDOPTS
travis_time:end:0c0a9324:start=1529482297274949363,finish=1529482297280809536,duration=5860173

The command "export BUILDOPTS" exited with 0.
travis_time:start:0aeaddcc
$ contrib/download_cmake.sh
% Total % Received % Xferd Average Speed Time Time Time Current
Dload Upload Total Spent Left Speed
0 0 0 0 0 0 0 0 --:--:-- --:--:-- --:--:-- 0
0 0 0 0 0 0 0 0 --:--:-- --:--:-- --:--:-- 0
0 0 0 0 0 0 0 0 --:--:-- 0:00:01 --:--:-- 0
100 479 100 479 0 0 276 0 0:00:01 0:00:01 --:--:-- 276
0 29.2M 0 51731 0 0 25301 0 0:20:12 0:00:02 0:20:10 25301
22 29.2M 22 6833k 0 0 2248k 0 0:00:13 0:00:03 0:00:10 6817k
68 29.2M 68 20.1M 0 0 5084k 0 0:00:05 0:00:04 0:00:01 10.0M
100 29.2M 100 29.2M 0 0 6557k 0 0:00:04 0:00:04 --:--:-- 11.5M
cmake-3.7.1-Linux-x86_64.tar.gz: OK
travis_time:end:0aeaddcc:start=1529482297288521326,finish=1529482302887734401,duration=5599213075

The command "contrib/download_cmake.sh" exited with 0.
travis_time:start:08f24a06
$ make -C moreutils mispipe
make: Entering directory `/home/travis/build/JuliaLang/julia/moreutils'
gcc -O2 -g -Wall mispipe.c -o mispipe
make: Leaving directory `/home/travis/build/JuliaLang/julia/moreutils'
travis_time:end:08f24a06:start=1529482302893708227,finish=1529482302979243203,duration=85534976

The command "make -C moreutils mispipe" exited with 0.
travis_time:start:109b7fa8
$ make $BUILDOPTS -C base version_git.jl.phony
make: Entering directory `/home/travis/build/JuliaLang/julia/base'
sh /home/travis/build/JuliaLang/julia/base/version_git.sh /home/travis/build/JuliaLang/julia/base > version_git.jl.phony
fatal: bad revision '^^fe4337613f0da442cf01c553c0a0a8b9dc8b66a'
make: Leaving directory `/home/travis/build/JuliaLang/julia/base'
travis_time:end:109b7fa8:start=1529482302985191626,finish=1529482303073436286,duration=88244660

The command "make $BUILDOPTS -C base version_git.jl.phony" exited with 0.
travis_time:start:05027510
$ moreutils/mispipe "make \$BUILDOPTS NO_GIT=1 -C deps 2> deps-err.log" "$BAR" > deps.log || { echo "-- deps build log stderr tail 100 --------------------------------------"; tail -n 100 deps-err.log; echo "-- deps build log stdout tail 100 --------------------------------------"; tail -n 100 deps.log; echo "-- deps build log stderr all -------------------------------------------"; cat deps-err.log; echo "-- deps build log stdout all -------------------------------------------"; cat deps.log; echo "-- end of deps build log -----------------------------------------------"; false; }
376.4KB at 12.5KB/s elapsed: 0:00:30
1.3MB at 23.0KB/s elapsed: 0:01:00
1.9MB at 21.5KB/s elapsed: 0:01:30
2.2MB at 19.0KB/s elapsed: 0:02:00
2.6MB at 17.4KB/s elapsed: 0:02:30
3.1MB at 17.7KB/s elapsed: 0:03:00
3.9MB at 18.9KB/s elapsed: 0:03:30
4.5MB at 19.1KB/s elapsed: 0:04:00
5.2MB at 19.9KB/s elapsed: 0:04:30
6.1MB at 20.7KB/s elapsed: 0:05:00
6.8MB at 21.2KB/s elapsed: 0:05:30
7.5MB at 21.3KB/s elapsed: 0:06:00
9.0MB at 23.5KB/s elapsed: 0:06:30
9.1MB at 22.1KB/s elapsed: 0:07:00
9.1MB at 20.7KB/s elapsed: 0:07:30
9.1MB at 19.5KB/s elapsed: 0:08:00
9.1MB at 18.4KB/s elapsed: 0:08:30
9.2MB at 17.4KB/s elapsed: 0:09:00
9.2MB at 16.5KB/s elapsed: 0:09:30
9.2MB at 15.8KB/s elapsed: 0:10:00
9.3MB at 15.1KB/s elapsed: 0:10:30
9.3MB at 14.4KB/s elapsed: 0:11:00
9.3MB at 13.8KB/s elapsed: 0:11:30
9.4MB at 13.3KB/s elapsed: 0:12:00
9.4MB at 12.8KB/s elapsed: 0:12:30
9.4MB at 12.4KB/s elapsed: 0:13:00
9.5MB at 12.0KB/s elapsed: 0:13:30
9.5MB at 11.6KB/s elapsed: 0:14:00
9.6MB at 11.3KB/s elapsed: 0:14:30
9.8MB at 11.1KB/s elapsed: 0:15:00
9.9MB at 10.9KB/s elapsed: 0:15:30
10.0MB at 10.7KB/s elapsed: 0:16:00
10.2MB at 10.5KB/s elapsed: 0:16:30
10.4MB at 10.4KB/s elapsed: 0:17:00
10.5MB at 10.3KB/s elapsed: 0:17:30
10.6MB at 10.1KB/s elapsed: 0:18:00
10.6MB at 9.8KB/s elapsed: 0:18:30
10.7MB at 9.6KB/s elapsed: 0:19:00
10.7MB at 9.4KB/s elapsed: 0:19:30
10.7MB at 9.2KB/s elapsed: 0:20:00
10.8MB at 9.0KB/s elapsed: 0:20:30
10.8MB at 8.8KB/s elapsed: 0:21:00
10.8MB at 8.6KB/s elapsed: 0:21:30
10.8MB at 8.4KB/s elapsed: 0:22:00
11.0MB at 8.3KB/s elapsed: 0:22:30
11.1MB at 8.2KB/s elapsed: 0:23:00
11.1MB at 8.1KB/s elapsed: 0:23:30
11.1MB at 7.9KB/s elapsed: 0:24:00
11.2MB at 7.8KB/s elapsed: 0:24:30
11.2MB at 7.7KB/s elapsed: 0:25:00
11.3MB at 7.5KB/s elapsed: 0:25:30
11.3MB at 7.4KB/s elapsed: 0:26:00
11.3MB at 7.3KB/s elapsed: 0:26:30
11.4MB at 7.2KB/s elapsed: 0:27:00
11.4MB at 7.1KB/s elapsed: 0:27:30
11.4MB at 7.0KB/s elapsed: 0:28:00
11.4MB at 6.9KB/s elapsed: 0:28:30
11.5MB at 6.8KB/s elapsed: 0:29:00
11.5MB at 6.6KB/s elapsed: 0:29:30
11.5MB at 6.6KB/s elapsed: 0:30:00
11.6MB at 6.5KB/s elapsed: 0:30:30
11.6MB at 6.4KB/s elapsed: 0:31:00
11.6MB at 6.3KB/s elapsed: 0:31:30
11.6MB at 6.2KB/s elapsed: 0:32:00
11.6MB at 6.1KB/s elapsed: 0:32:30
11.7MB at 6.0KB/s elapsed: 0:33:00
11.8MB at 6.0KB/s elapsed: 0:33:30
11.8MB at 5.9KB/s elapsed: 0:34:00
11.9MB at 5.9KB/s elapsed: 0:34:30
11.9MB at 5.8KB/s elapsed: 0:35:00
11.9MB at 5.7KB/s elapsed: 0:35:30
12.2MB at 5.8KB/s elapsed: 0:36:00
12.2MB at 5.8KB/s elapsed: 0:36:01
Copied: 12806506B (12.2MB)
Time: 36:01
Throughput: 5926B (5.8KB/s)
travis_time:end:05027510:start=1529482303079419447,finish=1529484464897018144,duration=2161817598697

The command "moreutils/mispipe "make \$BUILDOPTS NO_GIT=1 -C deps 2> deps-err.log" "$BAR" > deps.log || { echo "-- deps build log stderr tail 100 --------------------------------------"; tail -n 100 deps-err.log; echo "-- deps build log stdout tail 100 --------------------------------------"; tail -n 100 deps.log; echo "-- deps build log stderr all -------------------------------------------"; cat deps-err.log; echo "-- deps build log stdout all -------------------------------------------"; cat deps.log; echo "-- end of deps build log -----------------------------------------------"; false; }" exited with 0.
travis_time:start:164bfdd9
$ make $BUILDOPTS NO_GIT=1 prefix=/tmp/julia install | moreutils/ts -s "%.s"
0.023762 ccache gcc -march=pentium4 -m32 -o /home/travis/build/JuliaLang/julia/usr/tools/stringreplace /home/travis/build/JuliaLang/julia/contrib/stringreplace.c
/home/travis/build/JuliaLang/julia/contrib/stringreplace.c: In function ‘main’:
/home/travis/build/JuliaLang/julia/contrib/stringreplace.c:25:17: warning: format ‘%lu’ expects argument of type ‘long unsigned int’, but argument 2 has type ‘size_t {aka unsigned int}’ [-Wformat=]
printf( "ERROR: Replacement string length (%lu) is greater than maxlen! (%lu)\n", strlen(replacement), maxlen );
^
0.096096 make[1]: Entering directory `/home/travis/build/JuliaLang/julia'
0.099113 Creating usr/etc/julia/startup.jl
0.099176 /home/travis/build/JuliaLang/julia/contrib/install.sh 755 /home/travis/build/JuliaLang/julia/contrib/julia-config.jl /home/travis/build/JuliaLang/julia/usr/share/julia/
0.099364 Copying in usr/share/man/man1/julia.1
0.165036 make[2]: Entering directory `/home/travis/build/JuliaLang/julia/deps'
0.165098 make[2]: Nothing to be done for `default'.
0.165107 make[2]: Leaving directory `/home/travis/build/JuliaLang/julia/deps'
0.221349 make[2]: Entering directory `/home/travis/build/JuliaLang/julia/base'
0.221929 ccache gcc -E -D PCRE2_CODE_UNIT_WIDTH=8 -dM /home/travis/build/JuliaLang/julia/usr/include/pcre2.h | perl -nle '/^\s*#define\s+PCRE2_(\w*)\s*\(?(0x[0-9a-fA-F]+|[0-9]+)\)?u?\s*$/ and print "const $1 = UInt32($2)"' | LC_ALL=C sort > pcre_h.jl
0.222632 echo '#include <errno.h>' | ccache gcc -E -dM - | perl -nle 'print "const $1 = Int32($2)" if /^#define\s+(E\w+)\s+(\d+)\s*$/' | LC_ALL=C sort > errno_h.jl
0.227277 ccache gcc -E -P -DJULIA /home/travis/build/JuliaLang/julia/base/../src/file_constants.h | perl -nle 'print "$1 0o$2" if /^(\s*const\s+[A-z_]+\s+=)\s+(0[0-9]*)\s*$/; print "$1" if /^\s*(const\s+[A-z_]+\s+=\s+([1-9]|0x)[0-9A-z]*)\s*$/' > file_constants.jl
0.242454 ccache gcc -E -P "-I/home/travis/build/JuliaLang/julia/usr/include" -DJULIA /home/travis/build/JuliaLang/julia/base/../src/uv_constants.h | tail -n 16 > uv_constants.jl
0.251771 make[2]: Entering directory `/home/travis/build/JuliaLang/julia/src'
0.251851 make -C /home/travis/build/JuliaLang/julia/src/support BUILDDIR='/home/travis/build/JuliaLang/julia/src/support'
0.257718
0.269927 make[2]: Leaving directory `/home/travis/build/JuliaLang/julia/base'
0.303116 make[3]: Entering directory `/home/travis/build/JuliaLang/julia/src/support'
0.303860 ccache gcc -march=pentium4 -m32 -fasynchronous-unwind-tables -DJULIA_HAS_IFUNC_SUPPORT=1 -DJULIA_ENABLE_THREADING -DJULIA_NUM_THREADS=1 -std=gnu99 -pipe -fPIC -fno-strict-aliasing -D_FILE_OFFSET_BITS=64 -Wold-style-definition -Wstrict-prototypes -Wc++-compat -O3 -ggdb2 -falign-functions -momit-leaf-frame-pointer -I/home/travis/build/JuliaLang/julia/usr/include -I/home/travis/build/JuliaLang/julia/usr/include -DLIBRARY_EXPORTS -DUTF8PROC_EXPORTS -Wall -Wno-strict-aliasing -fvisibility=hidden -Wpointer-arith -Wundef -c hashing.c -o /home/travis/build/JuliaLang/julia/src/support/hashing.o
0.304643 ccache gcc -march=pentium4 -m32 -fasynchronous-unwind-tables -DJULIA_HAS_IFUNC_SUPPORT=1 -DJULIA_ENABLE_THREADING -DJULIA_NUM_THREADS=1 -std=gnu99 -pipe -fPIC -fno-strict-aliasing -D_FILE_OFFSET_BITS=64 -Wold-style-definition -Wstrict-prototypes -Wc++-compat -O3 -ggdb2 -falign-functions -momit-leaf-frame-pointer -I/home/travis/build/JuliaLang/julia/usr/include -I/home/travis/build/JuliaLang/julia/usr/include -DLIBRARY_EXPORTS -DUTF8PROC_EXPORTS -Wall -Wno-strict-aliasing -fvisibility=hidden -Wpointer-arith -Wundef -c timefuncs.c -o /home/travis/build/JuliaLang/julia/src/support/timefuncs.o
0.306946 ccache gcc -march=pentium4 -m32 -fasynchronous-unwind-tables -DJULIA_HAS_IFUNC_SUPPORT=1 -DJULIA_ENABLE_THREADING -DJULIA_NUM_THREADS=1 -std=gnu99 -pipe -fPIC -fno-strict-aliasing -D_FILE_OFFSET_BITS=64 -Wold-style-definition -Wstrict-prototypes -Wc++-compat -O3 -ggdb2 -falign-functions -momit-leaf-frame-pointer -I/home/travis/build/JuliaLang/julia/usr/include -I/home/travis/build/JuliaLang/julia/usr/include -DLIBRARY_EXPORTS -DUTF8PROC_EXPORTS -Wall -Wno-strict-aliasing -fvisibility=hidden -Wpointer-arith -Wundef -c ptrhash.c -o /home/travis/build/JuliaLang/julia/src/support/ptrhash.o
0.310855 ccache gcc -march=pentium4 -m32 -fasynchronous-unwind-tables -DJULIA_HAS_IFUNC_SUPPORT=1 -DJULIA_ENABLE_THREADING -DJULIA_NUM_THREADS=1 -std=gnu99 -pipe -fPIC -fno-strict-aliasing -D_FILE_OFFSET_BITS=64 -Wold-style-definition -Wstrict-prototypes -Wc++-compat -O3 -ggdb2 -falign-functions -momit-leaf-frame-pointer -I/home/travis/build/JuliaLang/julia/usr/include -I/home/travis/build/JuliaLang/julia/usr/include -DLIBRARY_EXPORTS -DUTF8PROC_EXPORTS -Wall -Wno-strict-aliasing -fvisibility=hidden -Wpointer-arith -Wundef -c operators.c -o /home/travis/build/JuliaLang/julia/src/support/operators.o
0.314208 ccache gcc -march=pentium4 -m32 -fasynchronous-unwind-tables -DJULIA_HAS_IFUNC_SUPPORT=1 -DJULIA_ENABLE_THREADING -DJULIA_NUM_THREADS=1 -std=gnu99 -pipe -fPIC -fno-strict-aliasing -D_FILE_OFFSET_BITS=64 -Wold-style-definition -Wstrict-prototypes -Wc++-compat -O3 -ggdb2 -falign-functions -momit-leaf-frame-pointer -I/home/travis/build/JuliaLang/julia/usr/include -I/home/travis/build/JuliaLang/julia/usr/include -DLIBRARY_EXPORTS -DUTF8PROC_EXPORTS -Wall -Wno-strict-aliasing -fvisibility=hidden -Wpointer-arith -Wundef -c utf8.c -o /home/travis/build/JuliaLang/julia/src/support/utf8.o
0.315349 ccache gcc -march=pentium4 -m32 -fasynchronous-unwind-tables -DJULIA_HAS_IFUNC_SUPPORT=1 -DJULIA_ENABLE_THREADING -DJULIA_NUM_THREADS=1 -std=gnu99 -pipe -fPIC -fno-strict-aliasing -D_FILE_OFFSET_BITS=64 -Wold-style-definition -Wstrict-prototypes -Wc++-compat -O3 -ggdb2 -falign-functions -momit-leaf-frame-pointer -I/home/travis/build/JuliaLang/julia/usr/include -I/home/travis/build/JuliaLang/julia/usr/include -DLIBRARY_EXPORTS -DUTF8PROC_EXPORTS -Wall -Wno-strict-aliasing -fvisibility=hidden -Wpointer-arith -Wundef -c ios.c -o /home/travis/build/JuliaLang/julia/src/support/ios.o
0.320688 ccache gcc -march=pentium4 -m32 -fasynchronous-unwind-tables -DJULIA_HAS_IFUNC_SUPPORT=1 -DJULIA_ENABLE_THREADING -DJULIA_NUM_THREADS=1 -std=gnu99 -pipe -fPIC -fno-strict-aliasing -D_FILE_OFFSET_BITS=64 -Wold-style-definition -Wstrict-prototypes -Wc++-compat -O3 -ggdb2 -falign-functions -momit-leaf-frame-pointer -I/home/travis/build/JuliaLang/julia/usr/include -I/home/travis/build/JuliaLang/julia/usr/include -DLIBRARY_EXPORTS -DUTF8PROC_EXPORTS -Wall -Wno-strict-aliasing -fvisibility=hidden -Wpointer-arith -Wundef -c htable.c -o /home/travis/build/JuliaLang/julia/src/support/htable.o
0.326767 ccache gcc -march=pentium4 -m32 -fasynchronous-unwind-tables -DJULIA_HAS_IFUNC_SUPPORT=1 -DJULIA_ENABLE_THREADING -DJULIA_NUM_THREADS=1 -std=gnu99 -pipe -fPIC -fno-strict-aliasing -D_FILE_OFFSET_BITS=64 -Wold-style-definition -Wstrict-prototypes -Wc++-compat -O3 -ggdb2 -falign-functions -momit-leaf-frame-pointer -I/home/travis/build/JuliaLang/julia/usr/include -I/home/travis/build/JuliaLang/julia/usr/include -DLIBRARY_EXPORTS -DUTF8PROC_EXPORTS -Wall -Wno-strict-aliasing -fvisibility=hidden -Wpointer-arith -Wundef -c bitvector.c -o /home/travis/build/JuliaLang/julia/src/support/bitvector.o
0.334236 ccache gcc -march=pentium4 -m32 -fasynchronous-unwind-tables -DJULIA_HAS_IFUNC_SUPPORT=1 -DJULIA_ENABLE_THREADING -DJULIA_NUM_THREADS=1 -std=gnu99 -pipe -fPIC -fno-strict-aliasing -D_FILE_OFFSET_BITS=64 -Wold-style-definition -Wstrict-prototypes -Wc++-compat -O3 -ggdb2 -falign-functions -momit-leaf-frame-pointer -I/home/travis/build/JuliaLang/julia/usr/include -I/home/travis/build/JuliaLang/julia/usr/include -DLIBRARY_EXPORTS -DUTF8PROC_EXPORTS -Wall -Wno-strict-aliasing -fvisibility=hidden -Wpointer-arith -Wundef -c int2str.c -o /home/travis/build/JuliaLang/julia/src/support/int2str.o
0.334823 ccache gcc -march=pentium4 -m32 -fasynchronous-unwind-tables -DJULIA_HAS_IFUNC_SUPPORT=1 -DJULIA_ENABLE_THREADING -DJULIA_NUM_THREADS=1 -std=gnu99 -pipe -fPIC -fno-strict-aliasing -D_FILE_OFFSET_BITS=64 -Wold-style-definition -Wstrict-prototypes -Wc++-compat -O3 -ggdb2 -falign-functions -momit-leaf-frame-pointer -I/home/travis/build/JuliaLang/julia/usr/include -I/home/travis/build/JuliaLang/julia/usr/include -DLIBRARY_EXPORTS -DUTF8PROC_EXPORTS -Wall -Wno-strict-aliasing -fvisibility=hidden -Wpointer-arith -Wundef -c libsupportinit.c -o /home/travis/build/JuliaLang/julia/src/support/libsupportinit.o
0.342732 ccache gcc -march=pentium4 -m32 -fasynchronous-unwind-tables -DJULIA_HAS_IFUNC_SUPPORT=1 -DJULIA_ENABLE_THREADING -DJULIA_NUM_THREADS=1 -std=gnu99 -pipe -fPIC -fno-strict-aliasing -D_FILE_OFFSET_BITS=64 -Wold-style-definition -Wstrict-prototypes -Wc++-compat -O3 -ggdb2 -falign-functions -momit-leaf-frame-pointer -I/home/travis/build/JuliaLang/julia/usr/include -I/home/travis/build/JuliaLang/julia/usr/include -DLIBRARY_EXPORTS -DUTF8PROC_EXPORTS -Wall -Wno-strict-aliasing -fvisibility=hidden -Wpointer-arith -Wundef -c arraylist.c -o /home/travis/build/JuliaLang/julia/src/support/arraylist.o
0.343451 ccache gcc -march=pentium4 -m32 -fasynchronous-unwind-tables -DJULIA_HAS_IFUNC_SUPPORT=1 -DJULIA_ENABLE_THREADING -DJULIA_NUM_THREADS=1 -std=gnu99 -pipe -fPIC -fno-strict-aliasing -D_FILE_OFFSET_BITS=64 -Wold-style-definition -Wstrict-prototypes -Wc++-compat -O3 -ggdb2 -falign-functions -momit-leaf-frame-pointer -I/home/travis/build/JuliaLang/julia/usr/include -I/home/travis/build/JuliaLang/julia/usr/include -DLIBRARY_EXPORTS -DUTF8PROC_EXPORTS -Wall -Wno-strict-aliasing -fvisibility=hidden -Wpointer-arith -Wundef -c strtod.c -o /home/travis/build/JuliaLang/julia/src/support/strtod.o
0.396798 rm -rf /home/travis/build/JuliaLang/julia/src/support/libsupport.a
0.398271 ar -rcs /home/travis/build/JuliaLang/julia/src/support/libsupport.a /home/travis/build/JuliaLang/julia/src/support/hashing.o /home/travis/build/JuliaLang/julia/src/support/timefuncs.o /home/travis/build/JuliaLang/julia/src/support/ptrhash.o /home/travis/build/JuliaLang/julia/src/support/operators.o /home/travis/build/JuliaLang/julia/src/support/utf8.o /home/travis/build/JuliaLang/julia/src/support/ios.o /home/travis/build/JuliaLang/julia/src/support/htable.o /home/travis/build/JuliaLang/julia/src/support/bitvector.o /home/travis/build/JuliaLang/julia/src/support/int2str.o /home/travis/build/JuliaLang/julia/src/support/libsupportinit.o /home/travis/build/JuliaLang/julia/src/support/arraylist.o /home/travis/build/JuliaLang/julia/src/support/strtod.o
0.400784 make[3]: Leaving directory `/home/travis/build/JuliaLang/julia/src/support'
0.401015 make -C /home/travis/build/JuliaLang/julia/src/flisp BUILDDIR='/home/travis/build/JuliaLang/julia/src/flisp'
0.449382 make[3]: Entering directory `/home/travis/build/JuliaLang/julia/src/flisp'
0.450077 ccache gcc -march=pentium4 -m32 -fasynchronous-unwind-tables -DJULIA_HAS_IFUNC_SUPPORT=1 -DJULIA_ENABLE_THREADING -DJULIA_NUM_THREADS=1 -O3 -ggdb2 -falign-functions -momit-leaf-frame-pointer -I../support -std=gnu99 -pipe -fPIC -fno-strict-aliasing -D_FILE_OFFSET_BITS=64 -I/home/travis/build/JuliaLang/julia/usr/include -I/home/travis/build/JuliaLang/julia/usr/include -I/home/travis/build/JuliaLang/julia/usr/include -DLIBRARY_EXPORTS -DUTF8PROC_EXPORTS -Wall -Wno-strict-aliasing -DUSE_COMPUTED_GOTO -fvisibility=hidden -Wpointer-arith -Wundef -Wold-style-definition -Wstrict-prototypes -Wc++-compat -c flisp.c -o /home/travis/build/JuliaLang/julia/src/flisp/flisp.o
0.451838 ccache gcc -march=pentium4 -m32 -fasynchronous-unwind-tables -DJULIA_HAS_IFUNC_SUPPORT=1 -DJULIA_ENABLE_THREADING -DJULIA_NUM_THREADS=1 -O3 -ggdb2 -falign-functions -momit-leaf-frame-pointer -I../support -std=gnu99 -pipe -fPIC -fno-strict-aliasing -D_FILE_OFFSET_BITS=64 -I/home/travis/build/JuliaLang/julia/usr/include -I/home/travis/build/JuliaLang/julia/usr/include -I/home/travis/build/JuliaLang/julia/usr/include -DLIBRARY_EXPORTS -DUTF8PROC_EXPORTS -Wall -Wno-strict-aliasing -DUSE_COMPUTED_GOTO -fvisibility=hidden -Wpointer-arith -Wundef -Wold-style-definition -Wstrict-prototypes -Wc++-compat -c string.c -o /home/travis/build/JuliaLang/julia/src/flisp/string.o
0.453113 ccache gcc -march=pentium4 -m32 -fasynchronous-unwind-tables -DJULIA_HAS_IFUNC_SUPPORT=1 -DJULIA_ENABLE_THREADING -DJULIA_NUM_THREADS=1 -O3 -ggdb2 -falign-functions -momit-leaf-frame-pointer -I../support -std=gnu99 -pipe -fPIC -fno-strict-aliasing -D_FILE_OFFSET_BITS=64 -I/home/travis/build/JuliaLang/julia/usr/include -I/home/travis/build/JuliaLang/julia/usr/include -I/home/travis/build/JuliaLang/julia/usr/include -DLIBRARY_EXPORTS -DUTF8PROC_EXPORTS -Wall -Wno-strict-aliasing -DUSE_COMPUTED_GOTO -fvisibility=hidden -Wpointer-arith -Wundef -Wold-style-definition -Wstrict-prototypes -Wc++-compat -c equalhash.c -o /home/travis/build/JuliaLang/julia/src/flisp/equalhash.o
0.453663 ccache gcc -march=pentium4 -m32 -fasynchronous-unwind-tables -DJULIA_HAS_IFUNC_SUPPORT=1 -DJULIA_ENABLE_THREADING -DJULIA_NUM_THREADS=1 -O3 -ggdb2 -falign-functions -momit-leaf-frame-pointer -I../support -std=gnu99 -pipe -fPIC -fno-strict-aliasing -D_FILE_OFFSET_BITS=64 -I/home/travis/build/JuliaLang/julia/usr/include -I/home/travis/build/JuliaLang/julia/usr/include -I/home/travis/build/JuliaLang/julia/usr/include -DLIBRARY_EXPORTS -DUTF8PROC_EXPORTS -Wall -Wno-strict-aliasing -DUSE_COMPUTED_GOTO -fvisibility=hidden -Wpointer-arith -Wundef -Wold-style-definition -Wstrict-prototypes -Wc++-compat -c builtins.c -o /home/travis/build/JuliaLang/julia/src/flisp/builtins.o
0.472189 ccache gcc -march=pentium4 -m32 -fasynchronous-unwind-tables -DJULIA_HAS_IFUNC_SUPPORT=1 -DJULIA_ENABLE_THREADING -DJULIA_NUM_THREADS=1 -O3 -ggdb2 -falign-functions -momit-leaf-frame-pointer -I../support -std=gnu99 -pipe -fPIC -fno-strict-aliasing -D_FILE_OFFSET_BITS=64 -I/home/travis/build/JuliaLang/julia/usr/include -I/home/travis/build/JuliaLang/julia/usr/include -I/home/travis/build/JuliaLang/julia/usr/include -DLIBRARY_EXPORTS -DUTF8PROC_EXPORTS -Wall -Wno-strict-aliasing -DUSE_COMPUTED_GOTO -fvisibility=hidden -Wpointer-arith -Wundef -Wold-style-definition -Wstrict-prototypes -Wc++-compat -c table.c -o /home/travis/build/JuliaLang/julia/src/flisp/table.o
0.474085 ccache gcc -march=pentium4 -m32 -fasynchronous-unwind-tables -DJULIA_HAS_IFUNC_SUPPORT=1 -DJULIA_ENABLE_THREADING -DJULIA_NUM_THREADS=1 -O3 -ggdb2 -falign-functions -momit-leaf-frame-pointer -I../support -std=gnu99 -pipe -fPIC -fno-strict-aliasing -D_FILE_OFFSET_BITS=64 -I/home/travis/build/JuliaLang/julia/usr/include -I/home/travis/build/JuliaLang/julia/usr/include -I/home/travis/build/JuliaLang/julia/usr/include -DLIBRARY_EXPORTS -DUTF8PROC_EXPORTS -Wall -Wno-strict-aliasing -DUSE_COMPUTED_GOTO -fvisibility=hidden -Wpointer-arith -Wundef -Wold-style-definition -Wstrict-prototypes -Wc++-compat -c iostream.c -o /home/travis/build/JuliaLang/julia/src/flisp/iostream.o
0.475451 ccache gcc -march=pentium4 -m32 -fasynchronous-unwind-tables -DJULIA_HAS_IFUNC_SUPPORT=1 -DJULIA_ENABLE_THREADING -DJULIA_NUM_THREADS=1 -O3 -ggdb2 -falign-functions -momit-leaf-frame-pointer -I../support -std=gnu99 -pipe -fPIC -fno-strict-aliasing -D_FILE_OFFSET_BITS=64 -I/home/travis/build/JuliaLang/julia/usr/include -I/home/travis/build/JuliaLang/julia/usr/include -I/home/travis/build/JuliaLang/julia/usr/include -DLIBRARY_EXPORTS -DUTF8PROC_EXPORTS -Wall -Wno-strict-aliasing -DUSE_COMPUTED_GOTO -fvisibility=hidden -Wpointer-arith -Wundef -Wold-style-definition -Wstrict-prototypes -Wc++-compat -c julia_extensions.c -o /home/travis/build/JuliaLang/julia/src/flisp/julia_extensions.o
0.482270 ccache gcc -march=pentium4 -m32 -fasynchronous-unwind-tables -DJULIA_HAS_IFUNC_SUPPORT=1 -DJULIA_ENABLE_THREADING -DJULIA_NUM_THREADS=1 -O3 -ggdb2 -falign-functions -momit-leaf-frame-pointer -I../support -std=gnu99 -pipe -fPIC -fno-strict-aliasing -D_FILE_OFFSET_BITS=64 -I/home/travis/build/JuliaLang/julia/usr/include -I/home/travis/build/JuliaLang/julia/usr/include -I/home/travis/build/JuliaLang/julia/usr/include -DLIBRARY_EXPORTS -DUTF8PROC_EXPORTS -Wall -Wno-strict-aliasing -DUSE_COMPUTED_GOTO -fvisibility=hidden -Wpointer-arith -Wundef -Wold-style-definition -Wstrict-prototypes -Wc++-compat -c flmain.c -o /home/travis/build/JuliaLang/julia/src/flisp/flmain.o
0.521307 rm -rf /home/travis/build/JuliaLang/julia/src/flisp/libflisp.a
0.522736 ar -rcs /home/travis/build/JuliaLang/julia/src/flisp/libflisp.a /home/travis/build/JuliaLang/julia/src/flisp/flisp.o /home/travis/build/JuliaLang/julia/src/flisp/builtins.o /home/travis/build/JuliaLang/julia/src/flisp/string.o /home/travis/build/JuliaLang/julia/src/flisp/equalhash.o /home/travis/build/JuliaLang/julia/src/flisp/table.o /home/travis/build/JuliaLang/julia/src/flisp/iostream.o /home/travis/build/JuliaLang/julia/src/flisp/julia_extensions.o
0.526289 ccache gcc -march=pentium4 -m32 -O3 -ggdb2 -falign-functions -momit-leaf-frame-pointer -I../support -std=gnu99 -pipe -fPIC -fno-strict-aliasing -D_FILE_OFFSET_BITS=64 -I/home/travis/build/JuliaLang/julia/usr/include -I/home/travis/build/JuliaLang/julia/usr/include -I/home/travis/build/JuliaLang/julia/usr/include -DLIBRARY_EXPORTS -DUTF8PROC_EXPORTS -Wall -Wno-strict-aliasing -DUSE_COMPUTED_GOTO -fvisibility=hidden -Wpointer-arith -Wundef -Wold-style-definition -Wstrict-prototypes -Wc++-compat /home/travis/build/JuliaLang/julia/src/flisp/flisp.o /home/travis/build/JuliaLang/julia/src/flisp/builtins.o /home/travis/build/JuliaLang/julia/src/flisp/string.o /home/travis/build/JuliaLang/julia/src/flisp/equalhash.o /home/travis/build/JuliaLang/julia/src/flisp/table.o /home/travis/build/JuliaLang/julia/src/flisp/iostream.o /home/travis/build/JuliaLang/julia/src/flisp/julia_extensions.o /home/travis/build/JuliaLang/julia/src/flisp/flmain.o -o /home/travis/build/JuliaLang/julia/src/flisp/flisp /home/travis/build/JuliaLang/julia/src/flisp/libflisp.a /home/travis/build/JuliaLang/julia/src/flisp/../support/libsupport.a /home/travis/build/JuliaLang/julia/usr/lib/libuv.a /home/travis/build/JuliaLang/julia/usr/lib/libutf8proc.a -lpthread -Wl,--no-as-needed -ldl -lrt -lpthread -Wl,--export-dynamic,--as-needed,--no-whole-archive /home/travis/build/JuliaLang/julia/usr/lib/libunwind-generic.a /home/travis/build/JuliaLang/julia/usr/lib/libunwind.a -Wl,--version-script=/home/travis/build/JuliaLang/julia/src/julia.expmap
0.578963 make[3]: Leaving directory `/home/travis/build/JuliaLang/julia/src/flisp'
0.580262 ./flisp/flisp /home/travis/build/JuliaLang/julia/src/mk_julia_flisp_boot.scm /home/travis/build/JuliaLang/julia/src/ jlfrontend.scm julia_flisp.boot
0.866831 ./flisp/flisp /home/travis/build/JuliaLang/julia/src/bin2hex.scm < julia_flisp.boot > julia_flisp.boot.inc
1.338464 make[2]: Leaving directory `/home/travis/build/JuliaLang/julia/src'
1.406416 make[2]: Entering directory `/home/travis/build/JuliaLang/julia/src'
1.413974 /home/travis/build/JuliaLang/julia/contrib/install.sh 644 /home/travis/build/JuliaLang/julia/src/support/analyzer_annotations.h /home/travis/build/JuliaLang/julia/usr/include/julia/
1.415036 /home/travis/build/JuliaLang/julia/contrib/install.sh 644 /home/travis/build/JuliaLang/julia/src/support/arraylist.h /home/travis/build/JuliaLang/julia/usr/include/julia/
1.415080 /home/travis/build/JuliaLang/julia/contrib/install.sh 644 /home/travis/build/JuliaLang/julia/src/support/bitvector.h /home/travis/build/JuliaLang/julia/usr/include/julia/
1.415562 /home/travis/build/JuliaLang/julia/contrib/install.sh 644 /home/travis/build/JuliaLang/julia/src/support/dirpath.h /home/travis/build/JuliaLang/julia/usr/include/julia/
1.419263 /home/travis/build/JuliaLang/julia/contrib/install.sh 644 /home/travis/build/JuliaLang/julia/src/support/dtypes.h /home/travis/build/JuliaLang/julia/usr/include/julia/
1.421530 /home/travis/build/JuliaLang/julia/contrib/install.sh 644 /home/travis/build/JuliaLang/julia/src/support/END.h /home/travis/build/JuliaLang/julia/usr/include/julia/
1.422915 /home/travis/build/JuliaLang/julia/contrib/install.sh 644 /home/travis/build/JuliaLang/julia/src/support/ENTRY.amd64.h /home/travis/build/JuliaLang/julia/usr/include/julia/
1.423982 /home/travis/build/JuliaLang/julia/contrib/install.sh 644 /home/travis/build/JuliaLang/julia/src/support/ENTRY.i387.h /home/travis/build/JuliaLang/julia/usr/include/julia/
1.425167 mv julia_version.h.release.tmp julia_version.h
1.426398 /home/travis/build/JuliaLang/julia/contrib/install.sh 644 /home/travis/build/JuliaLang/julia/src/support/hashing.h /home/travis/build/JuliaLang/julia/usr/include/julia/
1.427566 /home/travis/build/JuliaLang/julia/contrib/install.sh 644 /home/travis/build/JuliaLang/julia/src/support/htable.h /home/travis/build/JuliaLang/julia/usr/include/julia/
1.429230 /home/travis/build/JuliaLang/julia/contrib/install.sh 644 /home/travis/build/JuliaLang/julia/src/support/ios.h /home/travis/build/JuliaLang/julia/usr/include/julia/
1.430727 /home/travis/build/JuliaLang/julia/contrib/install.sh 644 /home/travis/build/JuliaLang/julia/src/support/libsupport.h /home/travis/build/JuliaLang/julia/usr/include/julia/
1.433425 /home/travis/build/JuliaLang/julia/contrib/install.sh 644 /home/travis/build/JuliaLang/julia/src/support/MurmurHash3.h /home/travis/build/JuliaLang/julia/usr/include/julia/
1.433518 /home/travis/build/JuliaLang/julia/contrib/install.sh 644 /home/travis/build/JuliaLang/julia/src/support/platform.h /home/travis/build/JuliaLang/julia/usr/include/julia/
1.435404 /home/travis/build/JuliaLang/julia/contrib/install.sh 644 /home/travis/build/JuliaLang/julia/src/support/ptrhash.h /home/travis/build/JuliaLang/julia/usr/include/julia/
1.436580 /home/travis/build/JuliaLang/julia/contrib/install.sh 644 /home/travis/build/JuliaLang/julia/src/support/strtod.h /home/travis/build/JuliaLang/julia/usr/include/julia/
1.437487 /home/travis/build/JuliaLang/julia/contrib/install.sh 644 /home/travis/build/JuliaLang/julia/src/support/timefuncs.h /home/travis/build/JuliaLang/julia/usr/include/julia/
1.439023 /home/travis/build/JuliaLang/julia/contrib/install.sh 644 /home/travis/build/JuliaLang/julia/src/support/tzfile.h /home/travis/build/JuliaLang/julia/usr/include/julia/
1.441771 /home/travis/build/JuliaLang/julia/contrib/install.sh 644 /home/travis/build/JuliaLang/julia/src/support/utf8.h /home/travis/build/JuliaLang/julia/usr/include/julia/
1.442339 /home/travis/build/JuliaLang/julia/contrib/install.sh 644 /home/travis/build/JuliaLang/julia/src/support/utils.h /home/travis/build/JuliaLang/julia/usr/include/julia/
1.442672 /home/travis/build/JuliaLang/julia/contrib/install.sh 644 /home/travis/build/JuliaLang/julia/src/julia.h /home/travis/build/JuliaLang/julia/usr/include/julia/
1.444536 /home/travis/build/JuliaLang/julia/contrib/install.sh 644 /home/travis/build/JuliaLang/julia/src/julia_assert.h /home/travis/build/JuliaLang/julia/usr/include/julia/
1.445453 /home/travis/build/JuliaLang/julia/contrib/install.sh 644 /home/travis/build/JuliaLang/julia/src/julia_threads.h /home/travis/build/JuliaLang/julia/usr/include/julia/
1.445750 /home/travis/build/JuliaLang/julia/contrib/install.sh 644 /home/travis/build/JuliaLang/julia/src/tls.h /home/travis/build/JuliaLang/julia/usr/include/julia/
1.448120 /home/travis/build/JuliaLang/julia/contrib/install.sh 644 /home/travis/build/JuliaLang/julia/src/locks.h /home/travis/build/JuliaLang/julia/usr/include/julia/
1.449623 /home/travis/build/JuliaLang/julia/contrib/install.sh 644 /home/travis/build/JuliaLang/julia/src/atomics.h /home/travis/build/JuliaLang/julia/usr/include/julia/
1.451207 /home/travis/build/JuliaLang/julia/contrib/install.sh 644 /home/travis/build/JuliaLang/julia/usr/include/uv.h /home/travis/build/JuliaLang/julia/usr/include/julia/
1.454358 ccache gcc -march=pentium4 -m32 -fasynchronous-unwind-tables -DJULIA_HAS_IFUNC_SUPPORT=1 -DJULIA_ENABLE_THREADING -DJULIA_NUM_THREADS=1 -std=gnu99 -pipe -fPIC -fno-strict-aliasing -D_FILE_OFFSET_BITS=64 -Wold-style-definition -Wstrict-prototypes -Wc++-compat -O3 -ggdb2 -falign-functions -momit-leaf-frame-pointer -D_GNU_SOURCE -I. -I/home/travis/build/JuliaLang/julia/src -I/home/travis/build/JuliaLang/julia/src/flisp -I/home/travis/build/JuliaLang/julia/src/support -I/home/travis/build/JuliaLang/julia/usr/include -I/home/travis/build/JuliaLang/julia/usr/include -DLIBRARY_EXPORTS -I/home/travis/build/JuliaLang/julia/deps/valgrind -Wall -Wno-strict-aliasing -fno-omit-frame-pointer -fvisibility=hidden -fno-common -Wpointer-arith -Wundef -DJL_BUILD_ARCH='"i686"' -DJL_BUILD_UNAME='"Linux"' -I/home/travis/build/JuliaLang/julia/usr/include -DLLVM_SHLIB "-DJL_SYSTEM_IMAGE_PATH=\"../lib/julia/sys.so\"" -c /home/travis/build/JuliaLang/julia/src/jltypes.c -o jltypes.o
1.459587 ccache gcc -march=pentium4 -m32 -fasynchronous-unwind-tables -DJULIA_HAS_IFUNC_SUPPORT=1 -DJULIA_ENABLE_THREADING -DJULIA_NUM_THREADS=1 -std=gnu99 -pipe -fPIC -fno-strict-aliasing -D_FILE_OFFSET_BITS=64 -Wold-style-definition -Wstrict-prototypes -Wc++-compat -O3 -ggdb2 -falign-functions -momit-leaf-frame-pointer -D_GNU_SOURCE -I. -I/home/travis/build/JuliaLang/julia/src -I/home/travis/build/JuliaLang/julia/src/flisp -I/home/travis/build/JuliaLang/julia/src/support -I/home/travis/build/JuliaLang/julia/usr/include -I/home/travis/build/JuliaLang/julia/usr/include -DLIBRARY_EXPORTS -I/home/travis/build/JuliaLang/julia/deps/valgrind -Wall -Wno-strict-aliasing -fno-omit-frame-pointer -fvisibility=hidden -fno-common -Wpointer-arith -Wundef -DJL_BUILD_ARCH='"i686"' -DJL_BUILD_UNAME='"Linux"' -I/home/travis/build/JuliaLang/julia/usr/include -DLLVM_SHLIB "-DJL_SYSTEM_IMAGE_PATH=\"../lib/julia/sys.so\"" -c /home/travis/build/JuliaLang/julia/src/gf.c -o gf.o
1.460567 ccache gcc -march=pentium4 -m32 -fasynchronous-unwind-tables -DJULIA_HAS_IFUNC_SUPPORT=1 -DJULIA_ENABLE_THREADING -DJULIA_NUM_THREADS=1 -std=gnu99 -pipe -fPIC -fno-strict-aliasing -D_FILE_OFFSET_BITS=64 -Wold-style-definition -Wstrict-prototypes -Wc++-compat -O3 -ggdb2 -falign-functions -momit-leaf-frame-pointer -D_GNU_SOURCE -I. -I/home/travis/build/JuliaLang/julia/src -I/home/travis/build/JuliaLang/julia/src/flisp -I/home/travis/build/JuliaLang/julia/src/support -I/home/travis/build/JuliaLang/julia/usr/include -I/home/travis/build/JuliaLang/julia/usr/include -DLIBRARY_EXPORTS -I/home/travis/build/JuliaLang/julia/deps/valgrind -Wall -Wno-strict-aliasing -fno-omit-frame-pointer -fvisibility=hidden -fno-common -Wpointer-arith -Wundef -DJL_BUILD_ARCH='"i686"' -DJL_BUILD_UNAME='"Linux"' -I/home/travis/build/JuliaLang/julia/usr/include -DLLVM_SHLIB "-DJL_SYSTEM_IMAGE_PATH=\"../lib/julia/sys.so\"" -c /home/travis/build/JuliaLang/julia/src/typemap.c -o typemap.o
1.474598 ccache gcc -march=pentium4 -m32 -fasynchronous-unwind-tables -DJULIA_HAS_IFUNC_SUPPORT=1 -DJULIA_ENABLE_THREADING -DJULIA_NUM_THREADS=1 -std=gnu99 -pipe -fPIC -fno-strict-aliasing -D_FILE_OFFSET_BITS=64 -Wold-style-definition -Wstrict-prototypes -Wc++-compat -O3 -ggdb2 -falign-functions -momit-leaf-frame-pointer -D_GNU_SOURCE -I. -I/home/travis/build/JuliaLang/julia/src -I/home/travis/build/JuliaLang/julia/src/flisp -I/home/travis/build/JuliaLang/julia/src/support -I/home/travis/build/JuliaLang/julia/usr/include -I/home/travis/build/JuliaLang/julia/usr/include -DLIBRARY_EXPORTS -I/home/travis/build/JuliaLang/julia/deps/valgrind -Wall -Wno-strict-aliasing -fno-omit-frame-pointer -fvisibility=hidden -fno-common -Wpointer-arith -Wundef -DJL_BUILD_ARCH='"i686"' -DJL_BUILD_UNAME='"Linux"' -I/home/travis/build/JuliaLang/julia/usr/include -DLLVM_SHLIB "-DJL_SYSTEM_IMAGE_PATH=\"../lib/julia/sys.so\"" -c /home/travis/build/JuliaLang/julia/src/ast.c -o ast.o
1.475549 ccache gcc -march=pentium4 -m32 -fasynchronous-unwind-tables -DJULIA_HAS_IFUNC_SUPPORT=1 -DJULIA_ENABLE_THREADING -DJULIA_NUM_THREADS=1 -std=gnu99 -pipe -fPIC -fno-strict-aliasing -D_FILE_OFFSET_BITS=64 -Wold-style-definition -Wstrict-prototypes -Wc++-compat -O3 -ggdb2 -falign-functions -momit-leaf-frame-pointer -D_GNU_SOURCE -I. -I/home/travis/build/JuliaLang/julia/src -I/home/travis/build/JuliaLang/julia/src/flisp -I/home/travis/build/JuliaLang/julia/src/support -I/home/travis/build/JuliaLang/julia/usr/include -I/home/travis/build/JuliaLang/julia/usr/include -DLIBRARY_EXPORTS -I/home/travis/build/JuliaLang/julia/deps/valgrind -Wall -Wno-strict-aliasing -fno-omit-frame-pointer -fvisibility=hidden -fno-common -Wpointer-arith -Wundef -DJL_BUILD_ARCH='"i686"' -DJL_BUILD_UNAME='"Linux"' -I/home/travis/build/JuliaLang/julia/usr/include -DLLVM_SHLIB "-DJL_SYSTEM_IMAGE_PATH=\"../lib/julia/sys.so\"" -c /home/travis/build/JuliaLang/julia/src/builtins.c -o builtins.o
3.400423 ccache gcc -march=pentium4 -m32 -fasynchronous-unwind-tables -DJULIA_HAS_IFUNC_SUPPORT=1 -DJULIA_ENABLE_THREADING -DJULIA_NUM_THREADS=1 -std=gnu99 -pipe -fPIC -fno-strict-aliasing -D_FILE_OFFSET_BITS=64 -Wold-style-definition -Wstrict-prototypes -Wc++-compat -O3 -ggdb2 -falign-functions -momit-leaf-frame-pointer -D_GNU_SOURCE -I. -I/home/travis/build/JuliaLang/julia/src -I/home/travis/build/JuliaLang/julia/src/flisp -I/home/travis/build/JuliaLang/julia/src/support -I/home/travis/build/JuliaLang/julia/usr/include -I/home/travis/build/JuliaLang/julia/usr/include -DLIBRARY_EXPORTS -I/home/travis/build/JuliaLang/julia/deps/valgrind -Wall -Wno-strict-aliasing -fno-omit-frame-pointer -fvisibility=hidden -fno-common -Wpointer-arith -Wundef -DJL_BUILD_ARCH='"i686"' -DJL_BUILD_UNAME='"Linux"' -I/home/travis/build/JuliaLang/julia/usr/include -DLLVM_SHLIB "-DJL_SYSTEM_IMAGE_PATH=\"../lib/julia/sys.so\"" -c /home/travis/build/JuliaLang/julia/src/module.c -o module.o
3.801854 ccache gcc -march=pentium4 -m32 -fasynchronous-unwind-tables -DJULIA_HAS_IFUNC_SUPPORT=1 -DJULIA_ENABLE_THREADING -DJULIA_NUM_THREADS=1 -std=gnu99 -pipe -fPIC -fno-strict-aliasing -D_FILE_OFFSET_BITS=64 -Wold-style-definition -Wstrict-prototypes -Wc++-compat -O3 -ggdb2 -falign-functions -momit-leaf-frame-pointer -D_GNU_SOURCE -I. -I/home/travis/build/JuliaLang/julia/src -I/home/travis/build/JuliaLang/julia/src/flisp -I/home/travis/build/JuliaLang/julia/src/support -I/home/travis/build/JuliaLang/julia/usr/include -I/home/travis/build/JuliaLang/julia/usr/include -DLIBRARY_EXPORTS -I/home/travis/build/JuliaLang/julia/deps/valgrind -Wall -Wno-strict-aliasing -fno-omit-frame-pointer -fvisibility=hidden -fno-common -Wpointer-arith -Wundef -DJL_BUILD_ARCH='"i686"' -DJL_BUILD_UNAME='"Linux"' -I/home/travis/build/JuliaLang/julia/usr/include -DLLVM_SHLIB "-DJL_SYSTEM_IMAGE_PATH=\"../lib/julia/sys.so\"" -c /home/travis/build/JuliaLang/julia/src/interpreter.c -o interpreter.o
4.447125 ccache gcc -march=pentium4 -m32 -fasynchronous-unwind-tables -DJULIA_HAS_IFUNC_SUPPORT=1 -DJULIA_ENABLE_THREADING -DJULIA_NUM_THREADS=1 -std=gnu99 -pipe -fPIC -fno-strict-aliasing -D_FILE_OFFSET_BITS=64 -Wold-style-definition -Wstrict-prototypes -Wc++-compat -O3 -ggdb2 -falign-functions -momit-leaf-frame-pointer -D_GNU_SOURCE -I. -I/home/travis/build/JuliaLang/julia/src -I/home/travis/build/JuliaLang/julia/src/flisp -I/home/travis/build/JuliaLang/julia/src/support -I/home/travis/build/JuliaLang/julia/usr/include -I/home/travis/build/JuliaLang/julia/usr/include -DLIBRARY_EXPORTS -I/home/travis/build/JuliaLang/julia/deps/valgrind -Wall -Wno-strict-aliasing -fno-omit-frame-pointer -fvisibility=hidden -fno-common -Wpointer-arith -Wundef -DJL_BUILD_ARCH='"i686"' -DJL_BUILD_UNAME='"Linux"' -I/home/travis/build/JuliaLang/julia/usr/include -DLLVM_SHLIB "-DJL_SYSTEM_IMAGE_PATH=\"../lib/julia/sys.so\"" -c /home/travis/build/JuliaLang/julia/src/symbol.c -o symbol.o
4.625281 ccache gcc -march=pentium4 -m32 -fasynchronous-unwind-tables -DJULIA_HAS_IFUNC_SUPPORT=1 -DJULIA_ENABLE_THREADING -DJULIA_NUM_THREADS=1 -std=gnu99 -pipe -fPIC -fno-strict-aliasing -D_FILE_OFFSET_BITS=64 -Wold-style-definition -Wstrict-prototypes -Wc++-compat -O3 -ggdb2 -falign-functions -momit-leaf-frame-pointer -D_GNU_SOURCE -I. -I/home/travis/build/JuliaLang/julia/src -I/home/travis/build/JuliaLang/julia/src/flisp -I/home/travis/build/JuliaLang/julia/src/support -I/home/travis/build/JuliaLang/julia/usr/include -I/home/travis/build/JuliaLang/julia/usr/include -DLIBRARY_EXPORTS -I/home/travis/build/JuliaLang/julia/deps/valgrind -Wall -Wno-strict-aliasing -fno-omit-frame-pointer -fvisibility=hidden -fno-common -Wpointer-arith -Wundef -DJL_BUILD_ARCH='"i686"' -DJL_BUILD_UNAME='"Linux"' -I/home/travis/build/JuliaLang/julia/usr/include -DLLVM_SHLIB "-DJL_SYSTEM_IMAGE_PATH=\"../lib/julia/sys.so\"" -c /home/travis/build/JuliaLang/julia/src/dlload.c -o dlload.o
4.922146 ccache gcc -march=pentium4 -m32 -fasynchronous-unwind-tables -DJULIA_HAS_IFUNC_SUPPORT=1 -DJULIA_ENABLE_THREADING -DJULIA_NUM_THREADS=1 -std=gnu99 -pipe -fPIC -fno-strict-aliasing -D_FILE_OFFSET_BITS=64 -Wold-style-definition -Wstrict-prototypes -Wc++-compat -O3 -ggdb2 -falign-functions -momit-leaf-frame-pointer -D_GNU_SOURCE -I. -I/home/travis/build/JuliaLang/julia/src -I/home/travis/build/JuliaLang/julia/src/flisp -I/home/travis/build/JuliaLang/julia/src/support -I/home/travis/build/JuliaLang/julia/usr/include -I/home/travis/build/JuliaLang/julia/usr/include -DLIBRARY_EXPORTS -I/home/travis/build/JuliaLang/julia/deps/valgrind -Wall -Wno-strict-aliasing -fno-omit-frame-pointer -fvisibility=hidden -fno-common -Wpointer-arith -Wundef -DJL_BUILD_ARCH='"i686"' -DJL_BUILD_UNAME='"Linux"' -I/home/travis/build/JuliaLang/julia/usr/include -DLLVM_SHLIB "-DJL_SYSTEM_IMAGE_PATH=\"../lib/julia/sys.so\"" -c /home/travis/build/JuliaLang/julia/src/sys.c -o sys.o
5.158796 ccache gcc -march=pentium4 -m32 -fasynchronous-unwind-tables -DJULIA_HAS_IFUNC_SUPPORT=1 -DJULIA_ENABLE_THREADING -DJULIA_NUM_THREADS=1 -std=gnu99 -pipe -fPIC -fno-strict-aliasing -D_FILE_OFFSET_BITS=64 -Wold-style-definition -Wstrict-prototypes -Wc++-compat -O3 -ggdb2 -falign-functions -momit-leaf-frame-pointer -D_GNU_SOURCE -I. -I/home/travis/build/JuliaLang/julia/src -I/home/travis/build/JuliaLang/julia/src/flisp -I/home/travis/build/JuliaLang/julia/src/support -I/home/travis/build/JuliaLang/julia/usr/include -I/home/travis/build/JuliaLang/julia/usr/include -DLIBRARY_EXPORTS -I/home/travis/build/JuliaLang/julia/deps/valgrind -Wall -Wno-strict-aliasing -fno-omit-frame-pointer -fvisibility=hidden -fno-common -Wpointer-arith -Wundef -DJL_BUILD_ARCH='"i686"' -DJL_BUILD_UNAME='"Linux"' -I/home/travis/build/JuliaLang/julia/usr/include -DLLVM_SHLIB "-DJL_SYSTEM_IMAGE_PATH=\"../lib/julia/sys.so\"" -c /home/travis/build/JuliaLang/julia/src/init.c -o init.o
5.186838 ccache gcc -march=pentium4 -m32 -fasynchronous-unwind-tables -DJULIA_HAS_IFUNC_SUPPORT=1 -DJULIA_ENABLE_THREADING -DJULIA_NUM_THREADS=1 -std=gnu99 -pipe -fPIC -fno-strict-aliasing -D_FILE_OFFSET_BITS=64 -Wold-style-definition -Wstrict-prototypes -Wc++-compat -O3 -ggdb2 -falign-functions -momit-leaf-frame-pointer -D_GNU_SOURCE -I. -I/home/travis/build/JuliaLang/julia/src -I/home/travis/build/JuliaLang/julia/src/flisp -I/home/travis/build/JuliaLang/julia/src/support -I/home/travis/build/JuliaLang/julia/usr/include -I/home/travis/build/JuliaLang/julia/usr/include -DLIBRARY_EXPORTS -I/home/travis/build/JuliaLang/julia/deps/valgrind -Wall -Wno-strict-aliasing -fno-omit-frame-pointer -fvisibility=hidden -fno-common -Wpointer-arith -Wundef -DJL_BUILD_ARCH='"i686"' -DJL_BUILD_UNAME='"Linux"' -I/home/travis/build/JuliaLang/julia/usr/include -DLLVM_SHLIB "-DJL_SYSTEM_IMAGE_PATH=\"../lib/julia/sys.so\"" -c /home/travis/build/JuliaLang/julia/src/task.c -o task.o
5.292907 ccache gcc -march=pentium4 -m32 -fasynchronous-unwind-tables -DJULIA_HAS_IFUNC_SUPPORT=1 -DJULIA_ENABLE_THREADING -DJULIA_NUM_THREADS=1 -std=gnu99 -pipe -fPIC -fno-strict-aliasing -D_FILE_OFFSET_BITS=64 -Wold-style-definition -Wstrict-prototypes -Wc++-compat -O3 -ggdb2 -falign-functions -momit-leaf-frame-pointer -D_GNU_SOURCE -I. -I/home/travis/build/JuliaLang/julia/src -I/home/travis/build/JuliaLang/julia/src/flisp -I/home/travis/build/JuliaLang/julia/src/support -I/home/travis/build/JuliaLang/julia/usr/include -I/home/travis/build/JuliaLang/julia/usr/include -DLIBRARY_EXPORTS -I/home/travis/build/JuliaLang/julia/deps/valgrind -Wall -Wno-strict-aliasing -fno-omit-frame-pointer -fvisibility=hidden -fno-common -Wpointer-arith -Wundef -DJL_BUILD_ARCH='"i686"' -DJL_BUILD_UNAME='"Linux"' -I/home/travis/build/JuliaLang/julia/usr/include -DLLVM_SHLIB "-DJL_SYSTEM_IMAGE_PATH=\"../lib/julia/sys.so\"" -c /home/travis/build/JuliaLang/julia/src/array.c -o array.o
5.894826 ccache gcc -march=pentium4 -m32 -fasynchronous-unwind-tables -DJULIA_HAS_IFUNC_SUPPORT=1 -DJULIA_ENABLE_THREADING -DJULIA_NUM_THREADS=1 -std=gnu99 -pipe -fPIC -fno-strict-aliasing -D_FILE_OFFSET_BITS=64 -Wold-style-definition -Wstrict-prototypes -Wc++-compat -O3 -ggdb2 -falign-functions -momit-leaf-frame-pointer -D_GNU_SOURCE -I. -I/home/travis/build/JuliaLang/julia/src -I/home/travis/build/JuliaLang/julia/src/flisp -I/home/travis/build/JuliaLang/julia/src/support -I/home/travis/build/JuliaLang/julia/usr/include -I/home/travis/build/JuliaLang/julia/usr/include -DLIBRARY_EXPORTS -I/home/travis/build/JuliaLang/julia/deps/valgrind -Wall -Wno-strict-aliasing -fno-omit-frame-pointer -fvisibility=hidden -fno-common -Wpointer-arith -Wundef -DJL_BUILD_ARCH='"i686"' -DJL_BUILD_UNAME='"Linux"' -I/home/travis/build/JuliaLang/julia/usr/include -DLLVM_SHLIB "-DJL_SYSTEM_IMAGE_PATH=\"../lib/julia/sys.so\"" -c /home/travis/build/JuliaLang/julia/src/dump.c -o dump.o
6.074822 ccache gcc -march=pentium4 -m32 -fasynchronous-unwind-tables -DJULIA_HAS_IFUNC_SUPPORT=1 -DJULIA_ENABLE_THREADING -DJULIA_NUM_THREADS=1 -std=gnu99 -pipe -fPIC -fno-strict-aliasing -D_FILE_OFFSET_BITS=64 -Wold-style-definition -Wstrict-prototypes -Wc++-compat -O3 -ggdb2 -falign-functions -momit-leaf-frame-pointer -D_GNU_SOURCE -I. -I/home/travis/build/JuliaLang/julia/src -I/home/travis/build/JuliaLang/julia/src/flisp -I/home/travis/build/JuliaLang/julia/src/support -I/home/travis/build/JuliaLang/julia/usr/include -I/home/travis/build/JuliaLang/julia/usr/include -DLIBRARY_EXPORTS -I/home/travis/build/JuliaLang/julia/deps/valgrind -Wall -Wno-strict-aliasing -fno-omit-frame-pointer -fvisibility=hidden -fno-common -Wpointer-arith -Wundef -DJL_BUILD_ARCH='"i686"' -DJL_BUILD_UNAME='"Linux"' -I/home/travis/build/JuliaLang/julia/usr/include -DLLVM_SHLIB "-DJL_SYSTEM_IMAGE_PATH=\"../lib/julia/sys.so\"" -c /home/travis/build/JuliaLang/julia/src/staticdata.c -o staticdata.o
6.166797 ccache gcc -march=pentium4 -m32 -fasynchronous-unwind-tables -DJULIA_HAS_IFUNC_SUPPORT=1 -DJULIA_ENABLE_THREADING -DJULIA_NUM_THREADS=1 -std=gnu99 -pipe -fPIC -fno-strict-aliasing -D_FILE_OFFSET_BITS=64 -Wold-style-definition -Wstrict-prototypes -Wc++-compat -O3 -ggdb2 -falign-functions -momit-leaf-frame-pointer -D_GNU_SOURCE -I. -I/home/travis/build/JuliaLang/julia/src -I/home/travis/build/JuliaLang/julia/src/flisp -I/home/travis/build/JuliaLang/julia/src/support -I/home/travis/build/JuliaLang/julia/usr/include -I/home/travis/build/JuliaLang/julia/usr/include -DLIBRARY_EXPORTS -I/home/travis/build/JuliaLang/julia/deps/valgrind -Wall -Wno-strict-aliasing -fno-omit-frame-pointer -fvisibility=hidden -fno-common -Wpointer-arith -Wundef -DJL_BUILD_ARCH='"i686"' -DJL_BUILD_UNAME='"Linux"' -I/home/travis/build/JuliaLang/julia/usr/include -DLLVM_SHLIB "-DJL_SYSTEM_IMAGE_PATH=\"../lib/julia/sys.so\"" -c /home/travis/build/JuliaLang/julia/src/toplevel.c -o toplevel.o
6.346738 ccache gcc -march=pentium4 -m32 -fasynchronous-unwind-tables -DJULIA_HAS_IFUNC_SUPPORT=1 -DJULIA_ENABLE_THREADING -DJULIA_NUM_THREADS=1 -std=gnu99 -pipe -fPIC -fno-strict-aliasing -D_FILE_OFFSET_BITS=64 -Wold-style-definition -Wstrict-prototypes -Wc++-compat -O3 -ggdb2 -falign-functions -momit-leaf-frame-pointer -D_GNU_SOURCE -I. -I/home/travis/build/JuliaLang/julia/src -I/home/travis/build/JuliaLang/julia/src/flisp -I/home/travis/build/JuliaLang/julia/src/support -I/home/travis/build/JuliaLang/julia/usr/include -I/home/travis/build/JuliaLang/julia/usr/include -DLIBRARY_EXPORTS -I/home/travis/build/JuliaLang/julia/deps/valgrind -Wall -Wno-strict-aliasing -fno-omit-frame-pointer -fvisibility=hidden -fno-common -Wpointer-arith -Wundef -DJL_BUILD_ARCH='"i686"' -DJL_BUILD_UNAME='"Linux"' -I/home/travis/build/JuliaLang/julia/usr/include -DLLVM_SHLIB "-DJL_SYSTEM_IMAGE_PATH=\"../lib/julia/sys.so\"" -c /home/travis/build/JuliaLang/julia/src/jl_uv.c -o jl_uv.o
7.138828 ccache gcc -march=pentium4 -m32 -fasynchronous-unwind-tables -DJULIA_HAS_IFUNC_SUPPORT=1 -DJULIA_ENABLE_THREADING -DJULIA_NUM_THREADS=1 -std=gnu99 -pipe -fPIC -fno-strict-aliasing -D_FILE_OFFSET_BITS=64 -Wold-style-definition -Wstrict-prototypes -Wc++-compat -O3 -ggdb2 -falign-functions -momit-leaf-frame-pointer -D_GNU_SOURCE -I. -I/home/travis/build/JuliaLang/julia/src -I/home/travis/build/JuliaLang/julia/src/flisp -I/home/travis/build/JuliaLang/julia/src/support -I/home/travis/build/JuliaLang/julia/usr/include -I/home/travis/build/JuliaLang/julia/usr/include -DLIBRARY_EXPORTS -I/home/travis/build/JuliaLang/julia/deps/valgrind -Wall -Wno-strict-aliasing -fno-omit-frame-pointer -fvisibility=hidden -fno-common -Wpointer-arith -Wundef -DJL_BUILD_ARCH='"i686"' -DJL_BUILD_UNAME='"Linux"' -I/home/travis/build/JuliaLang/julia/usr/include -DLLVM_SHLIB "-DJL_SYSTEM_IMAGE_PATH=\"../lib/julia/sys.so\"" -c /home/travis/build/JuliaLang/julia/src/datatype.c -o datatype.o
7.630458 ccache gcc -march=pentium4 -m32 -fasynchronous-unwind-tables -DJULIA_HAS_IFUNC_SUPPORT=1 -DJULIA_ENABLE_THREADING -DJULIA_NUM_THREADS=1 -std=gnu99 -pipe -fPIC -fno-strict-aliasing -D_FILE_OFFSET_BITS=64 -Wold-style-definition -Wstrict-prototypes -Wc++-compat -O3 -ggdb2 -falign-functions -momit-leaf-frame-pointer -D_GNU_SOURCE -I. -I/home/travis/build/JuliaLang/julia/src -I/home/travis/build/JuliaLang/julia/src/flisp -I/home/travis/build/JuliaLang/julia/src/support -I/home/travis/build/JuliaLang/julia/usr/include -I/home/travis/build/JuliaLang/julia/usr/include -DLIBRARY_EXPORTS -I/home/travis/build/JuliaLang/julia/deps/valgrind -Wall -Wno-strict-aliasing -fno-omit-frame-pointer -fvisibility=hidden -fno-common -Wpointer-arith -Wundef -DJL_BUILD_ARCH='"i686"' -DJL_BUILD_UNAME='"Linux"' -I/home/travis/build/JuliaLang/julia/usr/include -DLLVM_SHLIB "-DJL_SYSTEM_IMAGE_PATH=\"../lib/julia/sys.so\"" -c /home/travis/build/JuliaLang/julia/src/simplevector.c -o simplevector.o
7.650268 ccache g++ -march=pentium4 -m32 -I/home/travis/build/JuliaLang/julia/usr/include -fPIC -fvisibility-inlines-hidden -Werror=date-time -std=c++11 -Wall -W -Wno-unused-parameter -Wwrite-strings -Wcast-qual -Wno-missing-field-initializers -pedantic -Wno-long-long -Wundef -Wno-maybe-uninitialized -Wdelete-non-virtual-dtor -Wno-comment -ffunction-sections -fdata-sections -O3 -fno-exceptions -fno-rtti -D_GNU_SOURCE -D_DEBUG -D_LARGEFILE_SOURCE -D_FILE_OFFSET_BITS=64 -D__STDC_CONSTANT_MACROS -D__STDC_FORMAT_MACROS -D__STDC_LIMIT_MACROS -fasynchronous-unwind-tables -DJULIA_HAS_IFUNC_SUPPORT=1 -DJULIA_ENABLE_THREADING -DJULIA_NUM_THREADS=1 -pipe -fPIC -fno-rtti -pedantic -D_FILE_OFFSET_BITS=64 -O3 -ggdb2 -falign-functions -momit-leaf-frame-pointer -D_GNU_SOURCE -I. -I/home/travis/build/JuliaLang/julia/src -I/home/travis/build/JuliaLang/julia/src/flisp -I/home/travis/build/JuliaLang/julia/src/support -I/home/travis/build/JuliaLang/julia/usr/include -I/home/travis/build/JuliaLang/julia/usr/include -DLIBRARY_EXPORTS -I/home/travis/build/JuliaLang/julia/deps/valgrind -Wall -Wno-strict-aliasing -fno-omit-frame-pointer -fvisibility=hidden -fno-common -Wpointer-arith -Wundef -DJL_BUILD_ARCH='"i686"' -DJL_BUILD_UNAME='"Linux"' -I/home/travis/build/JuliaLang/julia/usr/include -DLLVM_SHLIB "-DJL_SYSTEM_IMAGE_PATH=\"../lib/julia/sys.so\"" -c /home/travis/build/JuliaLang/julia/src/APInt-C.cpp -o APInt-C.o
8.366945 ccache gcc -march=pentium4 -m32 -fasynchronous-unwind-tables -DJULIA_HAS_IFUNC_SUPPORT=1 -DJULIA_ENABLE_THREADING -DJULIA_NUM_THREADS=1 -std=gnu99 -pipe -fPIC -fno-strict-aliasing -D_FILE_OFFSET_BITS=64 -Wold-style-definition -Wstrict-prototypes -Wc++-compat -O3 -ggdb2 -falign-functions -momit-leaf-frame-pointer -D_GNU_SOURCE -I. -I/home/travis/build/JuliaLang/julia/src -I/home/travis/build/JuliaLang/julia/src/flisp -I/home/travis/build/JuliaLang/julia/src/support -I/home/travis/build/JuliaLang/julia/usr/include -I/home/travis/build/JuliaLang/julia/usr/include -DLIBRARY_EXPORTS -I/home/travis/build/JuliaLang/julia/deps/valgrind -Wall -Wno-strict-aliasing -fno-omit-frame-pointer -fvisibility=hidden -fno-common -Wpointer-arith -Wundef -DJL_BUILD_ARCH='"i686"' -DJL_BUILD_UNAME='"Linux"' -I/home/travis/build/JuliaLang/julia/usr/include -DLLVM_SHLIB "-DJL_SYSTEM_IMAGE_PATH=\"../lib/julia/sys.so\"" -c /home/travis/build/JuliaLang/julia/src/runtime_intrinsics.c -o runtime_intrinsics.o
8.980854 ccache g++ -march=pentium4 -m32 -I/home/travis/build/JuliaLang/julia/usr/include -fPIC -fvisibility-inlines-hidden -Werror=date-time -std=c++11 -Wall -W -Wno-unused-parameter -Wwrite-strings -Wcast-qual -Wno-missing-field-initializers -pedantic -Wno-long-long -Wundef -Wno-maybe-uninitialized -Wdelete-non-virtual-dtor -Wno-comment -ffunction-sections -fdata-sections -O3 -fno-exceptions -fno-rtti -D_GNU_SOURCE -D_DEBUG -D_LARGEFILE_SOURCE -D_FILE_OFFSET_BITS=64 -D__STDC_CONSTANT_MACROS -D__STDC_FORMAT_MACROS -D__STDC_LIMIT_MACROS -fasynchronous-unwind-tables -DJULIA_HAS_IFUNC_SUPPORT=1 -DJULIA_ENABLE_THREADING -DJULIA_NUM_THREADS=1 -pipe -fPIC -fno-rtti -pedantic -D_FILE_OFFSET_BITS=64 -O3 -ggdb2 -falign-functions -momit-leaf-frame-pointer -D_GNU_SOURCE -I. -I/home/travis/build/JuliaLang/julia/src -I/home/travis/build/JuliaLang/julia/src/flisp -I/home/travis/build/JuliaLang/julia/src/support -I/home/travis/build/JuliaLang/julia/usr/include -I/home/travis/build/JuliaLang/julia/usr/include -DLIBRARY_EXPORTS -I/home/travis/build/JuliaLang/julia/deps/valgrind -Wall -Wno-strict-aliasing -fno-omit-frame-pointer -fvisibility=hidden -fno-common -Wpointer-arith -Wundef -DJL_BUILD_ARCH='"i686"' -DJL_BUILD_UNAME='"Linux"' -I/home/travis/build/JuliaLang/julia/usr/include -DLLVM_SHLIB "-DJL_SYSTEM_IMAGE_PATH=\"../lib/julia/sys.so\"" -c /home/travis/build/JuliaLang/julia/src/runtime_ccall.cpp -o runtime_ccall.o
9.678850 ccache gcc -march=pentium4 -m32 -fasynchronous-unwind-tables -DJULIA_HAS_IFUNC_SUPPORT=1 -DJULIA_ENABLE_THREADING -DJULIA_NUM_THREADS=1 -std=gnu99 -pipe -fPIC -fno-strict-aliasing -D_FILE_OFFSET_BITS=64 -Wold-style-definition -Wstrict-prototypes -Wc++-compat -O3 -ggdb2 -falign-functions -momit-leaf-frame-pointer -D_GNU_SOURCE -I. -I/home/travis/build/JuliaLang/julia/src -I/home/travis/build/JuliaLang/julia/src/flisp -I/home/travis/build/JuliaLang/julia/src/support -I/home/travis/build/JuliaLang/julia/usr/include -I/home/travis/build/JuliaLang/julia/usr/include -DLIBRARY_EXPORTS -I/home/travis/build/JuliaLang/julia/deps/valgrind -Wall -Wno-strict-aliasing -fno-omit-frame-pointer -fvisibility=hidden -fno-common -Wpointer-arith -Wundef -DJL_BUILD_ARCH='"i686"' -DJL_BUILD_UNAME='"Linux"' -I/home/travis/build/JuliaLang/julia/usr/include -DLLVM_SHLIB "-DJL_SYSTEM_IMAGE_PATH=\"../lib/julia/sys.so\"" -c /home/travis/build/JuliaLang/julia/src/precompile.c -o precompile.o
10.290815 ccache gcc -march=pentium4 -m32 -fasynchronous-unwind-tables -DJULIA_HAS_IFUNC_SUPPORT=1 -DJULIA_ENABLE_THREADING -DJULIA_NUM_THREADS=1 -std=gnu99 -pipe -fPIC -fno-strict-aliasing -D_FILE_OFFSET_BITS=64 -Wold-style-definition -Wstrict-prototypes -Wc++-compat -O3 -ggdb2 -falign-functions -momit-leaf-frame-pointer -D_GNU_SOURCE -I. -I/home/travis/build/JuliaLang/julia/src -I/home/travis/build/JuliaLang/julia/src/flisp -I/home/travis/build/JuliaLang/julia/src/support -I/home/travis/build/JuliaLang/julia/usr/include -I/home/travis/build/JuliaLang/julia/usr/include -DLIBRARY_EXPORTS -I/home/travis/build/JuliaLang/julia/deps/valgrind -Wall -Wno-strict-aliasing -fno-omit-frame-pointer -fvisibility=hidden -fno-common -Wpointer-arith -Wundef -DJL_BUILD_ARCH='"i686"' -DJL_BUILD_UNAME='"Linux"' -I/home/travis/build/JuliaLang/julia/usr/include -DLLVM_SHLIB "-DJL_SYSTEM_IMAGE_PATH=\"../lib/julia/sys.so\"" -c /home/travis/build/JuliaLang/julia/src/threadgroup.c -o threadgroup.o
/home/travis/build/JuliaLang/julia/src/dump.c: In function ‘jl_deserialize_typemap_entry’:
/home/travis/build/JuliaLang/julia/src/dump.c:1831:173: warning: suggest parentheses around ‘&&’ within ‘||’ [-Wparentheses]
10.425260 ccache gcc -march=pentium4 -m32 -fasynchronous-unwind-tables -DJULIA_HAS_IFUNC_SUPPORT=1 -DJULIA_ENABLE_THREADING -DJULIA_NUM_THREADS=1 -std=gnu99 -pipe -fPIC -fno-strict-aliasing -D_FILE_OFFSET_BITS=64 -Wold-style-definition -Wstrict-prototypes -Wc++-compat -O3 -ggdb2 -falign-functions -momit-leaf-frame-pointer -D_GNU_SOURCE -I. -I/home/travis/build/JuliaLang/julia/src -I/home/travis/build/JuliaLang/julia/src/flisp -I/home/travis/build/JuliaLang/julia/src/support -I/home/travis/build/JuliaLang/julia/usr/include -I/home/travis/build/JuliaLang/julia/usr/include -DLIBRARY_EXPORTS -I/home/travis/build/JuliaLang/julia/deps/valgrind -Wall -Wno-strict-aliasing -fno-omit-frame-pointer -fvisibility=hidden -fno-common -Wpointer-arith -Wundef -DJL_BUILD_ARCH='"i686"' -DJL_BUILD_UNAME='"Linux"' -I/home/travis/build/JuliaLang/julia/usr/include -DLLVM_SHLIB "-DJL_SYSTEM_IMAGE_PATH=\"../lib/julia/sys.so\"" -c /home/travis/build/JuliaLang/julia/src/threading.c -o threading.o
10.978866 ccache gcc -march=pentium4 -m32 -fasynchronous-unwind-tables -DJULIA_HAS_IFUNC_SUPPORT=1 -DJULIA_ENABLE_THREADING -DJULIA_NUM_THREADS=1 -std=gnu99 -pipe -fPIC -fno-strict-aliasing -D_FILE_OFFSET_BITS=64 -Wold-style-definition -Wstrict-prototypes -Wc++-compat -O3 -ggdb2 -falign-functions -momit-leaf-frame-pointer -D_GNU_SOURCE -I. -I/home/travis/build/JuliaLang/julia/src -I/home/travis/build/JuliaLang/julia/src/flisp -I/home/travis/build/JuliaLang/julia/src/support -I/home/travis/build/JuliaLang/julia/usr/include -I/home/travis/build/JuliaLang/julia/usr/include -DLIBRARY_EXPORTS -I/home/travis/build/JuliaLang/julia/deps/valgrind -Wall -Wno-strict-aliasing -fno-omit-frame-pointer -fvisibility=hidden -fno-common -Wpointer-arith -Wundef -DJL_BUILD_ARCH='"i686"' -DJL_BUILD_UNAME='"Linux"' -I/home/travis/build/JuliaLang/julia/usr/include -DLLVM_SHLIB "-DJL_SYSTEM_IMAGE_PATH=\"../lib/julia/sys.so\"" -c /home/travis/build/JuliaLang/julia/src/stackwalk.c -o stackwalk.o
11.134825 ccache gcc -march=pentium4 -m32 -fasynchronous-unwind-tables -DJULIA_HAS_IFUNC_SUPPORT=1 -DJULIA_ENABLE_THREADING -DJULIA_NUM_THREADS=1 -std=gnu99 -pipe -fPIC -fno-strict-aliasing -D_FILE_OFFSET_BITS=64 -Wold-style-definition -Wstrict-prototypes -Wc++-compat -O3 -ggdb2 -falign-functions -momit-leaf-frame-pointer -D_GNU_SOURCE -I. -I/home/travis/build/JuliaLang/julia/src -I/home/travis/build/JuliaLang/julia/src/flisp -I/home/travis/build/JuliaLang/julia/src/support -I/home/travis/build/JuliaLang/julia/usr/include -I/home/travis/build/JuliaLang/julia/usr/include -DLIBRARY_EXPORTS -I/home/travis/build/JuliaLang/julia/deps/valgrind -Wall -Wno-strict-aliasing -fno-omit-frame-pointer -fvisibility=hidden -fno-common -Wpointer-arith -Wundef -DJL_BUILD_ARCH='"i686"' -DJL_BUILD_UNAME='"Linux"' -I/home/travis/build/JuliaLang/julia/usr/include -DLLVM_SHLIB "-DJL_SYSTEM_IMAGE_PATH=\"../lib/julia/sys.so\"" -c /home/travis/build/JuliaLang/julia/src/gc.c -o gc.o
11.301508 ccache gcc -march=pentium4 -m32 -fasynchronous-unwind-tables -DJULIA_HAS_IFUNC_SUPPORT=1 -DJULIA_ENABLE_THREADING -DJULIA_NUM_THREADS=1 -std=gnu99 -pipe -fPIC -fno-strict-aliasing -D_FILE_OFFSET_BITS=64 -Wold-style-definition -Wstrict-prototypes -Wc++-compat -O3 -ggdb2 -falign-functions -momit-leaf-frame-pointer -D_GNU_SOURCE -I. -I/home/travis/build/JuliaLang/julia/src -I/home/travis/build/JuliaLang/julia/src/flisp -I/home/travis/build/JuliaLang/julia/src/support -I/home/travis/build/JuliaLang/julia/usr/include -I/home/travis/build/JuliaLang/julia/usr/include -DLIBRARY_EXPORTS -I/home/travis/build/JuliaLang/julia/deps/valgrind -Wall -Wno-strict-aliasing -fno-omit-frame-pointer -fvisibility=hidden -fno-common -Wpointer-arith -Wundef -DJL_BUILD_ARCH='"i686"' -DJL_BUILD_UNAME='"Linux"' -I/home/travis/build/JuliaLang/julia/usr/include -DLLVM_SHLIB "-DJL_SYSTEM_IMAGE_PATH=\"../lib/julia/sys.so\"" -c /home/travis/build/JuliaLang/julia/src/gc-debug.c -o gc-debug.o
/home/travis/build/JuliaLang/julia/src/runtime_ccall.cpp: In function ‘jl_value_t* jl_get_cfunction_trampoline(jl_value_t*, jl_datatype_t*, htable_t*, jl_svec_t*, void* (*)(void*, void**), jl_unionall_t*, jl_value_t**)’:
/home/travis/build/JuliaLang/julia/src/runtime_ccall.cpp:165:15: warning: argument ‘cache’ might be clobbered by ‘longjmp’ or ‘vfork’ [-Wclobbered]
htable_t *cache, // weakref htable indexed by (fobj, vals)
^
11.477670 ccache gcc -march=pentium4 -m32 -fasynchronous-unwind-tables -DJULIA_HAS_IFUNC_SUPPORT=1 -DJULIA_ENABLE_THREADING -DJULIA_NUM_THREADS=1 -std=gnu99 -pipe -fPIC -fno-strict-aliasing -D_FILE_OFFSET_BITS=64 -Wold-style-definition -Wstrict-prototypes -Wc++-compat -O3 -ggdb2 -falign-functions -momit-leaf-frame-pointer -D_GNU_SOURCE -I. -I/home/travis/build/JuliaLang/julia/src -I/home/travis/build/JuliaLang/julia/src/flisp -I/home/travis/build/JuliaLang/julia/src/support -I/home/travis/build/JuliaLang/julia/usr/include -I/home/travis/build/JuliaLang/julia/usr/include -DLIBRARY_EXPORTS -I/home/travis/build/JuliaLang/julia/deps/valgrind -Wall -Wno-strict-aliasing -fno-omit-frame-pointer -fvisibility=hidden -fno-common -Wpointer-arith -Wundef -DJL_BUILD_ARCH='"i686"' -DJL_BUILD_UNAME='"Linux"' -I/home/travis/build/JuliaLang/julia/usr/include -DLLVM_SHLIB "-DJL_SYSTEM_IMAGE_PATH=\"../lib/julia/sys.so\"" -c /home/travis/build/JuliaLang/julia/src/gc-pages.c -o gc-pages.o
11.930814 ccache gcc -march=pentium4 -m32 -fasynchronous-unwind-tables -DJULIA_HAS_IFUNC_SUPPORT=1 -DJULIA_ENABLE_THREADING -DJULIA_NUM_THREADS=1 -std=gnu99 -pipe -fPIC -fno-strict-aliasing -D_FILE_OFFSET_BITS=64 -Wold-style-definition -Wstrict-prototypes -Wc++-compat -O3 -ggdb2 -falign-functions -momit-leaf-frame-pointer -D_GNU_SOURCE -I. -I/home/travis/build/JuliaLang/julia/src -I/home/travis/build/JuliaLang/julia/src/flisp -I/home/travis/build/JuliaLang/julia/src/support -I/home/travis/build/JuliaLang/julia/usr/include -I/home/travis/build/JuliaLang/julia/usr/include -DLIBRARY_EXPORTS -I/home/travis/build/JuliaLang/julia/deps/valgrind -Wall -Wno-strict-aliasing -fno-omit-frame-pointer -fvisibility=hidden -fno-common -Wpointer-arith -Wundef -DJL_BUILD_ARCH='"i686"' -DJL_BUILD_UNAME='"Linux"' -I/home/travis/build/JuliaLang/julia/usr/include -DLLVM_SHLIB "-DJL_SYSTEM_IMAGE_PATH=\"../lib/julia/sys.so\"" -c /home/travis/build/JuliaLang/julia/src/method.c -o method.o
12.051952 ccache gcc -march=pentium4 -m32 -fasynchronous-unwind-tables -DJULIA_HAS_IFUNC_SUPPORT=1 -DJULIA_ENABLE_THREADING -DJULIA_NUM_THREADS=1 -std=gnu99 -pipe -fPIC -fno-strict-aliasing -D_FILE_OFFSET_BITS=64 -Wold-style-definition -Wstrict-prototypes -Wc++-compat -O3 -ggdb2 -falign-functions -momit-leaf-frame-pointer -D_GNU_SOURCE -I. -I/home/travis/build/JuliaLang/julia/src -I/home/travis/build/JuliaLang/julia/src/flisp -I/home/travis/build/JuliaLang/julia/src/support -I/home/travis/build/JuliaLang/julia/usr/include -I/home/travis/build/JuliaLang/julia/usr/include -DLIBRARY_EXPORTS -I/home/travis/build/JuliaLang/julia/deps/valgrind -Wall -Wno-strict-aliasing -fno-omit-frame-pointer -fvisibility=hidden -fno-common -Wpointer-arith -Wundef -DJL_BUILD_ARCH='"i686"' -DJL_BUILD_UNAME='"Linux"' -I/home/travis/build/JuliaLang/julia/usr/include -DLLVM_SHLIB "-DJL_SYSTEM_IMAGE_PATH=\"../lib/julia/sys.so\"" -c /home/travis/build/JuliaLang/julia/src/jlapi.c -o jlapi.o
12.194817 ccache gcc -march=pentium4 -m32 -fasynchronous-unwind-tables -DJULIA_HAS_IFUNC_SUPPORT=1 -DJULIA_ENABLE_THREADING -DJULIA_NUM_THREADS=1 -std=gnu99 -pipe -fPIC -fno-strict-aliasing -D_FILE_OFFSET_BITS=64 -Wold-style-definition -Wstrict-prototypes -Wc++-compat -O3 -ggdb2 -falign-functions -momit-leaf-frame-pointer -D_GNU_SOURCE -I. -I/home/travis/build/JuliaLang/julia/src -I/home/travis/build/JuliaLang/julia/src/flisp -I/home/travis/build/JuliaLang/julia/src/support -I/home/travis/build/JuliaLang/julia/usr/include -I/home/travis/build/JuliaLang/julia/usr/include -DLIBRARY_EXPORTS -I/home/travis/build/JuliaLang/julia/deps/valgrind -Wall -Wno-strict-aliasing -fno-omit-frame-pointer -fvisibility=hidden -fno-common -Wpointer-arith -Wundef -DJL_BUILD_ARCH='"i686"' -DJL_BUILD_UNAME='"Linux"' -I/home/travis/build/JuliaLang/julia/usr/include -DLLVM_SHLIB "-DJL_SYSTEM_IMAGE_PATH=\"../lib/julia/sys.so\"" -c /home/travis/build/JuliaLang/julia/src/signal-handling.c -o signal-handling.o
12.366823 ccache gcc -march=pentium4 -m32 -fasynchronous-unwind-tables -DJULIA_HAS_IFUNC_SUPPORT=1 -DJULIA_ENABLE_THREADING -DJULIA_NUM_THREADS=1 -std=gnu99 -pipe -fPIC -fno-strict-aliasing -D_FILE_OFFSET_BITS=64 -Wold-style-definition -Wstrict-prototypes -Wc++-compat -O3 -ggdb2 -falign-functions -momit-leaf-frame-pointer -D_GNU_SOURCE -I. -I/home/travis/build/JuliaLang/julia/src -I/home/travis/build/JuliaLang/julia/src/flisp -I/home/travis/build/JuliaLang/julia/src/support -I/home/travis/build/JuliaLang/julia/usr/include -I/home/travis/build/JuliaLang/julia/usr/include -DLIBRARY_EXPORTS -I/home/travis/build/JuliaLang/julia/deps/valgrind -Wall -Wno-strict-aliasing -fno-omit-frame-pointer -fvisibility=hidden -fno-common -Wpointer-arith -Wundef -DJL_BUILD_ARCH='"i686"' -DJL_BUILD_UNAME='"Linux"' -I/home/travis/build/JuliaLang/julia/usr/include -DLLVM_SHLIB "-DJL_SYSTEM_IMAGE_PATH=\"../lib/julia/sys.so\"" -c /home/travis/build/JuliaLang/julia/src/safepoint.c -o safepoint.o
/home/travis/build/JuliaLang/julia/src/jlapi.c: In function ‘jl_init__threading’:
/home/travis/build/JuliaLang/julia/src/jlapi.c:73:9: warning: ignoring return value of ‘asprintf’, declared with attribute warn_unused_result [-Wunused-result]
(void)asprintf(&libbindir, "%s" PATHSEPSTRING ".." PATHSEPSTRING "%s", dirname(to_free), "bin");
^
13.002838 ccache gcc -march=pentium4 -m32 -fasynchronous-unwind-tables -DJULIA_HAS_IFUNC_SUPPORT=1 -DJULIA_ENABLE_THREADING -DJULIA_NUM_THREADS=1 -std=gnu99 -pipe -fPIC -fno-strict-aliasing -D_FILE_OFFSET_BITS=64 -Wold-style-definition -Wstrict-prototypes -Wc++-compat -O3 -ggdb2 -falign-functions -momit-leaf-frame-pointer -D_GNU_SOURCE -I. -I/home/travis/build/JuliaLang/julia/src -I/home/travis/build/JuliaLang/julia/src/flisp -I/home/travis/build/JuliaLang/julia/src/support -I/home/travis/build/JuliaLang/julia/usr/include -I/home/travis/build/JuliaLang/julia/usr/include -DLIBRARY_EXPORTS -I/home/travis/build/JuliaLang/julia/deps/valgrind -Wall -Wno-strict-aliasing -fno-omit-frame-pointer -fvisibility=hidden -fno-common -Wpointer-arith -Wundef -DJL_BUILD_ARCH='"i686"' -DJL_BUILD_UNAME='"Linux"' -I/home/travis/build/JuliaLang/julia/usr/include -DLLVM_SHLIB "-DJL_SYSTEM_IMAGE_PATH=\"../lib/julia/sys.so\"" -c /home/travis/build/JuliaLang/julia/src/jloptions.c -o jloptions.o
13.180446 ccache gcc -march=pentium4 -m32 -fasynchronous-unwind-tables -DJULIA_HAS_IFUNC_SUPPORT=1 -DJULIA_ENABLE_THREADING -DJULIA_NUM_THREADS=1 -std=gnu99 -pipe -fPIC -fno-strict-aliasing -D_FILE_OFFSET_BITS=64 -Wold-style-definition -Wstrict-prototypes -Wc++-compat -O3 -ggdb2 -falign-functions -momit-leaf-frame-pointer -D_GNU_SOURCE -I. -I/home/travis/build/JuliaLang/julia/src -I/home/travis/build/JuliaLang/julia/src/flisp -I/home/travis/build/JuliaLang/julia/src/support -I/home/travis/build/JuliaLang/julia/usr/include -I/home/travis/build/JuliaLang/julia/usr/include -DLIBRARY_EXPORTS -I/home/travis/build/JuliaLang/julia/deps/valgrind -Wall -Wno-strict-aliasing -fno-omit-frame-pointer -fvisibility=hidden -fno-common -Wpointer-arith -Wundef -DJL_BUILD_ARCH='"i686"' -DJL_BUILD_UNAME='"Linux"' -I/home/travis/build/JuliaLang/julia/usr/include -DLLVM_SHLIB "-DJL_SYSTEM_IMAGE_PATH=\"../lib/julia/sys.so\"" -c /home/travis/build/JuliaLang/julia/src/timing.c -o timing.o
13.262821 ccache gcc -march=pentium4 -m32 -fasynchronous-unwind-tables -DJULIA_HAS_IFUNC_SUPPORT=1 -DJULIA_ENABLE_THREADING -DJULIA_NUM_THREADS=1 -std=gnu99 -pipe -fPIC -fno-strict-aliasing -D_FILE_OFFSET_BITS=64 -Wold-style-definition -Wstrict-prototypes -Wc++-compat -O3 -ggdb2 -falign-functions -momit-leaf-frame-pointer -D_GNU_SOURCE -I. -I/home/travis/build/JuliaLang/julia/src -I/home/travis/build/JuliaLang/julia/src/flisp -I/home/travis/build/JuliaLang/julia/src/support -I/home/travis/build/JuliaLang/julia/usr/include -I/home/travis/build/JuliaLang/julia/usr/include -DLIBRARY_EXPORTS -I/home/travis/build/JuliaLang/julia/deps/valgrind -Wall -Wno-strict-aliasing -fno-omit-frame-pointer -fvisibility=hidden -fno-common -Wpointer-arith -Wundef -DJL_BUILD_ARCH='"i686"' -DJL_BUILD_UNAME='"Linux"' -I/home/travis/build/JuliaLang/julia/usr/include -DLLVM_SHLIB "-DJL_SYSTEM_IMAGE_PATH=\"../lib/julia/sys.so\"" -c /home/travis/build/JuliaLang/julia/src/subtype.c -o subtype.o
13.714841 ccache gcc -march=pentium4 -m32 -fasynchronous-unwind-tables -DJULIA_HAS_IFUNC_SUPPORT=1 -DJULIA_ENABLE_THREADING -DJULIA_NUM_THREADS=1 -std=gnu99 -pipe -fPIC -fno-strict-aliasing -D_FILE_OFFSET_BITS=64 -Wold-style-definition -Wstrict-prototypes -Wc++-compat -O3 -ggdb2 -falign-functions -momit-leaf-frame-pointer -D_GNU_SOURCE -I. -I/home/travis/build/JuliaLang/julia/src -I/home/travis/build/JuliaLang/julia/src/flisp -I/home/travis/build/JuliaLang/julia/src/support -I/home/travis/build/JuliaLang/julia/usr/include -I/home/travis/build/JuliaLang/julia/usr/include -DLIBRARY_EXPORTS -I/home/travis/build/JuliaLang/julia/deps/valgrind -Wall -Wno-strict-aliasing -fno-omit-frame-pointer -fvisibility=hidden -fno-common -Wpointer-arith -Wundef -DJL_BUILD_ARCH='"i686"' -DJL_BUILD_UNAME='"Linux"' -I/home/travis/build/JuliaLang/julia/usr/include -DLLVM_SHLIB "-DJL_SYSTEM_IMAGE_PATH=\"../lib/julia/sys.so\"" -c /home/travis/build/JuliaLang/julia/src/rtutils.c -o rtutils.o
13.870860 ccache gcc -march=pentium4 -m32 -fasynchronous-unwind-tables -DJULIA_HAS_IFUNC_SUPPORT=1 -DJULIA_ENABLE_THREADING -DJULIA_NUM_THREADS=1 -std=gnu99 -pipe -fPIC -fno-strict-aliasing -D_FILE_OFFSET_BITS=64 -Wold-style-definition -Wstrict-prototypes -Wc++-compat -O3 -ggdb2 -falign-functions -momit-leaf-frame-pointer -D_GNU_SOURCE -I. -I/home/travis/build/JuliaLang/julia/src -I/home/travis/build/JuliaLang/julia/src/flisp -I/home/travis/build/JuliaLang/julia/src/support -I/home/travis/build/JuliaLang/julia/usr/include -I/home/travis/build/JuliaLang/julia/usr/include -DLIBRARY_EXPORTS -I/home/travis/build/JuliaLang/julia/deps/valgrind -Wall -Wno-strict-aliasing -fno-omit-frame-pointer -fvisibility=hidden -fno-common -Wpointer-arith -Wundef -DJL_BUILD_ARCH='"i686"' -DJL_BUILD_UNAME='"Linux"' -I/home/travis/build/JuliaLang/julia/usr/include -DLLVM_SHLIB "-DJL_SYSTEM_IMAGE_PATH=\"../lib/julia/sys.so\"" -c /home/travis/build/JuliaLang/julia/src/crc32c.c -o crc32c.o
14.084337 ccache g++ -march=pentium4 -m32 -I/home/travis/build/JuliaLang/julia/usr/include -fPIC -fvisibility-inlines-hidden -Werror=date-time -std=c++11 -Wall -W -Wno-unused-parameter -Wwrite-strings -Wcast-qual -Wno-missing-field-initializers -pedantic -Wno-long-long -Wundef -Wno-maybe-uninitialized -Wdelete-non-virtual-dtor -Wno-comment -ffunction-sections -fdata-sections -O3 -fno-exceptions -fno-rtti -D_GNU_SOURCE -D_DEBUG -D_LARGEFILE_SOURCE -D_FILE_OFFSET_BITS=64 -D__STDC_CONSTANT_MACROS -D__STDC_FORMAT_MACROS -D__STDC_LIMIT_MACROS -fasynchronous-unwind-tables -DJULIA_HAS_IFUNC_SUPPORT=1 -DJULIA_ENABLE_THREADING -DJULIA_NUM_THREADS=1 -pipe -fPIC -fno-rtti -pedantic -D_FILE_OFFSET_BITS=64 -O3 -ggdb2 -falign-functions -momit-leaf-frame-pointer -D_GNU_SOURCE -I. -I/home/travis/build/JuliaLang/julia/src -I/home/travis/build/JuliaLang/julia/src/flisp -I/home/travis/build/JuliaLang/julia/src/support -I/home/travis/build/JuliaLang/julia/usr/include -I/home/travis/build/JuliaLang/julia/usr/include -DLIBRARY_EXPORTS -I/home/travis/build/JuliaLang/julia/deps/valgrind -Wall -Wno-strict-aliasing -fno-omit-frame-pointer -fvisibility=hidden -fno-common -Wpointer-arith -Wundef -DJL_BUILD_ARCH='"i686"' -DJL_BUILD_UNAME='"Linux"' -I/home/travis/build/JuliaLang/julia/usr/include -DLLVM_SHLIB "-DJL_SYSTEM_IMAGE_PATH=\"../lib/julia/sys.so\"" -c /home/travis/build/JuliaLang/julia/src/processor.cpp -o processor.o
14.689086 ccache g++ -march=pentium4 -m32 -I/home/travis/build/JuliaLang/julia/usr/include -fPIC -fvisibility-inlines-hidden -Werror=date-time -std=c++11 -Wall -W -Wno-unused-parameter -Wwrite-strings -Wcast-qual -Wno-missing-field-initializers -pedantic -Wno-long-long -Wundef -Wno-maybe-uninitialized -Wdelete-non-virtual-dtor -Wno-comment -ffunction-sections -fdata-sections -O3 -fno-exceptions -fno-rtti -D_GNU_SOURCE -D_DEBUG -D_LARGEFILE_SOURCE -D_FILE_OFFSET_BITS=64 -D__STDC_CONSTANT_MACROS -D__STDC_FORMAT_MACROS -D__STDC_LIMIT_MACROS -fasynchronous-unwind-tables -DJULIA_HAS_IFUNC_SUPPORT=1 -DJULIA_ENABLE_THREADING -DJULIA_NUM_THREADS=1 -pipe -fPIC -fno-rtti -pedantic -D_FILE_OFFSET_BITS=64 -O3 -ggdb2 -falign-functions -momit-leaf-frame-pointer -D_GNU_SOURCE -I. -I/home/travis/build/JuliaLang/julia/src -I/home/travis/build/JuliaLang/julia/src/flisp -I/home/travis/build/JuliaLang/julia/src/support -I/home/travis/build/JuliaLang/julia/usr/include -I/home/travis/build/JuliaLang/julia/usr/include -DLIBRARY_EXPORTS -I/home/travis/build/JuliaLang/julia/deps/valgrind -Wall -Wno-strict-aliasing -fno-omit-frame-pointer -fvisibility=hidden -fno-common -Wpointer-arith -Wundef -DJL_BUILD_ARCH='"i686"' -DJL_BUILD_UNAME='"Linux"' -I/home/travis/build/JuliaLang/julia/usr/include -DLLVM_SHLIB "-DJL_SYSTEM_IMAGE_PATH=\"../lib/julia/sys.so\"" -c /home/travis/build/JuliaLang/julia/src/codegen.cpp -o codegen.o
14.702741 ccache g++ -march=pentium4 -m32 -I/home/travis/build/JuliaLang/julia/usr/include -fPIC -fvisibility-inlines-hidden -Werror=date-time -std=c++11 -Wall -W -Wno-unused-parameter -Wwrite-strings -Wcast-qual -Wno-missing-field-initializers -pedantic -Wno-long-long -Wundef -Wno-maybe-uninitialized -Wdelete-non-virtual-dtor -Wno-comment -ffunction-sections -fdata-sections -O3 -fno-exceptions -fno-rtti -D_GNU_SOURCE -D_DEBUG -D_LARGEFILE_SOURCE -D_FILE_OFFSET_BITS=64 -D__STDC_CONSTANT_MACROS -D__STDC_FORMAT_MACROS -D__STDC_LIMIT_MACROS -fasynchronous-unwind-tables -DJULIA_HAS_IFUNC_SUPPORT=1 -DJULIA_ENABLE_THREADING -DJULIA_NUM_THREADS=1 -pipe -fPIC -fno-rtti -pedantic -D_FILE_OFFSET_BITS=64 -O3 -ggdb2 -falign-functions -momit-leaf-frame-pointer -D_GNU_SOURCE -I. -I/home/travis/build/JuliaLang/julia/src -I/home/travis/build/JuliaLang/julia/src/flisp -I/home/travis/build/JuliaLang/julia/src/support -I/home/travis/build/JuliaLang/julia/usr/include -I/home/travis/build/JuliaLang/julia/usr/include -DLIBRARY_EXPORTS -I/home/travis/build/JuliaLang/julia/deps/valgrind -Wall -Wno-strict-aliasing -fno-omit-frame-pointer -fvisibility=hidden -fno-common -Wpointer-arith -Wundef -DJL_BUILD_ARCH='"i686"' -DJL_BUILD_UNAME='"Linux"' -I/home/travis/build/JuliaLang/julia/usr/include -DLLVM_SHLIB "-DJL_SYSTEM_IMAGE_PATH=\"../lib/julia/sys.so\"" -c /home/travis/build/JuliaLang/julia/src/jitlayers.cpp -o jitlayers.o
15.727821 ccache g++ -march=pentium4 -m32 -I/home/travis/build/JuliaLang/julia/usr/include -fPIC -fvisibility-inlines-hidden -Werror=date-time -std=c++11 -Wall -W -Wno-unused-parameter -Wwrite-strings -Wcast-qual -Wno-missing-field-initializers -pedantic -Wno-long-long -Wundef -Wno-maybe-uninitialized -Wdelete-non-virtual-dtor -Wno-comment -ffunction-sections -fdata-sections -O3 -fno-exceptions -fno-rtti -D_GNU_SOURCE -D_DEBUG -D_LARGEFILE_SOURCE -D_FILE_OFFSET_BITS=64 -D__STDC_CONSTANT_MACROS -D__STDC_FORMAT_MACROS -D__STDC_LIMIT_MACROS -fasynchronous-unwind-tables -DJULIA_HAS_IFUNC_SUPPORT=1 -DJULIA_ENABLE_THREADING -DJULIA_NUM_THREADS=1 -pipe -fPIC -fno-rtti -pedantic -D_FILE_OFFSET_BITS=64 -O3 -ggdb2 -falign-functions -momit-leaf-frame-pointer -D_GNU_SOURCE -I. -I/home/travis/build/JuliaLang/julia/src -I/home/travis/build/JuliaLang/julia/src/flisp -I/home/travis/build/JuliaLang/julia/src/support -I/home/travis/build/JuliaLang/julia/usr/include -I/home/travis/build/JuliaLang/julia/usr/include -DLIBRARY_EXPORTS -I/home/travis/build/JuliaLang/julia/deps/valgrind -Wall -Wno-strict-aliasing -fno-omit-frame-pointer -fvisibility=hidden -fno-common -Wpointer-arith -Wundef -DJL_BUILD_ARCH='"i686"' -DJL_BUILD_UNAME='"Linux"' -I/home/travis/build/JuliaLang/julia/usr/include -DLLVM_SHLIB "-DJL_SYSTEM_IMAGE_PATH=\"../lib/julia/sys.so\"" -c /home/travis/build/JuliaLang/julia/src/disasm.cpp -o disasm.o
17.753939 ccache g++ -march=pentium4 -m32 -I/home/travis/build/JuliaLang/julia/usr/include -fPIC -fvisibility-inlines-hidden -Werror=date-time -std=c++11 -Wall -W -Wno-unused-parameter -Wwrite-strings -Wcast-qual -Wno-missing-field-initializers -pedantic -Wno-long-long -Wundef -Wno-maybe-uninitialized -Wdelete-non-virtual-dtor -Wno-comment -ffunction-sections -fdata-sections -O3 -fno-exceptions -fno-rtti -D_GNU_SOURCE -D_DEBUG -D_LARGEFILE_SOURCE -D_FILE_OFFSET_BITS=64 -D__STDC_CONSTANT_MACROS -D__STDC_FORMAT_MACROS -D__STDC_LIMIT_MACROS -fasynchronous-unwind-tables -DJULIA_HAS_IFUNC_SUPPORT=1 -DJULIA_ENABLE_THREADING -DJULIA_NUM_THREADS=1 -pipe -fPIC -fno-rtti -pedantic -D_FILE_OFFSET_BITS=64 -O3 -ggdb2 -falign-functions -momit-leaf-frame-pointer -D_GNU_SOURCE -I. -I/home/travis/build/JuliaLang/julia/src -I/home/travis/build/JuliaLang/julia/src/flisp -I/home/travis/build/JuliaLang/julia/src/support -I/home/travis/build/JuliaLang/julia/usr/include -I/home/travis/build/JuliaLang/julia/usr/include -DLIBRARY_EXPORTS -I/home/travis/build/JuliaLang/julia/deps/valgrind -Wall -Wno-strict-aliasing -fno-omit-frame-pointer -fvisibility=hidden -fno-common -Wpointer-arith -Wundef -DJL_BUILD_ARCH='"i686"' -DJL_BUILD_UNAME='"Linux"' -I/home/travis/build/JuliaLang/julia/usr/include -DLLVM_SHLIB "-DJL_SYSTEM_IMAGE_PATH=\"../lib/julia/sys.so\"" -c /home/travis/build/JuliaLang/julia/src/debuginfo.cpp -o debuginfo.o
18.814873 ccache g++ -march=pentium4 -m32 -I/home/travis/build/JuliaLang/julia/usr/include -fPIC -fvisibility-inlines-hidden -Werror=date-time -std=c++11 -Wall -W -Wno-unused-parameter -Wwrite-strings -Wcast-qual -Wno-missing-field-initializers -pedantic -Wno-long-long -Wundef -Wno-maybe-uninitialized -Wdelete-non-virtual-dtor -Wno-comment -ffunction-sections -fdata-sections -O3 -fno-exceptions -fno-rtti -D_GNU_SOURCE -D_DEBUG -D_LARGEFILE_SOURCE -D_FILE_OFFSET_BITS=64 -D__STDC_CONSTANT_MACROS -D__STDC_FORMAT_MACROS -D__STDC_LIMIT_MACROS -fasynchronous-unwind-tables -DJULIA_HAS_IFUNC_SUPPORT=1 -DJULIA_ENABLE_THREADING -DJULIA_NUM_THREADS=1 -pipe -fPIC -fno-rtti -pedantic -D_FILE_OFFSET_BITS=64 -O3 -ggdb2 -falign-functions -momit-leaf-frame-pointer -D_GNU_SOURCE -I. -I/home/travis/build/JuliaLang/julia/src -I/home/travis/build/JuliaLang/julia/src/flisp -I/home/travis/build/JuliaLang/julia/src/support -I/home/travis/build/JuliaLang/julia/usr/include -I/home/travis/build/JuliaLang/julia/usr/include -DLIBRARY_EXPORTS -I/home/travis/build/JuliaLang/julia/deps/valgrind -Wall -Wno-strict-aliasing -fno-omit-frame-pointer -fvisibility=hidden -fno-common -Wpointer-arith -Wundef -DJL_BUILD_ARCH='"i686"' -DJL_BUILD_UNAME='"Linux"' -I/home/travis/build/JuliaLang/julia/usr/include -DLLVM_SHLIB "-DJL_SYSTEM_IMAGE_PATH=\"../lib/julia/sys.so\"" -c /home/travis/build/JuliaLang/julia/src/llvm-simdloop.cpp -o llvm-simdloop.o
23.297159 ccache g++ -march=pentium4 -m32 -I/home/travis/build/JuliaLang/julia/usr/include -fPIC -fvisibility-inlines-hidden -Werror=date-time -std=c++11 -Wall -W -Wno-unused-parameter -Wwrite-strings -Wcast-qual -Wno-missing-field-initializers -pedantic -Wno-long-long -Wundef -Wno-maybe-uninitialized -Wdelete-non-virtual-dtor -Wno-comment -ffunction-sections -fdata-sections -O3 -fno-exceptions -fno-rtti -D_GNU_SOURCE -D_DEBUG -D_LARGEFILE_SOURCE -D_FILE_OFFSET_BITS=64 -D__STDC_CONSTANT_MACROS -D__STDC_FORMAT_MACROS -D__STDC_LIMIT_MACROS -fasynchronous-unwind-tables -DJULIA_HAS_IFUNC_SUPPORT=1 -DJULIA_ENABLE_THREADING -DJULIA_NUM_THREADS=1 -pipe -fPIC -fno-rtti -pedantic -D_FILE_OFFSET_BITS=64 -O3 -ggdb2 -falign-functions -momit-leaf-frame-pointer -D_GNU_SOURCE -I. -I/home/travis/build/JuliaLang/julia/src -I/home/travis/build/JuliaLang/julia/src/flisp -I/home/travis/build/JuliaLang/julia/src/support -I/home/travis/build/JuliaLang/julia/usr/include -I/home/travis/build/JuliaLang/julia/usr/include -DLIBRARY_EXPORTS -I/home/travis/build/JuliaLang/julia/deps/valgrind -Wall -Wno-strict-aliasing -fno-omit-frame-pointer -fvisibility=hidden -fno-common -Wpointer-arith -Wundef -DJL_BUILD_ARCH='"i686"' -DJL_BUILD_UNAME='"Linux"' -I/home/travis/build/JuliaLang/julia/usr/include -DLLVM_SHLIB "-DJL_SYSTEM_IMAGE_PATH=\"../lib/julia/sys.so\"" -c /home/travis/build/JuliaLang/julia/src/llvm-ptls.cpp -o llvm-ptls.o
28.526871 ccache g++ -march=pentium4 -m32 -I/home/travis/build/JuliaLang/julia/usr/include -fPIC -fvisibility-inlines-hidden -Werror=date-time -std=c++11 -Wall -W -Wno-unused-parameter -Wwrite-strings -Wcast-qual -Wno-missing-field-initializers -pedantic -Wno-long-long -Wundef -Wno-maybe-uninitialized -Wdelete-non-virtual-dtor -Wno-comment -ffunction-sections -fdata-sections -O3 -fno-exceptions -fno-rtti -D_GNU_SOURCE -D_DEBUG -D_LARGEFILE_SOURCE -D_FILE_OFFSET_BITS=64 -D__STDC_CONSTANT_MACROS -D__STDC_FORMAT_MACROS -D__STDC_LIMIT_MACROS -fasynchronous-unwind-tables -DJULIA_HAS_IFUNC_SUPPORT=1 -DJULIA_ENABLE_THREADING -DJULIA_NUM_THREADS=1 -pipe -fPIC -fno-rtti -pedantic -D_FILE_OFFSET_BITS=64 -O3 -ggdb2 -falign-functions -momit-leaf-frame-pointer -D_GNU_SOURCE -I. -I/home/travis/build/JuliaLang/julia/src -I/home/travis/build/JuliaLang/julia/src/flisp -I/home/travis/build/JuliaLang/julia/src/support -I/home/travis/build/JuliaLang/julia/usr/include -I/home/travis/build/JuliaLang/julia/usr/include -DLIBRARY_EXPORTS -I/home/travis/build/JuliaLang/julia/deps/valgrind -Wall -Wno-strict-aliasing -fno-omit-frame-pointer -fvisibility=hidden -fno-common -Wpointer-arith -Wundef -DJL_BUILD_ARCH='"i686"' -DJL_BUILD_UNAME='"Linux"' -I/home/travis/build/JuliaLang/julia/usr/include -DLLVM_SHLIB "-DJL_SYSTEM_IMAGE_PATH=\"../lib/julia/sys.so\"" -c /home/travis/build/JuliaLang/julia/src/llvm-muladd.cpp -o llvm-muladd.o
29.703334 ccache g++ -march=pentium4 -m32 -I/home/travis/build/JuliaLang/julia/usr/include -fPIC -fvisibility-inlines-hidden -Werror=date-time -std=c++11 -Wall -W -Wno-unused-parameter -Wwrite-strings -Wcast-qual -Wno-missing-field-initializers -pedantic -Wno-long-long -Wundef -Wno-maybe-uninitialized -Wdelete-non-virtual-dtor -Wno-comment -ffunction-sections -fdata-sections -O3 -fno-exceptions -fno-rtti -D_GNU_SOURCE -D_DEBUG -D_LARGEFILE_SOURCE -D_FILE_OFFSET_BITS=64 -D__STDC_CONSTANT_MACROS -D__STDC_FORMAT_MACROS -D__STDC_LIMIT_MACROS -fasynchronous-unwind-tables -DJULIA_HAS_IFUNC_SUPPORT=1 -DJULIA_ENABLE_THREADING -DJULIA_NUM_THREADS=1 -pipe -fPIC -fno-rtti -pedantic -D_FILE_OFFSET_BITS=64 -O3 -ggdb2 -falign-functions -momit-leaf-frame-pointer -D_GNU_SOURCE -I. -I/home/travis/build/JuliaLang/julia/src -I/home/travis/build/JuliaLang/julia/src/flisp -I/home/travis/build/JuliaLang/julia/src/support -I/home/travis/build/JuliaLang/julia/usr/include -I/home/travis/build/JuliaLang/julia/usr/include -DLIBRARY_EXPORTS -I/home/travis/build/JuliaLang/julia/deps/valgrind -Wall -Wno-strict-aliasing -fno-omit-frame-pointer -fvisibility=hidden -fno-common -Wpointer-arith -Wundef -DJL_BUILD_ARCH='"i686"' -DJL_BUILD_UNAME='"Linux"' -I/home/travis/build/JuliaLang/julia/usr/include -DLLVM_SHLIB "-DJL_SYSTEM_IMAGE_PATH=\"../lib/julia/sys.so\"" -c /home/travis/build/JuliaLang/julia/src/llvm-late-gc-lowering.cpp -o llvm-late-gc-lowering.o
29.970867 ccache g++ -march=pentium4 -m32 -I/home/travis/build/JuliaLang/julia/usr/include -fPIC -fvisibility-inlines-hidden -Werror=date-time -std=c++11 -Wall -W -Wno-unused-parameter -Wwrite-strings -Wcast-qual -Wno-missing-field-initializers -pedantic -Wno-long-long -Wundef -Wno-maybe-uninitialized -Wdelete-non-virtual-dtor -Wno-comment -ffunction-sections -fdata-sections -O3 -fno-exceptions -fno-rtti -D_GNU_SOURCE -D_DEBUG -D_LARGEFILE_SOURCE -D_FILE_OFFSET_BITS=64 -D__STDC_CONSTANT_MACROS -D__STDC_FORMAT_MACROS -D__STDC_LIMIT_MACROS -fasynchronous-unwind-tables -DJULIA_HAS_IFUNC_SUPPORT=1 -DJULIA_ENABLE_THREADING -DJULIA_NUM_THREADS=1 -pipe -fPIC -fno-rtti -pedantic -D_FILE_OFFSET_BITS=64 -O3 -ggdb2 -falign-functions -momit-leaf-frame-pointer -D_GNU_SOURCE -I. -I/home/travis/build/JuliaLang/julia/src -I/home/travis/build/JuliaLang/julia/src/flisp -I/home/travis/build/JuliaLang/julia/src/support -I/home/travis/build/JuliaLang/julia/usr/include -I/home/travis/build/JuliaLang/julia/usr/include -DLIBRARY_EXPORTS -I/home/travis/build/JuliaLang/julia/deps/valgrind -Wall -Wno-strict-aliasing -fno-omit-frame-pointer -fvisibility=hidden -fno-common -Wpointer-arith -Wundef -DJL_BUILD_ARCH='"i686"' -DJL_BUILD_UNAME='"Linux"' -I/home/travis/build/JuliaLang/julia/usr/include -DLLVM_SHLIB "-DJL_SYSTEM_IMAGE_PATH=\"../lib/julia/sys.so\"" -c /home/travis/build/JuliaLang/julia/src/llvm-lower-handlers.cpp -o llvm-lower-handlers.o
31.761721 ccache g++ -march=pentium4 -m32 -I/home/travis/build/JuliaLang/julia/usr/include -fPIC -fvisibility-inlines-hidden -Werror=date-time -std=c++11 -Wall -W -Wno-unused-parameter -Wwrite-strings -Wcast-qual -Wno-missing-field-initializers -pedantic -Wno-long-long -Wundef -Wno-maybe-uninitialized -Wdelete-non-virtual-dtor -Wno-comment -ffunction-sections -fdata-sections -O3 -fno-exceptions -fno-rtti -D_GNU_SOURCE -D_DEBUG -D_LARGEFILE_SOURCE -D_FILE_OFFSET_BITS=64 -D__STDC_CONSTANT_MACROS -D__STDC_FORMAT_MACROS -D__STDC_LIMIT_MACROS -fasynchronous-unwind-tables -DJULIA_HAS_IFUNC_SUPPORT=1 -DJULIA_ENABLE_THREADING -DJULIA_NUM_THREADS=1 -pipe -fPIC -fno-rtti -pedantic -D_FILE_OFFSET_BITS=64 -O3 -ggdb2 -falign-functions -momit-leaf-frame-pointer -D_GNU_SOURCE -I. -I/home/travis/build/JuliaLang/julia/src -I/home/travis/build/JuliaLang/julia/src/flisp -I/home/travis/build/JuliaLang/julia/src/support -I/home/travis/build/JuliaLang/julia/usr/include -I/home/travis/build/JuliaLang/julia/usr/include -DLIBRARY_EXPORTS -I/home/travis/build/JuliaLang/julia/deps/valgrind -Wall -Wno-strict-aliasing -fno-omit-frame-pointer -fvisibility=hidden -fno-common -Wpointer-arith -Wundef -DJL_BUILD_ARCH='"i686"' -DJL_BUILD_UNAME='"Linux"' -I/home/travis/build/JuliaLang/julia/usr/include -DLLVM_SHLIB "-DJL_SYSTEM_IMAGE_PATH=\"../lib/julia/sys.so\"" -c /home/travis/build/JuliaLang/julia/src/llvm-gc-invariant-verifier.cpp -o llvm-gc-invariant-verifier.o
33.838885 ccache g++ -march=pentium4 -m32 -I/home/travis/build/JuliaLang/julia/usr/include -fPIC -fvisibility-inlines-hidden -Werror=date-time -std=c++11 -Wall -W -Wno-unused-parameter -Wwrite-strings -Wcast-qual -Wno-missing-field-initializers -pedantic -Wno-long-long -Wundef -Wno-maybe-uninitialized -Wdelete-non-virtual-dtor -Wno-comment -ffunction-sections -fdata-sections -O3 -fno-exceptions -fno-rtti -D_GNU_SOURCE -D_DEBUG -D_LARGEFILE_SOURCE -D_FILE_OFFSET_BITS=64 -D__STDC_CONSTANT_MACROS -D__STDC_FORMAT_MACROS -D__STDC_LIMIT_MACROS -fasynchronous-unwind-tables -DJULIA_HAS_IFUNC_SUPPORT=1 -DJULIA_ENABLE_THREADING -DJULIA_NUM_THREADS=1 -pipe -fPIC -fno-rtti -pedantic -D_FILE_OFFSET_BITS=64 -O3 -ggdb2 -falign-functions -momit-leaf-frame-pointer -D_GNU_SOURCE -I. -I/home/travis/build/JuliaLang/julia/src -I/home/travis/build/JuliaLang/julia/src/flisp -I/home/travis/build/JuliaLang/julia/src/support -I/home/travis/build/JuliaLang/julia/usr/include -I/home/travis/build/JuliaLang/julia/usr/include -DLIBRARY_EXPORTS -I/home/travis/build/JuliaLang/julia/deps/valgrind -Wall -Wno-strict-aliasing -fno-omit-frame-pointer -fvisibility=hidden -fno-common -Wpointer-arith -Wundef -DJL_BUILD_ARCH='"i686"' -DJL_BUILD_UNAME='"Linux"' -I/home/travis/build/JuliaLang/julia/usr/include -DLLVM_SHLIB "-DJL_SYSTEM_IMAGE_PATH=\"../lib/julia/sys.so\"" -c /home/travis/build/JuliaLang/julia/src/llvm-propagate-addrspaces.cpp -o llvm-propagate-addrspaces.o
36.878968 ccache g++ -march=pentium4 -m32 -I/home/travis/build/JuliaLang/julia/usr/include -fPIC -fvisibility-inlines-hidden -Werror=date-time -std=c++11 -Wall -W -Wno-unused-parameter -Wwrite-strings -Wcast-qual -Wno-missing-field-initializers -pedantic -Wno-long-long -Wundef -Wno-maybe-uninitialized -Wdelete-non-virtual-dtor -Wno-comment -ffunction-sections -fdata-sections -O3 -fno-exceptions -fno-rtti -D_GNU_SOURCE -D_DEBUG -D_LARGEFILE_SOURCE -D_FILE_OFFSET_BITS=64 -D__STDC_CONSTANT_MACROS -D__STDC_FORMAT_MACROS -D__STDC_LIMIT_MACROS -fasynchronous-unwind-tables -DJULIA_HAS_IFUNC_SUPPORT=1 -DJULIA_ENABLE_THREADING -DJULIA_NUM_THREADS=1 -pipe -fPIC -fno-rtti -pedantic -D_FILE_OFFSET_BITS=64 -O3 -ggdb2 -falign-functions -momit-leaf-frame-pointer -D_GNU_SOURCE -I. -I/home/travis/build/JuliaLang/julia/src -I/home/travis/build/JuliaLang/julia/src/flisp -I/home/travis/build/JuliaLang/julia/src/support -I/home/travis/build/JuliaLang/julia/usr/include -I/home/travis/build/JuliaLang/julia/usr/include -DLIBRARY_EXPORTS -I/home/travis/build/JuliaLang/julia/deps/valgrind -Wall -Wno-strict-aliasing -fno-omit-frame-pointer -fvisibility=hidden -fno-common -Wpointer-arith -Wundef -DJL_BUILD_ARCH='"i686"' -DJL_BUILD_UNAME='"Linux"' -I/home/travis/build/JuliaLang/julia/usr/include -DLLVM_SHLIB "-DJL_SYSTEM_IMAGE_PATH=\"../lib/julia/sys.so\"" -c /home/travis/build/JuliaLang/julia/src/llvm-multiversioning.cpp -o llvm-multiversioning.o
38.512692 ccache g++ -march=pentium4 -m32 -I/home/travis/build/JuliaLang/julia/usr/include -fPIC -fvisibility-inlines-hidden -Werror=date-time -std=c++11 -Wall -W -Wno-unused-parameter -Wwrite-strings -Wcast-qual -Wno-missing-field-initializers -pedantic -Wno-long-long -Wundef -Wno-maybe-uninitialized -Wdelete-non-virtual-dtor -Wno-comment -ffunction-sections -fdata-sections -O3 -fno-exceptions -fno-rtti -D_GNU_SOURCE -D_DEBUG -D_LARGEFILE_SOURCE -D_FILE_OFFSET_BITS=64 -D__STDC_CONSTANT_MACROS -D__STDC_FORMAT_MACROS -D__STDC_LIMIT_MACROS -fasynchronous-unwind-tables -DJULIA_HAS_IFUNC_SUPPORT=1 -DJULIA_ENABLE_THREADING -DJULIA_NUM_THREADS=1 -pipe -fPIC -fno-rtti -pedantic -D_FILE_OFFSET_BITS=64 -O3 -ggdb2 -falign-functions -momit-leaf-frame-pointer -D_GNU_SOURCE -I. -I/home/travis/build/JuliaLang/julia/src -I/home/travis/build/JuliaLang/julia/src/flisp -I/home/travis/build/JuliaLang/julia/src/support -I/home/travis/build/JuliaLang/julia/usr/include -I/home/travis/build/JuliaLang/julia/usr/include -DLIBRARY_EXPORTS -I/home/travis/build/JuliaLang/julia/deps/valgrind -Wall -Wno-strict-aliasing -fno-omit-frame-pointer -fvisibility=hidden -fno-common -Wpointer-arith -Wundef -DJL_BUILD_ARCH='"i686"' -DJL_BUILD_UNAME='"Linux"' -I/home/travis/build/JuliaLang/julia/usr/include -DLLVM_SHLIB "-DJL_SYSTEM_IMAGE_PATH=\"../lib/julia/sys.so\"" -c /home/travis/build/JuliaLang/julia/src/llvm-alloc-opt.cpp -o llvm-alloc-opt.o
44.174843 ccache g++ -march=pentium4 -m32 -I/home/travis/build/JuliaLang/julia/usr/include -fPIC -fvisibility-inlines-hidden -Werror=date-time -std=c++11 -Wall -W -Wno-unused-parameter -Wwrite-strings -Wcast-qual -Wno-missing-field-initializers -pedantic -Wno-long-long -Wundef -Wno-maybe-uninitialized -Wdelete-non-virtual-dtor -Wno-comment -ffunction-sections -fdata-sections -O3 -fno-exceptions -fno-rtti -D_GNU_SOURCE -D_DEBUG -D_LARGEFILE_SOURCE -D_FILE_OFFSET_BITS=64 -D__STDC_CONSTANT_MACROS -D__STDC_FORMAT_MACROS -D__STDC_LIMIT_MACROS -fasynchronous-unwind-tables -DJULIA_HAS_IFUNC_SUPPORT=1 -DJULIA_ENABLE_THREADING -DJULIA_NUM_THREADS=1 -pipe -fPIC -fno-rtti -pedantic -D_FILE_OFFSET_BITS=64 -O3 -ggdb2 -falign-functions -momit-leaf-frame-pointer -D_GNU_SOURCE -I. -I/home/travis/build/JuliaLang/julia/src -I/home/travis/build/JuliaLang/julia/src/flisp -I/home/travis/build/JuliaLang/julia/src/support -I/home/travis/build/JuliaLang/julia/usr/include -I/home/travis/build/JuliaLang/julia/usr/include -DLIBRARY_EXPORTS -I/home/travis/build/JuliaLang/julia/deps/valgrind -Wall -Wno-strict-aliasing -fno-omit-frame-pointer -fvisibility=hidden -fno-common -Wpointer-arith -Wundef -DJL_BUILD_ARCH='"i686"' -DJL_BUILD_UNAME='"Linux"' -I/home/travis/build/JuliaLang/julia/usr/include -DLLVM_SHLIB "-DJL_SYSTEM_IMAGE_PATH=\"../lib/julia/sys.so\"" -c /home/travis/build/JuliaLang/julia/src/cgmemmgr.cpp -o cgmemmgr.o
45.054994 ccache g++ -march=pentium4 -m32 -I/home/travis/build/JuliaLang/julia/usr/include -fPIC -fvisibility-inlines-hidden -Werror=date-time -std=c++11 -Wall -W -Wno-unused-parameter -Wwrite-strings -Wcast-qual -Wno-missing-field-initializers -pedantic -Wno-long-long -Wundef -Wno-maybe-uninitialized -Wdelete-non-virtual-dtor -Wno-comment -ffunction-sections -fdata-sections -O3 -fno-exceptions -fno-rtti -D_GNU_SOURCE -D_DEBUG -D_LARGEFILE_SOURCE -D_FILE_OFFSET_BITS=64 -D__STDC_CONSTANT_MACROS -D__STDC_FORMAT_MACROS -D__STDC_LIMIT_MACROS -fasynchronous-unwind-tables -DJULIA_HAS_IFUNC_SUPPORT=1 -DJULIA_ENABLE_THREADING -DJULIA_NUM_THREADS=1 -pipe -fPIC -fno-rtti -pedantic -D_FILE_OFFSET_BITS=64 -O3 -ggdb2 -falign-functions -momit-leaf-frame-pointer -D_GNU_SOURCE -I. -I/home/travis/build/JuliaLang/julia/src -I/home/travis/build/JuliaLang/julia/src/flisp -I/home/travis/build/JuliaLang/julia/src/support -I/home/travis/build/JuliaLang/julia/usr/include -I/home/travis/build/JuliaLang/julia/usr/include -DLIBRARY_EXPORTS -I/home/travis/build/JuliaLang/julia/deps/valgrind -Wall -Wno-strict-aliasing -fno-omit-frame-pointer -fvisibility=hidden -fno-common -Wpointer-arith -Wundef -DJL_BUILD_ARCH='"i686"' -DJL_BUILD_UNAME='"Linux"' -I/home/travis/build/JuliaLang/julia/usr/include -DLLVM_SHLIB "-DJL_SYSTEM_IMAGE_PATH=\"../lib/julia/sys.so\"" -c /home/travis/build/JuliaLang/julia/src/llvm-api.cpp -o llvm-api.o
48.167893 /home/travis/build/JuliaLang/julia/contrib/install.sh 644 julia_version.h /home/travis/build/JuliaLang/julia/usr/include/julia/
48.216172 /home/travis/build/JuliaLang/julia/contrib/install.sh 644 /home/travis/build/JuliaLang/julia/usr/include/uv/errno.h /home/travis/build/JuliaLang/julia/usr/include/uv/linux.h /home/travis/build/JuliaLang/julia/usr/include/uv/threadpool.h /home/travis/build/JuliaLang/julia/usr/include/uv/unix.h /home/travis/build/JuliaLang/julia/usr/include/uv/version.h /home/travis/build/JuliaLang/julia/usr/include/julia/uv
/home/travis/build/JuliaLang/julia/src/codegen.cpp: In function ‘bool emit_builtin_call(jl_codectx_t&, jl_cgval_t*, jl_value_t*, const jl_cgval_t*, size_t, jl_value_t*, jl_expr_t*)’:
/home/travis/build/JuliaLang/julia/src/codegen.cpp:2743:32: warning: comparison between signed and unsigned integer expressions [-Wsign-compare]
if (i > 0 && i <= jl_datatype_nfields(uty))
^
/home/travis/build/JuliaLang/julia/src/codegen.cpp:2912:38: warning: comparison between signed and unsigned integer expressions [-Wsign-compare]
if (fieldidx < 0 || fieldidx >= jl_datatype_nfields(stt)) {
^
/home/travis/build/JuliaLang/julia/src/codegen.cpp: In function ‘llvm::Value* global_binding_pointer(jl_codectx_t&, jl_module_t*, jl_sym_t*, jl_binding_t**, bool)’:
/home/travis/build/JuliaLang/julia/src/codegen.cpp:3195:99: warning: ignoring return value of ‘int asprintf(char**, const char*, ...)’, declared with attribute warn_unused_result [-Wunused-result]
/home/travis/build/JuliaLang/julia/src/codegen.cpp: In function ‘jl_llvm_functions_t jl_compile_linfo(jl_method_instance_t**, jl_code_info_t*, size_t, const jl_cgparams_t*)’:
/home/travis/build/JuliaLang/julia/src/codegen.cpp:1091:27: warning: variable ‘li’ might be clobbered by ‘longjmp’ or ‘vfork’ [-Wclobbered]
jl_method_instance_t *li = *pli;
^
54.588702 ccache g++ -march=pentium4 -m32 -shared -pipe -fPIC -fno-rtti -pedantic -D_FILE_OFFSET_BITS=64 -O3 -ggdb2 -falign-functions -momit-leaf-frame-pointer -D_GNU_SOURCE -I. -I/home/travis/build/JuliaLang/julia/src -I/home/travis/build/JuliaLang/julia/src/flisp -I/home/travis/build/JuliaLang/julia/src/support -I/home/travis/build/JuliaLang/julia/usr/include -I/home/travis/build/JuliaLang/julia/usr/include -DLIBRARY_EXPORTS -I/home/travis/build/JuliaLang/julia/deps/valgrind -Wall -Wno-strict-aliasing -fno-omit-frame-pointer -fvisibility=hidden -fno-common -Wpointer-arith -Wundef -DJL_BUILD_ARCH='"i686"' -DJL_BUILD_UNAME='"Linux"' -I/home/travis/build/JuliaLang/julia/usr/include -DLLVM_SHLIB "-DJL_SYSTEM_IMAGE_PATH=\"../lib/julia/sys.so\"" ./jltypes.o ./gf.o ./typemap.o ./ast.o ./builtins.o ./module.o ./interpreter.o ./symbol.o ./dlload.o ./sys.o ./init.o ./task.o ./array.o ./dump.o ./staticdata.o ./toplevel.o ./jl_uv.o ./datatype.o ./simplevector.o ./APInt-C.o ./runtime_intrinsics.o ./runtime_ccall.o ./precompile.o ./threadgroup.o ./threading.o ./stackwalk.o ./gc.o ./gc-debug.o ./gc-pages.o ./method.o ./jlapi.o ./signal-handling.o ./safepoint.o ./jloptions.o ./timing.o ./subtype.o ./rtutils.o ./crc32c.o ./processor.o ./codegen.o ./jitlayers.o ./disasm.o ./debuginfo.o ./llvm-simdloop.o ./llvm-ptls.o ./llvm-muladd.o ./llvm-late-gc-lowering.o ./llvm-lower-handlers.o ./llvm-gc-invariant-verifier.o ./llvm-propagate-addrspaces.o ./llvm-multiversioning.o ./llvm-alloc-opt.o ./cgmemmgr.o ./llvm-api.o -Wl,-rpath,'$ORIGIN/julia' -Wl,-rpath,'$ORIGIN' -Wl,-z,origin -o /home/travis/build/JuliaLang/julia/usr/lib/libjulia.so.0.7.0 -Wl,-Bsymbolic-functions -Wl,--whole-archive ./flisp/libflisp.a -Wl,--whole-archive ./support/libsupport.a -L/home/travis/build/JuliaLang/julia/usr/lib -L/home/travis/build/JuliaLang/julia/usr/lib /home/travis/build/JuliaLang/julia/usr/lib/libuv.a /home/travis/build/JuliaLang/julia/usr/lib/libutf8proc.a -Wl,--no-whole-archive -L/home/travis/build/JuliaLang/julia/usr/lib -lLLVM -Wl,--no-as-needed -ldl -lrt -lpthread -Wl,--export-dynamic,--as-needed,--no-whole-archive /home/travis/build/JuliaLang/julia/usr/lib/libunwind-generic.a /home/travis/build/JuliaLang/julia/usr/lib/libunwind.a -Wl,--version-script=/home/travis/build/JuliaLang/julia/src/julia.expmap -Wl,-soname=libjulia.so.0.7
/home/travis/build/JuliaLang/julia/usr/lib/libunwind.a(Los-linux.o): In function `_ULx86_local_resume':
Los-linux.c:(.text+0x779): warning: sigreturn is not implemented and will always fail
55.625257 true -ignorelibjulia.so /home/travis/build/JuliaLang/julia/usr/lib/libjulia.so.0.7.0
55.627130 true -ignore /home/travis/build/JuliaLang/julia/usr/lib/libjulia.so.0.7.0
55.628046 make[2]: Leaving directory `/home/travis/build/JuliaLang/julia/src'
55.681064 make[2]: Entering directory `/home/travis/build/JuliaLang/julia/ui'
55.682055 ccache gcc -march=pentium4 -m32 -fasynchronous-unwind-tables -DJULIA_HAS_IFUNC_SUPPORT=1 -DJULIA_ENABLE_THREADING -DJULIA_NUM_THREADS=1 -std=gnu99 -pipe -fPIC -fno-strict-aliasing -D_FILE_OFFSET_BITS=64 -O3 -ggdb2 -falign-functions -momit-leaf-frame-pointer -I/home/travis/build/JuliaLang/julia/src -I/home/travis/build/JuliaLang/julia/src -I/home/travis/build/JuliaLang/julia/src/support -I/home/travis/build/JuliaLang/julia/usr/include -Wall -Wno-strict-aliasing -fno-omit-frame-pointer -Wc++-compat -c /home/travis/build/JuliaLang/julia/ui/repl.c -o repl.o
56.061474 ccache g++ -march=pentium4 -m32 -pipe -fPIC -fno-rtti -pedantic -D_FILE_OFFSET_BITS=64 -O3 -ggdb2 -falign-functions -momit-leaf-frame-pointer -I/home/travis/build/JuliaLang/julia/src -I/home/travis/build/JuliaLang/julia/src -I/home/travis/build/JuliaLang/julia/src/support -I/home/travis/build/JuliaLang/julia/usr/include -Wall -Wno-strict-aliasing -fno-omit-frame-pointer -Wc++-compat repl.o -o /home/travis/build/JuliaLang/julia/usr/bin/julia -L/home/travis/build/JuliaLang/julia/usr/lib/julia -L/home/travis/build/JuliaLang/julia/usr/lib -L/home/travis/build/JuliaLang/julia/usr/lib -ljulia -Wl,-Bdynamic -Wl,--no-whole-archive -Wl,--no-as-needed -ldl -lrt -lpthread -Wl,--export-dynamic,--as-needed,--no-whole-archive /home/travis/build/JuliaLang/julia/usr/lib/libunwind-generic.a /home/travis/build/JuliaLang/julia/usr/lib/libunwind.a -Wl,--version-script=/home/travis/build/JuliaLang/julia/src/julia.expmap -Wl,-rpath,'$ORIGIN/../lib' -Wl,-rpath-link,/home/travis/build/JuliaLang/julia/usr/lib -Wl,-z,origin
56.291700 make[2]: Leaving directory `/home/travis/build/JuliaLang/julia/ui'
56.353641 make[2]: Entering directory `/home/travis/build/JuliaLang/julia'
56.354237 cd /home/travis/build/JuliaLang/julia/base && /home/travis/build/JuliaLang/julia/usr/bin/julia -C "generic;native" --output-ji /home/travis/build/JuliaLang/julia/usr/lib/julia/basecompiler.ji --startup-file=no -g0 -O0 compiler/compiler.jl
56.654368 essentials.jl
56.781656 some.jl
56.795562 ctypes.jl
56.799761 generator.jl
56.822630 reflection.jl
56.979985 options.jl
57.006744 promotion.jl
57.101020 tuple.jl
57.209375 pair.jl
57.228496 traits.jl
57.240870 range.jl
57.498795 expr.jl
57.553194 error.jl
57.589059 bool.jl
57.613828 number.jl
57.650962 int.jl
57.895927 operators.jl
57.975047 pointer.jl
58.014012 refvalue.jl
58.027069 indices.jl
58.103993 array.jl
58.457838 abstractarray.jl
58.961578 reduce.jl
59.047740 bitarray.jl
59.430859 bitset.jl
59.504768 abstractdict.jl
59.633100 abstractset.jl
59.667551 iterators.jl
59.939522 namedtuple.jl
60.029183 docs/core.jl
60.037319 subarray.jl
60.155114 ordering.jl
60.187240 sort.jl
60.422233 compiler/utilities.jl
60.465781 compiler/validation.jl
60.593212 compiler/inferenceresult.jl
60.614513 compiler/params.jl
60.666109 compiler/inferencestate.jl
60.709412 compiler/typeutils.jl
60.735771 compiler/typelimits.jl
60.809642 compiler/typelattice.jl
60.854700 compiler/tfuncs.jl
61.053742 compiler/abstractinterpretation.jl
61.231551 compiler/typeinfer.jl
61.339854 compiler/optimize.jl
61.429899 compiler/ssair/driver.jl
61.439862 compiler/ssair/ir.jl
61.658082 compiler/ssair/domtree.jl
61.687593 compiler/ssair/slot2ssa.jl
61.933972 compiler/ssair/queries.jl
61.950926 compiler/ssair/passes.jl
62.157164 compiler/ssair/inlining2.jl
62.402953 compiler/ssair/verify.jl
62.434770 compiler/ssair/legacy.jl
62.472411 compiler/bootstrap.jl
139.043835 make[2]: Leaving directory `/home/travis/build/JuliaLang/julia'
139.115324 make[2]: Entering directory `/home/travis/build/JuliaLang/julia'
139.115966 cd /home/travis/build/JuliaLang/julia/base && if ! /home/travis/build/JuliaLang/julia/usr/bin/julia -O3 -C "generic;native" --output-o /home/travis/build/JuliaLang/julia/usr/lib/julia/sys-o.a --startup-file=no --warn-overwrite=yes --sysimage /home/travis/build/JuliaLang/julia/usr/lib/julia/basecompiler.ji sysimg.jl ; then echo '*** This error is usually fixed by running `make clean`. If the error persists, try `make cleanall`. ***' && false; fi
156.846984 coreio.jl
156.872845 exports.jl
156.963953 essentials.jl
157.133718 ctypes.jl
157.139083 gcutils.jl
157.155251 generator.jl
157.179167 reflection.jl
157.753827 options.jl
157.812457 promotion.jl
157.911993 tuple.jl
158.037124 pair.jl
158.056750 traits.jl
158.069372 range.jl
158.366447 expr.jl
158.426405 error.jl
158.466641 bool.jl
158.493636 number.jl
158.532936 int.jl
159.355157 operators.jl
159.457744 pointer.jl
159.497803 refvalue.jl
159.507630 refpointer.jl
159.541870 checked.jl
159.652267 indices.jl
159.741328 array.jl
160.197278 abstractarray.jl
160.997464 subarray.jl
161.127518 views.jl
161.165624 reinterpretarray.jl
161.681145 abstractdict.jl
161.830755 iterators.jl
162.254000 namedtuple.jl
162.430138 hashing.jl
162.445242 rounding.jl
162.542300 float.jl
163.446985 twiceprecision.jl
163.609157 complex.jl
163.834406 rational.jl
164.059002 multinverses.jl
164.091654 abstractarraymath.jl
164.252364 arraymath.jl
164.328421 simdloop.jl
164.351104 reduce.jl
164.592980 reshapedarray.jl
164.679235 bitarray.jl
165.133546 bitset.jl
165.241640 some.jl
165.256983 dict.jl
165.406731 abstractset.jl
165.442433 set.jl
165.555257 char.jl
165.754160 strings/basic.jl
165.851234 strings/string.jl
166.291996 build_h.jl
166.295744 version_git.jl
166.311334 osutils.jl
166.315687 c.jl
166.502211 io.jl
166.823076 iostream.jl
166.922171 iobuffer.jl
167.021359 intfuncs.jl
167.452984 strings/strings.jl
167.453625 strings/substring.jl
167.490985 strings/search.jl
167.557214 strings/unicode.jl
167.676964 strings/util.jl
167.800589 strings/io.jl
167.884292 parse.jl
167.960730 shell.jl
168.015741 regex.jl
168.033006 pcre.jl
168.201534 show.jl
174.899860 arrayshow.jl
177.898716 cartesian.jl
178.362241 multidimensional.jl
181.340877 permuteddimsarray.jl
181.388070 broadcast.jl
181.775303 missing.jl
181.936111 version.jl
185.791075 WARNING: no build number found for pre-release version
185.851759 sysinfo.jl
185.983958 libc.jl
186.101267 env.jl
186.147985 libuv.jl
186.154760 uv_constants.jl
186.602655 event.jl
186.789239 task.jl
186.873443 lock.jl
186.892991 threads.jl
187.917455 weakkeydict.jl
187.971894 logging.jl
188.843863 stream.jl
189.225088 filesystem.jl
191.124950 process.jl
191.723081 grisu/grisu.jl
192.208473 methodshow.jl
192.280945 floatfuncs.jl
192.350641 math.jl
195.234942 reducedim.jl
195.950147 accumulate.jl
196.008089 ordering.jl
196.040024 sort.jl
196.228013 fastmath.jl
198.336657 gmp.jl
199.343430 mpfr.jl
201.607576 combinatorics.jl
201.785994 hashing2.jl
201.818384 irrationals.jl
201.889149 mathconstants.jl
203.294899 printf.jl
203.925509 meta.jl
204.054619 Enums.jl
204.106998 channels.jl
204.173831 deepcopy.jl
204.193153 download.jl
205.402611 summarysize.jl
205.435131 errorshow.jl
206.885467 stacktraces.jl
208.121142 initdefs.jl
208.144419 statistics.jl
208.196224 threadcall.jl
208.844444 uuid.jl
208.929889 loading.jl
211.709497 util.jl
215.223474 asyncmap.jl
215.308229 multimedia.jl
215.387266 deprecated.jl
219.739926 docs/basedocs.jl
219.985664 client.jl
222.241668 docs/Docs.jl
232.172304 Base ─────────── 71.885288 seconds
242.349779 Base64 ───────── 10.144227 seconds
242.367841 CRC32c ───────── 0.018043 seconds
242.703901 SHA ──────────── 0.335983 seconds
242.873396 FileWatching ─── 0.169422 seconds
242.906536 Unicode ──────── 0.033079 seconds
243.044117 Mmap ─────────── 0.137513 seconds
245.084042 Serialization ── 2.039847 seconds
245.132431 Libdl ────────── 0.048329 seconds
248.036299 Markdown ─────── 2.903802 seconds
261.165243 LibGit2 ──────── 13.067870 seconds
267.654068 Logging ──────── 3.068509 seconds
271.906379 Sockets ──────── 4.252243 seconds
271.983071 Printf ───────── 0.076631 seconds
272.477459 Profile ──────── 0.494309 seconds
279.470702 Dates ────────── 6.954175 seconds
282.853412 DelimitedFiles ─ 3.382604 seconds
285.043758 Random ───────── 2.190273 seconds
285.060782 UUIDs ────────── 0.016953 seconds
285.078222 Future ───────── 0.017383 seconds
292.328536 OldPkg ───────── 7.191933 seconds
326.991330 LinearAlgebra ── 34.662659 seconds
334.608546 SparseArrays ─── 7.617161 seconds
337.968869 SuiteSparse ──── 3.360245 seconds
349.747536 SharedArrays ─── 11.778584 seconds
349.748192 Distributed ──── 0.000649 seconds
411.528359 Pkg ──────────── 61.780070 seconds
423.955755 Test ─────────── 12.372736 seconds
433.109601 REPL ─────────── 9.153779 seconds
433.150769 Stdlibs total ──200.937315 seconds
433.700471 /home/travis/build/JuliaLang/julia/base/precompile.jl
461.603818 Sysimage built. Summary:
461.617258 Total ─────── 300.722596 seconds
461.799456 Base: ─────── 71.885288 seconds 23.9042%
461.799549 Stdlibs: ──── 200.937315 seconds 66.8182%
461.799586 Precompile: ─ 27.892382 seconds 9.27512%
868.772098 ccache g++ -march=pentium4 -m32 -shared -fPIC -L/home/travis/build/JuliaLang/julia/usr/lib/julia -L/home/travis/build/JuliaLang/julia/usr/lib -L/home/travis/build/JuliaLang/julia/usr/lib -o /home/travis/build/JuliaLang/julia/usr/lib/julia/sys.so -Wl,--whole-archive /home/travis/build/JuliaLang/julia/usr/lib/julia/sys-o.a -Wl,--no-whole-archive -ljulia $([ Linux = WINNT ] && echo '' -lssp)
869.763858 make[2]: Leaving directory `/home/travis/build/JuliaLang/julia'
869.816813 make[2]: Entering directory `/home/travis/build/JuliaLang/julia/doc'
869.816888 /home/travis/build/JuliaLang/julia/deps/tools/jldownload http://www.unicode.org/Public/9.0.0/ucd/UnicodeData.txt
% Total % Received % Xferd Average Speed Time Time Time Current
Dload Upload Total Spent Left Speed
0 0 0 0 0 0 0 0 --:--:-- --:--:-- --:--:-- 0
100 447 100 447 0 0 816 0 --:--:-- --:--:-- --:--:-- 817
0 0 0 0 0 0 0 0 --:--:-- --:--:-- --:--:-- 0
100 1646k 100 1646k 0 0 1159k 0 0:00:01 0:00:01 --:--:-- 1951k
871.252974 /home/travis/build/JuliaLang/julia/deps/tools/jlchecksum UnicodeData.txt
871.266986 Building HTML documentation.
871.267048 /home/travis/build/JuliaLang/julia/usr/bin/julia --color=yes /home/travis/build/JuliaLang/julia/doc/make.jl linkcheck= doctest=
875.374433 Cloning default registries into /home/travis/build/JuliaLang/julia/doc/deps/registries
875.445278 Cloning registry Uncurated from "https://github.com/JuliaRegistries/Uncurated.git"
879.085079 [?25l Fetching: [> ] 0.0 %
[?25h Updating registry at `deps/registries/Uncurated`
879.706048 Updating git-repo `https://github.com/JuliaRegistries/Uncurated.git`
882.868353 [?25l[?25h Cloning git-repo `https://github.com/JuliaLang/Compat.jl.git`
883.717871 [?25l Fetching: [> ] 0.0 %
[?25h Updating git-repo `https://github.com/JuliaLang/Compat.jl.git`
887.851130 [?25l Fetching: [> ] 0.0 %
[?25h Installed Documenter ────────── v0.18.0
887.854872 Installed DocStringExtensions ─ v0.4.4
┌ Warning: Deprecated syntax `try without catch or finally` at /home/travis/build/JuliaLang/julia/contrib/build_sysimg.jl:142.
â”” @ nothing build_sysimg.jl:142
910.868509 Documenter: setting up build directory.
914.627885 Documenter: expanding markdown templates.
make[2]: *** [html] Segmentation fault (core dumped)
983.611665 make[2]: Leaving directory `/home/travis/build/JuliaLang/julia/doc'
make[1]: *** [docs] Error 2
983.612004 make[1]: Leaving directory `/home/travis/build/JuliaLang/julia'
make: *** [/home/travis/build/JuliaLang/julia/doc/_build/html/en/index.html] Error 2
travis_time:end:164bfdd9:start=1529484464903517407,finish=1529485448562252969,duration=983658735562

The command "make $BUILDOPTS NO_GIT=1 prefix=/tmp/julia install | moreutils/ts -s "%.s"" exited with 0.
travis_time:start:06c82930
$ make $BUILDOPTS NO_GIT=1 build-stats
==> ./julia binary sizes
/home/travis/build/JuliaLang/julia/usr/tools/llvm-size -A /home/travis/build/JuliaLang/julia/usr/lib/julia/sys.so /home/travis/build/JuliaLang/julia/usr/lib/libjulia.so /home/travis/build/JuliaLang/julia/usr/bin/julia
/home/travis/build/JuliaLang/julia/usr/lib/julia/sys.so :
section size addr
.note.gnu.build-id 36 276
.gnu.hash 176 312
.dynsym 1616 488
.gnu.version 202 3672
.gnu.version_r 128 3876
.init 35 8316
.plt 1152 8352
.text 11699124 9504
.fini 20 11708628
.rodata 68288 11708672
.eh_frame_hdr 129276 11776960
.eh_frame 1490096 11906236
.init_array 4 13400628
.fini_array 4 13400632
.jcr 4 13400636
.data.rel.ro 115856 13400640
.dynamic 248 13516496
.got 48 13516744
.got.plt 296 13516800
.data 121447244 13517120
.bss 55428 134964364
.comment 51 0
.debug_pubnames 1345217 0
.debug_info 7571678 0
.debug_abbrev 288 0
.debug_line 4457163 0
.debug_str 236376 0
.debug_macinfo 1 0
.debug_pubtypes 150120 0
.debug_ranges 4269800 0
Total 153039975
/home/travis/build/JuliaLang/julia/usr/lib/libjulia.so :
section size addr
.note.gnu.build-id 36 308
.gnu.hash 10216 344
.dynsym 35568 10560
.gnu.version 4446 102698
.gnu.version_r 704 107144
.init 35 125544
.plt 14032 125584
.text 1688612 139616
jl_interpreter_frame_val 16953 1828240
.fini 20 1845196
.rodata 572236 1845216
.eh_frame_hdr 30524 2417452
.eh_frame 168692 2447976
.tbss 5552 2624664
.init_array 68 2624664
.fini_array 12 2624732
.jcr 4 2624744
.data.rel.ro 7848 2624768
.dynamic 312 2632616
.got 772 2632928
.got.plt 3516 2633728
.data 308784 2637248
.bss 462988 2946048
.comment 94 0
.debug_aranges 14968 0
.debug_info 12324893 0
.debug_abbrev 186662 0
.debug_line 531821 0
.debug_str 5276734 0
.debug_loc 2476083 0
.debug_ranges 391920 0
Total 24535105
/home/travis/build/JuliaLang/julia/usr/bin/julia :
section size addr
.interp 19 134513012
.note.ABI-tag 32 134513032
.note.gnu.build-id 36 134513064
.gnu.hash 44 134513100
.dynsym 848 134513144
.gnu.version 106 134514874
.gnu.version_r 64 134514980
.init 35 134515420
.plt 624 134515456
.text 3714 134516080
.fini 20 134519796
.rodata 397 134519816
.eh_frame_hdr 92 134520216
.eh_frame 428 134520308
.tbss 5552 134524596
.init_array 8 134524596
.fini_array 4 134524604
.jcr 4 134524608
.dynamic 280 134524612
.got 36 134524892
.got.plt 164 134524928
.data 8 134525092
.bss 4 134525100
.comment 94 0
.debug_aranges 48 0
.debug_info 13042 0
.debug_abbrev 1219 0
.debug_line 1321 0
.debug_str 6236 0
.debug_loc 3022 0
.debug_ranges 480 0
Total 37981
==> ./julia launch speedtest
0.58user 0.24system 0:00.57elapsed 143%CPU (0avgtext+0avgdata 144024maxresident)k
0inputs+0outputs (0major+15382minor)pagefaults 0swaps
0.54user 0.22system 0:00.56elapsed 134%CPU (0avgtext+0avgdata 144344maxresident)k
0inputs+0outputs (0major+15449minor)pagefaults 0swaps
0.57user 0.27system 0:00.58elapsed 144%CPU (0avgtext+0avgdata 148492maxresident)k
0inputs+0outputs (0major+14953minor)pagefaults 0swaps
travis_time:end:06c82930:start=1529485448570946673,finish=1529485450393801430,duration=1822854757

The command "make $BUILDOPTS NO_GIT=1 build-stats" exited with 0.
travis_time:start:01cf75bc
$ du -sk /tmp/julia/*
du: cannot access ‘/tmp/julia/*’: No such file or directory
travis_time:end:01cf75bc:start=1529485450402113360,finish=1529485450414560181,duration=12446821

The command "du -sk /tmp/julia/*" exited with 1.
travis_time:start:0dc4d3de
$ ls -l /tmp/julia/lib
ls: cannot access /tmp/julia/lib: No such file or directory
travis_time:end:0dc4d3de:start=1529485450422568042,finish=1529485450430512341,duration=7944299

The command "ls -l /tmp/julia/lib" exited with 2.
travis_time:start:18e8eeac
$ ls -l /tmp/julia/lib/julia
ls: cannot access /tmp/julia/lib/julia: No such file or directory
travis_time:end:18e8eeac:start=1529485450438444094,finish=1529485450446149915,duration=7705821

The command "ls -l /tmp/julia/lib/julia" exited with 2.
travis_time:start:20268564
$ FILES_CHANGED=$(git diff --name-only $TRAVIS_COMMIT_RANGE -- || git ls-files)
travis_time:end:20268564:start=1529485450454448986,finish=1529485450464202528,duration=9753542

The command "FILES_CHANGED=$(git diff --name-only $TRAVIS_COMMIT_RANGE -- || git ls-files)" exited with 0.
travis_time:start:0fa03a10
$ cd .. && mv julia julia2
travis_time:end:0fa03a10:start=1529485450472160534,finish=1529485450479568120,duration=7407586

The command "cd .. && mv julia julia2" exited with 0.
travis_time:start:000ad74c
$ /tmp/julia/bin/julia --sysimage-native-code=no -e 'true' && /tmp/julia/bin/julia-debug --sysimage-native-code=no -e 'true'
/home/travis/.travis/job_stages: line 57: /tmp/julia/bin/julia: No such file or directory
travis_time:end:000ad74c:start=1529485450486373812,finish=1529485450492786231,duration=6412419

The command "/tmp/julia/bin/julia --sysimage-native-code=no -e 'true' && /tmp/julia/bin/julia-debug --sysimage-native-code=no -e 'true'" exited with 127.
travis_time:start:09328a21
$ /tmp/julia/bin/julia -e 'Base.require(Main, :InteractiveUtils).versioninfo()'
/home/travis/.travis/job_stages: line 57: /tmp/julia/bin/julia: No such file or directory
travis_time:end:09328a21:start=1529485450499599365,finish=1529485450505490154,duration=5890789

The command "/tmp/julia/bin/julia -e 'Base.require(Main, :InteractiveUtils).versioninfo()'" exited with 127.
travis_time:start:1a5373af
$ pushd /tmp/julia/share/julia/test
/home/travis/.travis/job_stages: line 57: pushd: /tmp/julia/share/julia/test: No such file or directory
travis_time:end:1a5373af:start=1529485450512256257,finish=1529485450517388215,duration=5131958

The command "pushd /tmp/julia/share/julia/test" exited with 1.
travis_time:start:000ea831
$ if [ $(echo "$FILES_CHANGED" | grep -cv '^doc/') -gt 0 ]; then /tmp/julia/bin/julia --check-bounds=yes runtests.jl $TESTSTORUN && /tmp/julia/bin/julia --check-bounds=yes runtests.jl LibGit2/online OldPkg/pkg Pkg/pkg download; fi
/home/travis/.travis/job_stages: line 57: /tmp/julia/bin/julia: No such file or directory
travis_time:end:000ea831:start=1529485450523740560,finish=1529485450533806994,duration=10066434

The command "if [ $(echo "$FILES_CHANGED" | grep -cv '^doc/') -gt 0 ]; then /tmp/julia/bin/julia --check-bounds=yes runtests.jl $TESTSTORUN && /tmp/julia/bin/julia --check-bounds=yes runtests.jl LibGit2/online OldPkg/pkg Pkg/pkg download; fi" exited with 127.
travis_time:start:03c9542a
$ popd
/home/travis/.travis/job_stages: line 57: popd: directory stack empty
travis_time:end:03c9542a:start=1529485450540981710,finish=1529485450546884935,duration=5903225

The command "popd" exited with 1.
travis_time:start:0c8ae50a
$ mkdir /tmp/embedding-test && make check -C /tmp/julia/share/julia/test/embedding \ JULIA="/tmp/julia/bin/julia" \ BIN=/tmp/embedding-test \ "$(cd julia2 && make print-CC)"
make: *** /tmp/julia/share/julia/test/embedding: No such file or directory. Stop.
travis_time:end:0c8ae50a:start=1529485450554220132,finish=1529485450642824801,duration=88604669

The command "mkdir /tmp/embedding-test && make check -C /tmp/julia/share/julia/test/embedding \ JULIA="/tmp/julia/bin/julia" \ BIN=/tmp/embedding-test \ "$(cd julia2 && make print-CC)"" exited with 2.
travis_time:start:0be5aeda
$ mv julia2 julia && rm -f julia/deps/scratch/libgit2-*/CMakeFiles/CMakeOutput.log
travis_time:end:0be5aeda:start=1529485450650228076,finish=1529485450658908633,duration=8680557

The command "mv julia2 julia && rm -f julia/deps/scratch/libgit2-*/CMakeFiles/CMakeOutput.log" exited with 0.
travis_time:start:215f49ea
$ if [ `uname` = "Linux" ] && [ $ARCH = "x86_64" ]; then pushd julia && make -C doc doctest=true && popd; fi
travis_time:end:215f49ea:start=1529485450667275879,finish=1529485450676225812,duration=8949933

The command "if [ `uname` = "Linux" ] && [ $ARCH = "x86_64" ]; then pushd julia && make -C doc doctest=true && popd; fi" exited with 0.
travis_fold:start:cache.2
store build cache
travis_time:start:0a2a9422

travis_time:end:0a2a9422:start=1529485450684488586,finish=1529485450690900317,duration=6411731
travis_time:start:022365eb
change detected (content changed, file is created, or file is deleted):
/home/travis/.ccache/0/0/01ed23d45463cdcd9e21bacc5919cc-2463.manifest
/home/travis/.ccache/0/0/06bf7de692613bb0bfc424cd92a8af-3945414.o
/home/travis/.ccache/0/0/08c5418f367b39c5fb4559c19ab521-1463.manifest
/home/travis/.ccache/0/0/0b4723f09e3874993697e6c5134dd4-33188.manifest
/home/travis/.ccache/0/0/0d1663fb316ee39eb4260fe4051116-1910046.o
/home/travis/.ccache/0/0/0e3fbd9668d2bb8f7fadfcc721d1c4-1703.manifest
/home/travis/.ccache/0/0/1a14cfb2bba06062c5b6dbd469bf65-940.manifest
/home/travis/.ccache/0/0/27bacac6c60c3f080f911a137ad7bb-1303.manifest
/home/travis/.ccache/0/0/31d90cd4574944596dda8c2bde2042-4324.manifest
/home/travis/.ccache/0/0/3cd41a051605097c7ff7b338cb29de-8870.manifest
/home/travis/.ccache/0/0/4db67f7852b95ca0c8196c3fa2c5b1-30569.manifest
/home/travis/.ccache/0/0/515ff2a3afa9ecdaaacb0d295c6fd3-6702.manifest
/home/travis/.ccache/0/0/52148d245809713fc5169fe89f7747-2726639.o
/home/travis/.ccache/0/0/61c84e50b4f7203acef1408142a225-1699.manifest
/home/travis/.ccache/0/0/6b1ab3d

...

changes detected, packing new archive
.
.
.
.
uploading archive
travis_time:end:022365eb:start=1529485450698117379,finish=1529485476496410348,duration=25798292969
travis_fold:end:cache.2

Done. Your build exited with 1.
Sign up for free to join this conversation on GitHub. Already have an account? Sign in to comment