Skip to content

Instantly share code, notes, and snippets.

Avatar

Michael Biarnés Kiefer mbiarnes

  • Red Hat
  • Cardedeu - Barcelona
View GitHub Profile
@mbiarnes
mbiarnes / gist:05f0a8c7b90da994368517162a19947d
Created Sep 23, 2021
Kie Workbench - Common - Forms - Commons - CRUD Component
View gist:05f0a8c7b90da994368517162a19947d
[2021-09-22T23:35:37.635Z] [INFO] Tests run: 11, Failures: 0, Errors: 0, Skipped: 0
[2021-09-22T23:35:37.635Z] [INFO]
[2021-09-22T23:35:37.635Z] [INFO]
[2021-09-22T23:35:37.635Z] [INFO] --- maven-jar-plugin:3.1.0:jar (default-jar) @ kie-wb-common-forms-crud-component ---
[2021-09-22T23:35:37.635Z] [INFO] Building jar: /home/jenkins/workspace/KIE/main/daily-build-jdk11/daily-build-jdk11-pipeline-main/kie-wb-common/kie-wb-common-forms/kie-wb-common-forms-commons/kie-wb-common-forms-crud-component/target/kie-wb-common-forms-crud-component-7.60.0.210922-05.jar
[2021-09-22T23:35:37.635Z] [INFO]
[2021-09-22T23:35:37.635Z] [INFO] --- maven-source-plugin:3.0.1:jar-no-fork (attach-sources) @ kie-wb-common-forms-crud-component ---
[2021-09-22T23:35:37.635Z] [INFO] Building jar: /home/jenkins/workspace/KIE/main/daily-build-jdk11/daily-build-jdk11-pipeline-main/kie-wb-common/kie-wb-common-forms/kie-wb-common-forms-commons/kie-wb-common-forms-crud-component/target/kie-wb-common-forms-crud-component-7.60.0.210922-05-sou
View gist:4424dc656723ba032f4f9304b458b450
[jenkins@kie-psi-rhel7-xlarge-xmem-pipeline-379 daily-build-jdk11-pipeline-main]$ ps -ef | grep java.
jenkins 3596 2976 0 Sep20 ? 00:00:00 bash -c cd "/home/jenkins" && java -Xmx2048m -XX:MaxPermSize=256m -XX:+HeapDumpOnOutOfMemoryError -XX:HeapDumpPath=/tmp -Djavax.net.ssl.trustStore=/qa/tools/keystore/mw.truststore -Djavax.net.ssl.trustStorePassword=changeit -Dcom.sun.management.jmxremote -Dcom.sun.management.jmxremote.port=9110 -Dcom.sun.management.jmxremote.authenticate=false -Dcom.sun.management.jmxremote.ssl=false -Dcom.sun.management.jmxremote.local.only=false -jar remoting.jar -workDir /home/jenkins -jar-cache /home/jenkins/remoting/jarCache
jenkins 3618 3596 1 Sep20 ? 00:11:36 java -Xmx2048m -XX:MaxPermSize=256m -XX:+HeapDumpOnOutOfMemoryError -XX:HeapDumpPath=/tmp -Djavax.net.ssl.trustStore=/qa/tools/keystore/mw.truststore -Djavax.net.ssl.trustStorePassword=changeit -Dcom.sun.management.jmxremote -Dcom.sun.management.jmxremote.port=9110 -Dcom.sun.management.jmxremote.authentica
@mbiarnes
mbiarnes / gist:87031c7c8f6d605f7471840afb4d8a79
Created Sep 16, 2021
Building Business Central Tests faiure in kie-wb-distributions
View gist:87031c7c8f6d605f7471840afb4d8a79
[2021-09-15T16:16:24.730Z] [INFO]
[2021-09-15T16:16:24.730Z] [INFO] ----------------< org.kie:business-central-tests-rest >-----------------
[2021-09-15T16:16:24.730Z] [INFO] Building Business Central Tests :: REST API 7.60.0-SNAPSHOT [17/18]
[2021-09-15T16:16:24.730Z] [INFO] --------------------------------[ jar ]---------------------------------
[2021-09-15T16:16:24.730Z] [INFO]
[2021-09-15T16:16:24.730Z] [INFO] --- maven-clean-plugin:3.1.0:clean (default-clean) @ business-central-tests-rest ---
[2021-09-15T16:16:24.730Z] [INFO]
[2021-09-15T16:16:24.730Z] [INFO] --- maven-enforcer-plugin:3.0.0-M3:enforce (enforce-plugin-versions) @ business-central-tests-rest ---
[2021-09-15T16:16:24.730Z] [INFO]
[2021-09-15T16:16:24.730Z] [INFO] --- maven-enforcer-plugin:3.0.0-M3:enforce (ban-blacklisted-dependencies) @ business-central-tests-rest ---
View gist:ad1ed2aedb77ed26c0973f5484c2f9c7
Downloading from mirror-central: https://bxms-qe.rhev-ci-vms.eng.rdu2.redhat.com:8443/nexus/content/groups/kie-all/org/kie/kie-parent/7.59.1.210908-05/kie-parent-7.59.1.210908-05.pom
06:45:20 [ERROR] [ERROR] Some problems were encountered while processing the POMs:
06:45:20 [FATAL] Non-resolvable parent POM for org.drools:droolsjbpm-integration:7.59.1.210908-05: Could not find artifact org.kie:kie-parent:pom:7.59.1.210908-05 in mirror-central
(https://bxms-qe.rhev-ci-vms.eng.rdu2.redhat.com:8443/nexus/content/groups/kie-all/) and 'parent.relativePath' points at wrong local POM @ org.drools:droolsjbpm-integration:7.59.1.210908-05,
/home/jenkins/workspace/KIE/7.59.x/daily-build/daily-build-7.59.x-kieServerMatrix/45819ee1/pom.xml, line 6, column 11
View gist:2c6437db98c3d268686c17ea44e854b4
Expected no exception to be thrown, but got 'javaposse.jobdsl.dsl.DslScriptException'
at spock.lang.Specification.noExceptionThrown(Specification.java:118)
at org.kie.jenkins.jobdsl.JobScriptsSpec.test script #file.name(JobScriptsSpec.groovy:47)
Caused by: javaposse.jobdsl.dsl.DslScriptException: (script, line 10) No signature of method: javaposse.jobdsl.dsl.helpers.workflow.BranchSourcesContext.source() is applicable for argument types: (script$_run_closure1$_closure2$_closure3) values: [script$_run_closure1$_closure2$_closure3@1f90edb5]
Possible solutions: collect(), use([Ljava.lang.Object;)
at javaposse.jobdsl.dsl.AbstractDslScriptLoader.runScriptEngine(AbstractDslScriptLoader.groovy:114)
at javaposse.jobdsl.dsl.AbstractDslScriptLoader.runScripts_closure1(AbstractDslScriptLoader.groovy:61)
at groovy.lang.Closure.call(Closure.java:405)
at groovy.lang.Closure.call(Closure.java:421)
at javaposse.jobdsl.dsl.AbstractDslScriptLoader.runScripts(AbstractDslScriptLoader.groovy:46)
View gist:be84cf14c7abe79002c08ad09c494b58
test script prod_multibranch_nightly.groovy
Expected no exception to be thrown, but got 'javaposse.jobdsl.dsl.DslScriptException'
at spock.lang.Specification.noExceptionThrown(Specification.java:118)
at org.kie.jenkins.jobdsl.JobScriptsSpec.test script #file.name(JobScriptsSpec.groovy:47)
Caused by: javaposse.jobdsl.dsl.DslScriptException: (script, line 12) No signature of method: javaposse.jobdsl.plugin.structs.DescribableListContext.github() is applicable for argument types: (script$_run_closure1$_closure2$_closure3$_closure4$_closure5) values: [script$_run_closure1$_closure2$_closure3$_closure4$_closure5@71029ff8]
Possible solutions: with(groovy.lang.Closure), with(boolean, groovy.lang.Closure), getAt(java.lang.String)
at javaposse.jobdsl.dsl.AbstractDslScriptLoader.runScriptEngine(AbstractDslScriptLoader.groovy:114)
at javaposse.jobdsl.dsl.AbstractDslScriptLoader.runScripts_closure1(AbstractDslScriptLoader.groovy:61)
at groovy.lang.Closure.call(Closure.java:405)
@mbiarnes
mbiarnes / gist:87ac94db8813a31107fa6d620f383bf6
Created Sep 2, 2021
error excuting update-quarkus-platform.sh
View gist:87ac94db8813a31107fa6d620f383bf6
θ65° [mbiarnes:~/test/kogito/kogito-pipelines/tools] main+ ± sh update-quarkus-platform.sh -v 11.0.Final -f mbiarnes -s stage
GITHUB_URL...............git@github.com:
ORIGIN...................quarkusio/quarkus-platform
PR_FORK..................mbiarnes/quarkus-platform
BRANCH...................main
PR_BRANCH................bump-kogito-1.11.0.Final+optaplanner-8.11.0.Final
KOGITO_VERSION...........1.11.0.Final
OPTAPLANNER_VERSION......8.11.0.Final
COMMAND..................stage
View gist:c7d12396d8266fe0de5413573baddcaa
θ65° [mbiarnes:~/Dokumente … dFly23/wildfly-preview-23.0.2.Final] 1 $ sh bin/standalone.sh --server-config=standalone-full-wildfly-23.0.2.Final.xml
=========================================================================
JBoss Bootstrap Environment
JBOSS_HOME: /home/mbiarnes/Dokumente/SanityChecks/WildFly23/wildfly-preview-23.0.2.Final
JAVA: /usr/local/java/jdk1.8/bin/java
JAVA_OPTS: -server -Xms64m -Xmx512m -XX:MetaspaceSize=96M -XX:MaxMetaspaceSize=256m -Djava.net.preferIPv4Stack=true -Djboss.modules.system.pkgs=org.jboss.byteman -Djava.awt.headless=true
View gist:8be3cf4d140c6b3df72385a10d2e8ed6
ORIGIN.......kiegroup/kogito-runtimes
PR_FORK......mbiarnes/kogito-runtimes
BRANCH.......main
PR_BRANCH....bump-kie--n
VERSION......-n
DRY_RUN! No changes will be pushed!
Cloning into 'kogito-runtimes'...
remote: Enumerating objects: 577285, done.
@mbiarnes
mbiarnes / gist:5c09b6bee317c8830cd712a8c9e8f588
Created Aug 5, 2021
Container tests for Camel integration 7.59.0-SNAPSHOT
View gist:5c09b6bee317c8830cd712a8c9e8f588
[INFO]
[INFO] ------------< org.drools:camel-container-integration-tests >------------
[INFO] Building Container tests for Camel integration 7.59.0-SNAPSHOT [143/151]
[INFO] --------------------------------[ jar ]---------------------------------
Downloading from jboss-public-repository-group: https://repository.jboss.org/nexus/content/groups/public/org/apache/cxf/cxf-rt-transports-http-hc/3.3.9/cxf-rt-transports-http-hc-3.3.9.pom
Downloading from kie-staging-repository-group: https://repository.jboss.org/nexus/content/groups/kie-group/org/apache/cxf/cxf-rt-transports-http-hc/3.3.9/cxf-rt-transports-http-hc-3.3.9.pom
Downloading from kie-internal-staging-repository-group: https://repository.jboss.org/nexus/content/groups/kie-internal-group/org/apache/cxf/cxf-rt-transports-http-hc/3.3.9/cxf-rt-transports-http-hc-3.3.9.pom
Downloading from kie-repository-group: https://repository.jboss.org/nexus/content/repositories/kie/org/apache/cxf/cxf-rt-transports-http-hc/3.3.9/cxf-rt-transports-http-hc-3.3.9.pom
Download