Skip to content

Instantly share code, notes, and snippets.

@metaskills metaskills/mkmf.log
Created Mar 3, 2017

Embed
What would you like to do?
find_header: checking for sybfront.h... -------------------- no
"clang -o conftest -I/Users/kencollins/.rbenv/versions/2.3.1/include/ruby-2.3.0/x86_64-darwin15 -I/Users/kencollins/.rbenv/versions/2.3.1/include/ruby-2.3.0/ruby/backward -I/Users/kencollins/.rbenv/versions/2.3.1/include/ruby-2.3.0 -I../../../../ext/tiny_tds -I/Users/kencollins/.rbenv/versions/2.3.1/include -D_XOPEN_SOURCE -D_DARWIN_C_SOURCE -D_DARWIN_UNLIMITED_SELECT -D_REENTRANT -O3 -Wno-error=shorten-64-to-32 -pipe conftest.c -L. -L/Users/kencollins/.rbenv/versions/2.3.1/lib -L. -L/Users/kencollins/.rbenv/versions/2.3.1/lib -fstack-protector -lruby-static -framework CoreFoundation -lpthread -ldl -lobjc "
checked program was:
/* begin */
1: #include "ruby.h"
2:
3: int main(int argc, char **argv)
4: {
5: return 0;
6: }
/* end */
"clang -E -I/Users/kencollins/.rbenv/versions/2.3.1/include/ruby-2.3.0/x86_64-darwin15 -I/Users/kencollins/.rbenv/versions/2.3.1/include/ruby-2.3.0/ruby/backward -I/Users/kencollins/.rbenv/versions/2.3.1/include/ruby-2.3.0 -I../../../../ext/tiny_tds -I/Users/kencollins/.rbenv/versions/2.3.1/include -D_XOPEN_SOURCE -D_DARWIN_C_SOURCE -D_DARWIN_UNLIMITED_SELECT -D_REENTRANT -O3 -Wno-error=shorten-64-to-32 -pipe conftest.c -o conftest.i"
conftest.c:3:10: fatal error: 'sybfront.h' file not found
#include <sybfront.h>
^
1 error generated.
checked program was:
/* begin */
1: #include "ruby.h"
2:
3: #include <sybfront.h>
/* end */
--------------------
find_header: checking for sybdb.h... -------------------- no
"clang -E -I/Users/kencollins/.rbenv/versions/2.3.1/include/ruby-2.3.0/x86_64-darwin15 -I/Users/kencollins/.rbenv/versions/2.3.1/include/ruby-2.3.0/ruby/backward -I/Users/kencollins/.rbenv/versions/2.3.1/include/ruby-2.3.0 -I../../../../ext/tiny_tds -I/Users/kencollins/.rbenv/versions/2.3.1/include -D_XOPEN_SOURCE -D_DARWIN_C_SOURCE -D_DARWIN_UNLIMITED_SELECT -D_REENTRANT -O3 -Wno-error=shorten-64-to-32 -pipe conftest.c -o conftest.i"
conftest.c:3:10: fatal error: 'sybdb.h' file not found
#include <sybdb.h>
^
1 error generated.
checked program was:
/* begin */
1: #include "ruby.h"
2:
3: #include <sybdb.h>
/* end */
--------------------
find_library: checking for tdsdbopen() in -lsybdb... -------------------- no
"clang -o conftest -I/Users/kencollins/.rbenv/versions/2.3.1/include/ruby-2.3.0/x86_64-darwin15 -I/Users/kencollins/.rbenv/versions/2.3.1/include/ruby-2.3.0/ruby/backward -I/Users/kencollins/.rbenv/versions/2.3.1/include/ruby-2.3.0 -I../../../../ext/tiny_tds -I/Users/kencollins/.rbenv/versions/2.3.1/include -D_XOPEN_SOURCE -D_DARWIN_C_SOURCE -D_DARWIN_UNLIMITED_SELECT -D_REENTRANT -O3 -Wno-error=shorten-64-to-32 -pipe conftest.c -L. -L/Users/kencollins/.rbenv/versions/2.3.1/lib -L. -L/Users/kencollins/.rbenv/versions/2.3.1/lib -fstack-protector -lruby-static -framework CoreFoundation -lsybdb -lpthread -ldl -lobjc "
conftest.c:13:57: error: use of undeclared identifier 'tdsdbopen'
int t(void) { void ((*volatile p)()); p = (void ((*)()))tdsdbopen; return !p; }
^
1 error generated.
checked program was:
/* begin */
1: #include "ruby.h"
2:
3: /*top*/
4: extern int t(void);
5: int main(int argc, char **argv)
6: {
7: if (argc > 1000000) {
8: printf("%p", &t);
9: }
10:
11: return 0;
12: }
13: int t(void) { void ((*volatile p)()); p = (void ((*)()))tdsdbopen; return !p; }
/* end */
"clang -o conftest -I/Users/kencollins/.rbenv/versions/2.3.1/include/ruby-2.3.0/x86_64-darwin15 -I/Users/kencollins/.rbenv/versions/2.3.1/include/ruby-2.3.0/ruby/backward -I/Users/kencollins/.rbenv/versions/2.3.1/include/ruby-2.3.0 -I../../../../ext/tiny_tds -I/Users/kencollins/.rbenv/versions/2.3.1/include -D_XOPEN_SOURCE -D_DARWIN_C_SOURCE -D_DARWIN_UNLIMITED_SELECT -D_REENTRANT -O3 -Wno-error=shorten-64-to-32 -pipe conftest.c -L. -L/Users/kencollins/.rbenv/versions/2.3.1/lib -L. -L/Users/kencollins/.rbenv/versions/2.3.1/lib -fstack-protector -lruby-static -framework CoreFoundation -lsybdb -lpthread -ldl -lobjc "
ld: library not found for -lsybdb
clang: error: linker command failed with exit code 1 (use -v to see invocation)
checked program was:
/* begin */
1: #include "ruby.h"
2:
3: /*top*/
4: extern int t(void);
5: int main(int argc, char **argv)
6: {
7: if (argc > 1000000) {
8: printf("%p", &t);
9: }
10:
11: return 0;
12: }
13: extern void tdsdbopen();
14: int t(void) { tdsdbopen(); return 0; }
/* end */
--------------------
find_library: checking for dbanydatecrack() in -lsybdb... -------------------- no
"clang -o conftest -I/Users/kencollins/.rbenv/versions/2.3.1/include/ruby-2.3.0/x86_64-darwin15 -I/Users/kencollins/.rbenv/versions/2.3.1/include/ruby-2.3.0/ruby/backward -I/Users/kencollins/.rbenv/versions/2.3.1/include/ruby-2.3.0 -I../../../../ext/tiny_tds -I/Users/kencollins/.rbenv/versions/2.3.1/include -D_XOPEN_SOURCE -D_DARWIN_C_SOURCE -D_DARWIN_UNLIMITED_SELECT -D_REENTRANT -O3 -Wno-error=shorten-64-to-32 -pipe conftest.c -L. -L/Users/kencollins/.rbenv/versions/2.3.1/lib -L. -L/Users/kencollins/.rbenv/versions/2.3.1/lib -fstack-protector -lruby-static -framework CoreFoundation -lsybdb -lpthread -ldl -lobjc "
conftest.c:13:57: error: use of undeclared identifier 'dbanydatecrack'
int t(void) { void ((*volatile p)()); p = (void ((*)()))dbanydatecrack; return !p; }
^
1 error generated.
checked program was:
/* begin */
1: #include "ruby.h"
2:
3: /*top*/
4: extern int t(void);
5: int main(int argc, char **argv)
6: {
7: if (argc > 1000000) {
8: printf("%p", &t);
9: }
10:
11: return 0;
12: }
13: int t(void) { void ((*volatile p)()); p = (void ((*)()))dbanydatecrack; return !p; }
/* end */
"clang -o conftest -I/Users/kencollins/.rbenv/versions/2.3.1/include/ruby-2.3.0/x86_64-darwin15 -I/Users/kencollins/.rbenv/versions/2.3.1/include/ruby-2.3.0/ruby/backward -I/Users/kencollins/.rbenv/versions/2.3.1/include/ruby-2.3.0 -I../../../../ext/tiny_tds -I/Users/kencollins/.rbenv/versions/2.3.1/include -D_XOPEN_SOURCE -D_DARWIN_C_SOURCE -D_DARWIN_UNLIMITED_SELECT -D_REENTRANT -O3 -Wno-error=shorten-64-to-32 -pipe conftest.c -L. -L/Users/kencollins/.rbenv/versions/2.3.1/lib -L. -L/Users/kencollins/.rbenv/versions/2.3.1/lib -fstack-protector -lruby-static -framework CoreFoundation -lsybdb -lpthread -ldl -lobjc "
ld: library not found for -lsybdb
clang: error: linker command failed with exit code 1 (use -v to see invocation)
checked program was:
/* begin */
1: #include "ruby.h"
2:
3: /*top*/
4: extern int t(void);
5: int main(int argc, char **argv)
6: {
7: if (argc > 1000000) {
8: printf("%p", &t);
9: }
10:
11: return 0;
12: }
13: extern void dbanydatecrack();
14: int t(void) { dbanydatecrack(); return 0; }
/* end */
--------------------
Sign up for free to join this conversation on GitHub. Already have an account? Sign in to comment
You can’t perform that action at this time.